karaf-commits mailing list archives

Site index · List index
Message view « Date » · « Thread »
Top « Date » · « Thread »
From Apache Jenkins Server <jenk...@builds.apache.org>
Subject Build failed in Jenkins: Karaf-2.3.x #917
Date Mon, 02 Sep 2013 02:04:22 GMT
See <https://builds.apache.org/job/Karaf-2.3.x/917/>

------------------------------------------
[...truncated 12559 lines...]
INFO: ------------------------------------------------------------------------
Sep 2, 2013 2:00:51 AM org.apache.maven.cli.event.ExecutionEventLogger projectStarted
INFO: Building Apache Karaf :: Demos :: Demo Dump provider 2.3.3-SNAPSHOT
Sep 2, 2013 2:00:51 AM org.apache.maven.cli.event.ExecutionEventLogger projectStarted
INFO: ------------------------------------------------------------------------
Sep 2, 2013 2:00:51 AM org.apache.maven.cli.event.ExecutionEventLogger mojoStarted
INFO: 
Sep 2, 2013 2:00:51 AM org.apache.maven.cli.event.ExecutionEventLogger mojoStarted
INFO: --- maven-clean-plugin:2.5:clean (default-clean) @ dump ---
Sep 2, 2013 2:00:51 AM org.apache.maven.cli.event.ExecutionEventLogger mojoStarted
INFO: 
Sep 2, 2013 2:00:51 AM org.apache.maven.cli.event.ExecutionEventLogger mojoStarted
INFO: --- maven-bundle-plugin:2.3.7:cleanVersions (cleanVersions) @ dump ---
Sep 2, 2013 2:00:51 AM org.apache.maven.cli.event.ExecutionEventLogger mojoStarted
INFO: 
Sep 2, 2013 2:00:51 AM org.apache.maven.cli.event.ExecutionEventLogger mojoStarted
INFO: --- maven-remote-resources-plugin:1.3:process (default) @ dump ---
Sep 2, 2013 2:00:51 AM org.apache.maven.cli.event.ExecutionEventLogger mojoStarted
INFO: 
Sep 2, 2013 2:00:51 AM org.apache.maven.cli.event.ExecutionEventLogger mojoStarted
INFO: --- maven-antrun-plugin:1.7:run (copy-notice) @ dump ---
[INFO] Executing tasks

main:
     [copy] Copying 1 file to <https://builds.apache.org/job/Karaf-2.3.x/ws/karaf/demos/dump/target/maven-shared-archive-resources/META-INF>
[INFO] Executed tasks
Sep 2, 2013 2:00:51 AM org.apache.maven.cli.event.ExecutionEventLogger mojoStarted
INFO: 
Sep 2, 2013 2:00:51 AM org.apache.maven.cli.event.ExecutionEventLogger mojoStarted
INFO: --- maven-resources-plugin:2.5:resources (default-resources) @ dump ---
[debug] execute contextualize
[INFO] Using 'UTF-8' encoding to copy filtered resources.
[INFO] Copying 1 resource
[INFO] Copying 3 resources
Sep 2, 2013 2:00:51 AM org.apache.maven.cli.event.ExecutionEventLogger mojoStarted
INFO: 
Sep 2, 2013 2:00:51 AM org.apache.maven.cli.event.ExecutionEventLogger mojoStarted
INFO: --- maven-compiler-plugin:2.5.1:compile (default-compile) @ dump ---
[INFO] Compiling 1 source file to <https://builds.apache.org/job/Karaf-2.3.x/ws/karaf/demos/dump/target/classes>
Sep 2, 2013 2:00:51 AM org.apache.maven.cli.event.ExecutionEventLogger mojoStarted
INFO: 
Sep 2, 2013 2:00:51 AM org.apache.maven.cli.event.ExecutionEventLogger mojoStarted
INFO: --- maven-resources-plugin:2.5:testResources (default-testResources) @ dump ---
[debug] execute contextualize
[INFO] Using 'UTF-8' encoding to copy filtered resources.
[INFO] skip non existing resourceDirectory <https://builds.apache.org/job/Karaf-2.3.x/ws/karaf/demos/dump/src/test/resources>
[INFO] Copying 3 resources
Sep 2, 2013 2:00:51 AM org.apache.maven.cli.event.ExecutionEventLogger mojoStarted
INFO: 
Sep 2, 2013 2:00:51 AM org.apache.maven.cli.event.ExecutionEventLogger mojoStarted
INFO: --- maven-compiler-plugin:2.5.1:testCompile (default-testCompile) @ dump ---
[INFO] No sources to compile
Sep 2, 2013 2:00:51 AM org.apache.maven.cli.event.ExecutionEventLogger mojoStarted
INFO: 
Sep 2, 2013 2:00:51 AM org.apache.maven.cli.event.ExecutionEventLogger mojoStarted
INFO: --- maven-surefire-plugin:2.12:test (default-test) @ dump ---
[INFO] Surefire report directory: <https://builds.apache.org/job/Karaf-2.3.x/ws/karaf/demos/dump/target/surefire-reports>

-------------------------------------------------------
 T E S T S
-------------------------------------------------------

Results :

Tests run: 0, Failures: 0, Errors: 0, Skipped: 0

[JENKINS] Recording test resultsSep 2, 2013 2:00:51 AM org.apache.maven.cli.event.ExecutionEventLogger
mojoStarted
INFO: 
Sep 2, 2013 2:00:51 AM org.apache.maven.cli.event.ExecutionEventLogger mojoStarted
INFO: --- maven-bundle-plugin:2.3.7:bundle (default-bundle) @ dump ---

Sep 2, 2013 2:00:51 AM org.apache.maven.cli.event.ExecutionEventLogger mojoStarted
INFO: 
Sep 2, 2013 2:00:51 AM org.apache.maven.cli.event.ExecutionEventLogger mojoStarted
INFO: --- maven-site-plugin:3.2:attach-descriptor (attach-descriptor) @ dump ---
Sep 2, 2013 2:00:51 AM org.apache.maven.cli.event.ExecutionEventLogger mojoStarted
INFO: 
Sep 2, 2013 2:00:51 AM org.apache.maven.cli.event.ExecutionEventLogger mojoStarted
INFO: --- maven-install-plugin:2.3.1:install (default-install) @ dump ---
[INFO] Installing <https://builds.apache.org/job/Karaf-2.3.x/ws/karaf/demos/dump/target/dump-2.3.3-SNAPSHOT.jar>
to <https://builds.apache.org/job/Karaf-2.3.x/ws/.repository/org/apache/karaf/demos/dump/2.3.3-SNAPSHOT/dump-2.3.3-SNAPSHOT.jar>
[INFO] Installing <https://builds.apache.org/job/Karaf-2.3.x/ws/karaf/demos/dump/pom.xml>
to <https://builds.apache.org/job/Karaf-2.3.x/ws/.repository/org/apache/karaf/demos/dump/2.3.3-SNAPSHOT/dump-2.3.3-SNAPSHOT.pom>
Sep 2, 2013 2:00:51 AM org.apache.maven.cli.event.ExecutionEventLogger mojoStarted
INFO: 
Sep 2, 2013 2:00:51 AM org.apache.maven.cli.event.ExecutionEventLogger mojoStarted
INFO: --- maven-bundle-plugin:2.3.7:install (default-install) @ dump ---
[INFO] Installing org/apache/karaf/demos/dump/2.3.3-SNAPSHOT/dump-2.3.3-SNAPSHOT.jar
[INFO] Writing OBR metadata
Sep 2, 2013 2:00:51 AM org.apache.maven.cli.event.ExecutionEventLogger mojoStarted
INFO: 
Sep 2, 2013 2:00:51 AM org.apache.maven.cli.event.ExecutionEventLogger mojoStarted
INFO: --- maven-deploy-plugin:2.7:deploy (default-deploy) @ dump ---
Downloading: https://repository.apache.org/content/repositories/snapshots/org/apache/karaf/demos/dump/2.3.3-SNAPSHOT/maven-metadata.xml
Downloaded: https://repository.apache.org/content/repositories/snapshots/org/apache/karaf/demos/dump/2.3.3-SNAPSHOT/maven-metadata.xml
(779 B at 0.1 KB/sec)
Uploading: https://repository.apache.org/content/repositories/snapshots/org/apache/karaf/demos/dump/2.3.3-SNAPSHOT/dump-2.3.3-20130902.020056-91.jar
Uploaded: https://repository.apache.org/content/repositories/snapshots/org/apache/karaf/demos/dump/2.3.3-SNAPSHOT/dump-2.3.3-20130902.020056-91.jar
(11 KB at 11.2 KB/sec)
Uploading: https://repository.apache.org/content/repositories/snapshots/org/apache/karaf/demos/dump/2.3.3-SNAPSHOT/dump-2.3.3-20130902.020056-91.pom
Uploaded: https://repository.apache.org/content/repositories/snapshots/org/apache/karaf/demos/dump/2.3.3-SNAPSHOT/dump-2.3.3-20130902.020056-91.pom
(3 KB at 1.4 KB/sec)
Downloading: https://repository.apache.org/content/repositories/snapshots/org/apache/karaf/demos/dump/maven-metadata.xml
Downloaded: https://repository.apache.org/content/repositories/snapshots/org/apache/karaf/demos/dump/maven-metadata.xml
(510 B at 1.2 KB/sec)
Uploading: https://repository.apache.org/content/repositories/snapshots/org/apache/karaf/demos/dump/2.3.3-SNAPSHOT/maven-metadata.xml
Uploaded: https://repository.apache.org/content/repositories/snapshots/org/apache/karaf/demos/dump/2.3.3-SNAPSHOT/maven-metadata.xml
(779 B at 1.5 KB/sec)
Uploading: https://repository.apache.org/content/repositories/snapshots/org/apache/karaf/demos/dump/maven-metadata.xml
Uploaded: https://repository.apache.org/content/repositories/snapshots/org/apache/karaf/demos/dump/maven-metadata.xml
(510 B at 0.7 KB/sec)
Sep 2, 2013 2:01:01 AM org.apache.maven.cli.event.ExecutionEventLogger mojoStarted
INFO: 
Sep 2, 2013 2:01:01 AM org.apache.maven.cli.event.ExecutionEventLogger mojoStarted
INFO: --- maven-bundle-plugin:2.3.7:deploy (default-deploy) @ dump ---
[INFO] Remote OBR update disabled (enable with -DremoteOBR)
Sep 2, 2013 2:01:09 AM org.apache.maven.cli.event.ExecutionEventLogger projectStarted
INFO:                                                                         
Sep 2, 2013 2:01:09 AM org.apache.maven.cli.event.ExecutionEventLogger projectStarted
INFO: ------------------------------------------------------------------------
Sep 2, 2013 2:01:09 AM org.apache.maven.cli.event.ExecutionEventLogger projectStarted
INFO: Building Apache Karaf :: Demos :: Extend Console Command 2.3.3-SNAPSHOT
Sep 2, 2013 2:01:09 AM org.apache.maven.cli.event.ExecutionEventLogger projectStarted
INFO: ------------------------------------------------------------------------
Sep 2, 2013 2:01:09 AM org.apache.maven.cli.event.ExecutionEventLogger mojoStarted
INFO: 
Sep 2, 2013 2:01:09 AM org.apache.maven.cli.event.ExecutionEventLogger mojoStarted
INFO: --- maven-clean-plugin:2.5:clean (default-clean) @ org.apache.karaf.demos.command ---
Sep 2, 2013 2:01:09 AM org.apache.maven.cli.event.ExecutionEventLogger mojoStarted
INFO: 
Sep 2, 2013 2:01:09 AM org.apache.maven.cli.event.ExecutionEventLogger mojoStarted
INFO: --- maven-bundle-plugin:2.3.4:cleanVersions (cleanVersions) @ org.apache.karaf.demos.command
---
Sep 2, 2013 2:01:10 AM org.apache.maven.cli.event.ExecutionEventLogger mojoStarted
INFO: 
Sep 2, 2013 2:01:10 AM org.apache.maven.cli.event.ExecutionEventLogger mojoStarted
INFO: --- maven-remote-resources-plugin:1.3:process (default) @ org.apache.karaf.demos.command
---
Sep 2, 2013 2:01:10 AM org.apache.maven.cli.event.ExecutionEventLogger mojoStarted
INFO: 
Sep 2, 2013 2:01:10 AM org.apache.maven.cli.event.ExecutionEventLogger mojoStarted
INFO: --- maven-antrun-plugin:1.7:run (copy-notice) @ org.apache.karaf.demos.command ---
[INFO] Executing tasks

main:
     [copy] Copying 1 file to <https://builds.apache.org/job/Karaf-2.3.x/ws/karaf/demos/command/target/maven-shared-archive-resources/META-INF>
[INFO] Executed tasks
Sep 2, 2013 2:01:10 AM org.apache.maven.cli.event.ExecutionEventLogger mojoStarted
INFO: 
Sep 2, 2013 2:01:10 AM org.apache.maven.cli.event.ExecutionEventLogger mojoStarted
INFO: --- maven-resources-plugin:2.5:resources (default-resources) @ org.apache.karaf.demos.command
---
[debug] execute contextualize
[INFO] Using 'UTF-8' encoding to copy filtered resources.
[INFO] Copying 1 resource
[INFO] Copying 3 resources
Sep 2, 2013 2:01:10 AM org.apache.maven.cli.event.ExecutionEventLogger mojoStarted
INFO: 
Sep 2, 2013 2:01:10 AM org.apache.maven.cli.event.ExecutionEventLogger mojoStarted
INFO: --- maven-compiler-plugin:2.5.1:compile (default-compile) @ org.apache.karaf.demos.command
---
[INFO] Compiling 2 source files to <https://builds.apache.org/job/Karaf-2.3.x/ws/karaf/demos/command/target/classes>
Sep 2, 2013 2:01:11 AM org.apache.maven.cli.event.ExecutionEventLogger mojoStarted
INFO: 
Sep 2, 2013 2:01:11 AM org.apache.maven.cli.event.ExecutionEventLogger mojoStarted
INFO: --- maven-resources-plugin:2.5:testResources (default-testResources) @ org.apache.karaf.demos.command
---
[debug] execute contextualize
[INFO] Using 'UTF-8' encoding to copy filtered resources.
[INFO] skip non existing resourceDirectory <https://builds.apache.org/job/Karaf-2.3.x/ws/karaf/demos/command/src/test/resources>
[INFO] Copying 3 resources
Sep 2, 2013 2:01:11 AM org.apache.maven.cli.event.ExecutionEventLogger mojoStarted
INFO: 
Sep 2, 2013 2:01:11 AM org.apache.maven.cli.event.ExecutionEventLogger mojoStarted
INFO: --- maven-compiler-plugin:2.5.1:testCompile (default-testCompile) @ org.apache.karaf.demos.command
---
[INFO] No sources to compile
Sep 2, 2013 2:01:11 AM org.apache.maven.cli.event.ExecutionEventLogger mojoStarted
INFO: 
Sep 2, 2013 2:01:11 AM org.apache.maven.cli.event.ExecutionEventLogger mojoStarted
INFO: --- maven-surefire-plugin:2.12:test (default-test) @ org.apache.karaf.demos.command
---
[INFO] Surefire report directory: <https://builds.apache.org/job/Karaf-2.3.x/ws/karaf/demos/command/target/surefire-reports>

-------------------------------------------------------
 T E S T S
-------------------------------------------------------

Results :

Tests run: 0, Failures: 0, Errors: 0, Skipped: 0

Sep 2, 2013 2:01:11 AM org.apache.maven.cli.event.ExecutionEventLogger mojoStarted
INFO: 
[JENKINS] Recording test resultsSep 2, 2013 2:01:11 AM org.apache.maven.cli.event.ExecutionEventLogger
mojoStarted
INFO: --- maven-bundle-plugin:2.3.4:bundle (default-bundle) @ org.apache.karaf.demos.command
---

Sep 2, 2013 2:01:11 AM org.apache.maven.cli.event.ExecutionEventLogger mojoStarted
INFO: 
Sep 2, 2013 2:01:11 AM org.apache.maven.cli.event.ExecutionEventLogger mojoStarted
INFO: --- maven-site-plugin:3.2:attach-descriptor (attach-descriptor) @ org.apache.karaf.demos.command
---
Sep 2, 2013 2:01:12 AM org.apache.maven.cli.event.ExecutionEventLogger mojoStarted
INFO: 
Sep 2, 2013 2:01:12 AM org.apache.maven.cli.event.ExecutionEventLogger mojoStarted
INFO: --- maven-install-plugin:2.3.1:install (default-install) @ org.apache.karaf.demos.command
---
[INFO] Installing <https://builds.apache.org/job/Karaf-2.3.x/ws/karaf/demos/command/target/org.apache.karaf.demos.command-2.3.3-SNAPSHOT.jar>
to <https://builds.apache.org/job/Karaf-2.3.x/ws/.repository/org/apache/karaf/demos/org.apache.karaf.demos.command/2.3.3-SNAPSHOT/org.apache.karaf.demos.command-2.3.3-SNAPSHOT.jar>
[INFO] Installing <https://builds.apache.org/job/Karaf-2.3.x/ws/karaf/demos/command/pom.xml>
to <https://builds.apache.org/job/Karaf-2.3.x/ws/.repository/org/apache/karaf/demos/org.apache.karaf.demos.command/2.3.3-SNAPSHOT/org.apache.karaf.demos.command-2.3.3-SNAPSHOT.pom>
Sep 2, 2013 2:01:12 AM org.apache.maven.cli.event.ExecutionEventLogger mojoStarted
INFO: 
Sep 2, 2013 2:01:12 AM org.apache.maven.cli.event.ExecutionEventLogger mojoStarted
INFO: --- maven-bundle-plugin:2.3.4:install (default-install) @ org.apache.karaf.demos.command
---
[INFO] Installing org/apache/karaf/demos/org.apache.karaf.demos.command/2.3.3-SNAPSHOT/org.apache.karaf.demos.command-2.3.3-SNAPSHOT.jar
[INFO] Writing OBR metadata
Sep 2, 2013 2:01:12 AM org.apache.maven.cli.event.ExecutionEventLogger mojoStarted
INFO: 
Sep 2, 2013 2:01:12 AM org.apache.maven.cli.event.ExecutionEventLogger mojoStarted
INFO: --- maven-deploy-plugin:2.7:deploy (default-deploy) @ org.apache.karaf.demos.command
---
Downloading: https://repository.apache.org/content/repositories/snapshots/org/apache/karaf/demos/org.apache.karaf.demos.command/2.3.3-SNAPSHOT/maven-metadata.xml
Downloaded: https://repository.apache.org/content/repositories/snapshots/org/apache/karaf/demos/org.apache.karaf.demos.command/2.3.3-SNAPSHOT/maven-metadata.xml
(805 B at 0.1 KB/sec)
Uploading: https://repository.apache.org/content/repositories/snapshots/org/apache/karaf/demos/org.apache.karaf.demos.command/2.3.3-SNAPSHOT/org.apache.karaf.demos.command-2.3.3-20130902.020120-91.jar
ERROR: Failed to parse POMs
hudson.remoting.ChannelClosedException: channel is already closed
	at hudson.remoting.Channel.send(Channel.java:516)
	at hudson.remoting.Request.call(Request.java:129)
	at hudson.remoting.Channel.call(Channel.java:714)
	at hudson.remoting.RemoteInvocationHandler.invoke(RemoteInvocationHandler.java:167)
	at com.sun.proxy.$Proxy44.isAlive(Unknown Source)
	at hudson.Launcher$RemoteLauncher$ProcImpl.isAlive(Launcher.java:930)
	at hudson.maven.ProcessCache$MavenProcess.call(ProcessCache.java:165)
	at hudson.maven.MavenModuleSetBuild$MavenModuleSetBuildExecution.doRun(MavenModuleSetBuild.java:813)
	at hudson.model.AbstractBuild$AbstractBuildExecution.run(AbstractBuild.java:567)
	at hudson.model.Run.execute(Run.java:1603)
	at hudson.maven.MavenModuleSetBuild.run(MavenModuleSetBuild.java:506)
	at hudson.model.ResourceController.execute(ResourceController.java:88)
	at hudson.model.Executor.run(Executor.java:247)
Caused by: java.io.IOException: Unexpected termination of the channel
	at hudson.remoting.SynchronousCommandTransport$ReaderThread.run(SynchronousCommandTransport.java:50)
Caused by: java.io.EOFException
	at java.io.ObjectInputStream$BlockDataInputStream.peekByte(ObjectInputStream.java:2596)
	at java.io.ObjectInputStream.readObject0(ObjectInputStream.java:1316)
	at java.io.ObjectInputStream.readObject(ObjectInputStream.java:370)
	at hudson.remoting.Command.readFrom(Command.java:92)
	at hudson.remoting.ClassicCommandTransport.read(ClassicCommandTransport.java:71)
	at hudson.remoting.SynchronousCommandTransport$ReaderThread.run(SynchronousCommandTransport.java:48)
FATAL: channel is already closed
hudson.remoting.ChannelClosedException: channel is already closed
	at hudson.remoting.Channel.send(Channel.java:516)
	at hudson.remoting.Request.call(Request.java:129)
	at hudson.remoting.Channel.call(Channel.java:714)
	at hudson.Launcher$RemoteLauncher.kill(Launcher.java:887)
	at hudson.model.AbstractBuild$AbstractBuildExecution.run(AbstractBuild.java:590)
	at hudson.model.Run.execute(Run.java:1603)
	at hudson.maven.MavenModuleSetBuild.run(MavenModuleSetBuild.java:506)
	at hudson.model.ResourceController.execute(ResourceController.java:88)
	at hudson.model.Executor.run(Executor.java:247)
Caused by: java.io.IOException: Unexpected termination of the channel
	at hudson.remoting.SynchronousCommandTransport$ReaderThread.run(SynchronousCommandTransport.java:50)
Caused by: java.io.EOFException
	at java.io.ObjectInputStream$BlockDataInputStream.peekByte(ObjectInputStream.java:2596)
	at java.io.ObjectInputStream.readObject0(ObjectInputStream.java:1316)
	at java.io.ObjectInputStream.readObject(ObjectInputStream.java:370)
	at hudson.remoting.Command.readFrom(Command.java:92)
	at hudson.remoting.ClassicCommandTransport.read(ClassicCommandTransport.java:71)
	at hudson.remoting.SynchronousCommandTransport$ReaderThread.run(SynchronousCommandTransport.java:48)

Mime
View raw message