karaf-commits mailing list archives

Site index · List index
Message view « Date » · « Thread »
Top « Date » · « Thread »
From Apache Jenkins Server <jenk...@builds.apache.org>
Subject Build failed in Jenkins: Karaf-2.2.x » Apache Karaf :: Util #1132
Date Sun, 25 Aug 2013 03:03:00 GMT
See <https://builds.apache.org/job/Karaf-2.2.x/org.apache.karaf$org.apache.karaf.util/1132/>

------------------------------------------
[INFO] ------------------------------------------------------------------------
[INFO] Building Apache Karaf :: Util
[INFO]    task-segment: [clean, install, deploy]
[INFO] ------------------------------------------------------------------------
[INFO] [clean:clean {execution: default-clean}]
Downloading: http://repo1.maven.org/maven2/org/apache/maven/plugins/maven-surefire-plugin/2.12/maven-surefire-plugin-2.12.pom
9K downloaded  (maven-surefire-plugin-2.12.pom)
Downloading: http://repo1.maven.org/maven2/org/apache/maven/surefire/surefire/2.12/surefire-2.12.pom
10K downloaded  (surefire-2.12.pom)
Downloading: http://repo1.maven.org/maven2/org/apache/maven/plugins/maven-surefire-plugin/2.12/maven-surefire-plugin-2.12.jar
30K downloaded  (maven-surefire-plugin-2.12.jar)
Downloading: http://repo1.maven.org/maven2/org/apache/maven/plugins/maven-jar-plugin/2.4/maven-jar-plugin-2.4.pom
5K downloaded  (maven-jar-plugin-2.4.pom)
Downloading: http://repo1.maven.org/maven2/org/apache/maven/plugins/maven-jar-plugin/2.4/maven-jar-plugin-2.4.jar
33K downloaded  (maven-jar-plugin-2.4.jar)
[INFO] [bundle:cleanVersions {execution: cleanVersions}]
[WARNING] The parameter expression: 'project.build.resources' used in mojo: 'process' has
been deprecated. Use 'project.resources' instead.
[INFO] [remote-resources:process {execution: default}]
[INFO] [antrun:run {execution: copy-notice}]
[INFO] Executing tasks

main:
     [copy] Copying 1 file to <https://builds.apache.org/job/Karaf-2.2.x/org.apache.karaf$org.apache.karaf.util/ws/target/maven-shared-archive-resources/META-INF>
[INFO] Executed tasks
[debug] execute contextualize
[INFO] [resources:resources {execution: default-resources}]
[INFO] Using 'UTF-8' encoding to copy filtered resources.
[INFO] skip non existing resourceDirectory <https://builds.apache.org/job/Karaf-2.2.x/org.apache.karaf$org.apache.karaf.util/ws/src/main/resources>
[INFO] Copying 3 resources
Downloading: http://repo1.maven.org/maven2/org/apache/maven/maven-plugin-api/2.0.9/maven-plugin-api-2.0.9.pom
1K downloaded  (maven-plugin-api-2.0.9.pom)
Downloading: http://repo1.maven.org/maven2/org/apache/maven/maven/2.0.9/maven-2.0.9.pom
18K downloaded  (maven-2.0.9.pom)
Downloading: http://repo1.maven.org/maven2/org/apache/maven/maven-artifact/2.0.9/maven-artifact-2.0.9.pom
1K downloaded  (maven-artifact-2.0.9.pom)
Downloading: http://svn.apache.org/repos/asf/servicemix/m2-repo/org/codehaus/plexus/plexus-utils/1.5.1/plexus-utils-1.5.1.pom
[INFO] Unable to find resource 'org.codehaus.plexus:plexus-utils:pom:1.5.1' in repository
servicemix (http://svn.apache.org/repos/asf/servicemix/m2-repo)
Downloading: http://repo1.maven.org/maven2/org/codehaus/plexus/plexus-utils/1.5.1/plexus-utils-1.5.1.pom
2K downloaded  (plexus-utils-1.5.1.pom)
Downloading: http://repo1.maven.org/maven2/org/apache/maven/maven-core/2.0.9/maven-core-2.0.9.pom
7K downloaded  (maven-core-2.0.9.pom)
Downloading: http://svn.apache.org/repos/asf/servicemix/m2-repo/org/apache/maven/maven-settings/2.0.9/maven-settings-2.0.9.pom
[INFO] Unable to find resource 'org.apache.maven:maven-settings:pom:2.0.9' in repository servicemix
(http://svn.apache.org/repos/asf/servicemix/m2-repo)
Downloading: http://repo1.maven.org/maven2/org/apache/maven/maven-settings/2.0.9/maven-settings-2.0.9.pom
2K downloaded  (maven-settings-2.0.9.pom)
Downloading: http://svn.apache.org/repos/asf/servicemix/m2-repo/org/apache/maven/maven-model/2.0.9/maven-model-2.0.9.pom
[INFO] Unable to find resource 'org.apache.maven:maven-model:pom:2.0.9' in repository servicemix
(http://svn.apache.org/repos/asf/servicemix/m2-repo)
Downloading: http://repo1.maven.org/maven2/org/apache/maven/maven-model/2.0.9/maven-model-2.0.9.pom
3K downloaded  (maven-model-2.0.9.pom)
Downloading: http://svn.apache.org/repos/asf/servicemix/m2-repo/org/apache/maven/maven-plugin-parameter-documenter/2.0.9/maven-plugin-parameter-documenter-2.0.9.pom
[INFO] Unable to find resource 'org.apache.maven:maven-plugin-parameter-documenter:pom:2.0.9'
in repository servicemix (http://svn.apache.org/repos/asf/servicemix/m2-repo)
Downloading: http://repo1.maven.org/maven2/org/apache/maven/maven-plugin-parameter-documenter/2.0.9/maven-plugin-parameter-documenter-2.0.9.pom
1K downloaded  (maven-plugin-parameter-documenter-2.0.9.pom)
Downloading: http://svn.apache.org/repos/asf/servicemix/m2-repo/org/apache/maven/wagon/wagon-webdav/1.0-beta-2/wagon-webdav-1.0-beta-2.pom
[INFO] Unable to find resource 'org.apache.maven.wagon:wagon-webdav:pom:1.0-beta-2' in repository
servicemix (http://svn.apache.org/repos/asf/servicemix/m2-repo)
Downloading: http://repo1.maven.org/maven2/org/apache/maven/wagon/wagon-webdav/1.0-beta-2/wagon-webdav-1.0-beta-2.pom
1K downloaded  (wagon-webdav-1.0-beta-2.pom)
Downloading: http://svn.apache.org/repos/asf/servicemix/m2-repo/slide/slide-webdavlib/2.1/slide-webdavlib-2.1.pom
[INFO] Unable to find resource 'slide:slide-webdavlib:pom:2.1' in repository servicemix (http://svn.apache.org/repos/asf/servicemix/m2-repo)
Downloading: http://repo1.maven.org/maven2/slide/slide-webdavlib/2.1/slide-webdavlib-2.1.pom
648b downloaded  (slide-webdavlib-2.1.pom)
Downloading: http://svn.apache.org/repos/asf/servicemix/m2-repo/commons-httpclient/commons-httpclient/2.0.2/commons-httpclient-2.0.2.pom
[INFO] Unable to find resource 'commons-httpclient:commons-httpclient:pom:2.0.2' in repository
servicemix (http://svn.apache.org/repos/asf/servicemix/m2-repo)
Downloading: http://repo1.maven.org/maven2/commons-httpclient/commons-httpclient/2.0.2/commons-httpclient-2.0.2.pom
6K downloaded  (commons-httpclient-2.0.2.pom)
Downloading: http://svn.apache.org/repos/asf/servicemix/m2-repo/de/zeigermann/xml/xml-im-exporter/1.1/xml-im-exporter-1.1.pom
[INFO] Unable to find resource 'de.zeigermann.xml:xml-im-exporter:pom:1.1' in repository servicemix
(http://svn.apache.org/repos/asf/servicemix/m2-repo)
Downloading: http://repo1.maven.org/maven2/de/zeigermann/xml/xml-im-exporter/1.1/xml-im-exporter-1.1.pom
248b downloaded  (xml-im-exporter-1.1.pom)
Downloading: http://svn.apache.org/repos/asf/servicemix/m2-repo/org/apache/maven/maven-profile/2.0.9/maven-profile-2.0.9.pom
[INFO] Unable to find resource 'org.apache.maven:maven-profile:pom:2.0.9' in repository servicemix
(http://svn.apache.org/repos/asf/servicemix/m2-repo)
Downloading: http://repo1.maven.org/maven2/org/apache/maven/maven-profile/2.0.9/maven-profile-2.0.9.pom
2K downloaded  (maven-profile-2.0.9.pom)
Downloading: http://svn.apache.org/repos/asf/servicemix/m2-repo/org/apache/maven/maven-repository-metadata/2.0.9/maven-repository-metadata-2.0.9.pom
[INFO] Unable to find resource 'org.apache.maven:maven-repository-metadata:pom:2.0.9' in repository
servicemix (http://svn.apache.org/repos/asf/servicemix/m2-repo)
Downloading: http://repo1.maven.org/maven2/org/apache/maven/maven-repository-metadata/2.0.9/maven-repository-metadata-2.0.9.pom
1K downloaded  (maven-repository-metadata-2.0.9.pom)
Downloading: http://svn.apache.org/repos/asf/servicemix/m2-repo/org/apache/maven/maven-error-diagnostics/2.0.9/maven-error-diagnostics-2.0.9.pom
[INFO] Unable to find resource 'org.apache.maven:maven-error-diagnostics:pom:2.0.9' in repository
servicemix (http://svn.apache.org/repos/asf/servicemix/m2-repo)
Downloading: http://repo1.maven.org/maven2/org/apache/maven/maven-error-diagnostics/2.0.9/maven-error-diagnostics-2.0.9.pom
1K downloaded  (maven-error-diagnostics-2.0.9.pom)
Downloading: http://svn.apache.org/repos/asf/servicemix/m2-repo/org/apache/maven/maven-project/2.0.9/maven-project-2.0.9.pom
[INFO] Unable to find resource 'org.apache.maven:maven-project:pom:2.0.9' in repository servicemix
(http://svn.apache.org/repos/asf/servicemix/m2-repo)
Downloading: http://repo1.maven.org/maven2/org/apache/maven/maven-project/2.0.9/maven-project-2.0.9.pom
2K downloaded  (maven-project-2.0.9.pom)
Downloading: http://svn.apache.org/repos/asf/servicemix/m2-repo/org/apache/maven/maven-artifact-manager/2.0.9/maven-artifact-manager-2.0.9.pom
[INFO] Unable to find resource 'org.apache.maven:maven-artifact-manager:pom:2.0.9' in repository
servicemix (http://svn.apache.org/repos/asf/servicemix/m2-repo)
Downloading: http://repo1.maven.org/maven2/org/apache/maven/maven-artifact-manager/2.0.9/maven-artifact-manager-2.0.9.pom
2K downloaded  (maven-artifact-manager-2.0.9.pom)
Downloading: http://svn.apache.org/repos/asf/servicemix/m2-repo/org/apache/maven/maven-plugin-registry/2.0.9/maven-plugin-registry-2.0.9.pom
[INFO] Unable to find resource 'org.apache.maven:maven-plugin-registry:pom:2.0.9' in repository
servicemix (http://svn.apache.org/repos/asf/servicemix/m2-repo)
Downloading: http://repo1.maven.org/maven2/org/apache/maven/maven-plugin-registry/2.0.9/maven-plugin-registry-2.0.9.pom
1K downloaded  (maven-plugin-registry-2.0.9.pom)
Downloading: http://svn.apache.org/repos/asf/servicemix/m2-repo/org/apache/maven/maven-plugin-descriptor/2.0.9/maven-plugin-descriptor-2.0.9.pom
[INFO] Unable to find resource 'org.apache.maven:maven-plugin-descriptor:pom:2.0.9' in repository
servicemix (http://svn.apache.org/repos/asf/servicemix/m2-repo)
Downloading: http://repo1.maven.org/maven2/org/apache/maven/maven-plugin-descriptor/2.0.9/maven-plugin-descriptor-2.0.9.pom
2K downloaded  (maven-plugin-descriptor-2.0.9.pom)
Downloading: http://svn.apache.org/repos/asf/servicemix/m2-repo/org/apache/maven/maven-monitor/2.0.9/maven-monitor-2.0.9.pom
[INFO] Unable to find resource 'org.apache.maven:maven-monitor:pom:2.0.9' in repository servicemix
(http://svn.apache.org/repos/asf/servicemix/m2-repo)
Downloading: http://repo1.maven.org/maven2/org/apache/maven/maven-monitor/2.0.9/maven-monitor-2.0.9.pom
1K downloaded  (maven-monitor-2.0.9.pom)
Downloading: http://repo1.maven.org/maven2/org/apache/maven/maven-toolchain/1.0/maven-toolchain-1.0.pom
3K downloaded  (maven-toolchain-1.0.pom)
Downloading: http://repo1.maven.org/maven2/org/codehaus/plexus/plexus-compiler-api/1.9.1/plexus-compiler-api-1.9.1.pom
867b downloaded  (plexus-compiler-api-1.9.1.pom)
Downloading: http://repo1.maven.org/maven2/org/codehaus/plexus/plexus-compiler/1.9.1/plexus-compiler-1.9.1.pom
3K downloaded  (plexus-compiler-1.9.1.pom)
Downloading: http://repo1.maven.org/maven2/org/codehaus/plexus/plexus-components/1.1.20/plexus-components-1.1.20.pom
2K downloaded  (plexus-components-1.1.20.pom)
Downloading: http://repo1.maven.org/maven2/org/codehaus/plexus/plexus/3.1/plexus-3.1.pom
18K downloaded  (plexus-3.1.pom)
Downloading: http://repo1.maven.org/maven2/org/codehaus/plexus/plexus-compiler-manager/1.9.1/plexus-compiler-manager-1.9.1.pom
692b downloaded  (plexus-compiler-manager-1.9.1.pom)
Downloading: http://repo1.maven.org/maven2/org/codehaus/plexus/plexus-compiler-javac/1.9.1/plexus-compiler-javac-1.9.1.pom
688b downloaded  (plexus-compiler-javac-1.9.1.pom)
Downloading: http://repo1.maven.org/maven2/org/codehaus/plexus/plexus-compilers/1.9.1/plexus-compilers-1.9.1.pom
1K downloaded  (plexus-compilers-1.9.1.pom)
Downloading: http://repo1.maven.org/maven2/org/codehaus/plexus/plexus-compiler-api/1.9.1/plexus-compiler-api-1.9.1.jar
20K downloaded  (plexus-compiler-api-1.9.1.jar)
Downloading: http://repo1.maven.org/maven2/org/codehaus/plexus/plexus-compiler-manager/1.9.1/plexus-compiler-manager-1.9.1.jar
4K downloaded  (plexus-compiler-manager-1.9.1.jar)
Downloading: http://repo1.maven.org/maven2/org/codehaus/plexus/plexus-compiler-javac/1.9.1/plexus-compiler-javac-1.9.1.jar
13K downloaded  (plexus-compiler-javac-1.9.1.jar)
[INFO] [compiler:compile {execution: default-compile}]
[INFO] Compiling 6 source files to <https://builds.apache.org/job/Karaf-2.2.x/org.apache.karaf$org.apache.karaf.util/ws/target/classes>
[JENKINS] Archiving <https://builds.apache.org/job/Karaf-2.2.x/org.apache.karaf$org.apache.karaf.util/ws/pom.xml>
to /home/hudson/hudson/jobs/Karaf-2.2.x/modules/org.apache.karaf$org.apache.karaf.util/builds/2013-08-25_02-51-28/archive/org.apache.karaf/org.apache.karaf.util/2.2.12-SNAPSHOT/org.apache.karaf.util-2.2.12-SNAPSHOT.pom
[INFO] ------------------------------------------------------------------------
[ERROR] BUILD ERROR
[INFO] ------------------------------------------------------------------------
[INFO] Fatal error compiling

Embedded error: tools.jar not found: /usr/lib/jvm/java-6-openjdk-amd64/jre/../lib/tools.jar
[INFO] ------------------------------------------------------------------------
[INFO] Trace
org.apache.maven.lifecycle.LifecycleExecutionException: Fatal error compiling
	at org.apache.maven.lifecycle.DefaultLifecycleExecutor.executeGoals(DefaultLifecycleExecutor.java:719)
	at org.apache.maven.lifecycle.DefaultLifecycleExecutor.executeGoalWithLifecycle(DefaultLifecycleExecutor.java:556)
	at org.apache.maven.lifecycle.DefaultLifecycleExecutor.executeGoal(DefaultLifecycleExecutor.java:535)
	at org.apache.maven.lifecycle.DefaultLifecycleExecutor.executeGoalAndHandleFailures(DefaultLifecycleExecutor.java:387)
	at org.apache.maven.lifecycle.DefaultLifecycleExecutor.executeTaskSegments(DefaultLifecycleExecutor.java:348)
	at org.apache.maven.lifecycle.DefaultLifecycleExecutor.execute(DefaultLifecycleExecutor.java:180)
	at org.apache.maven.lifecycle.LifecycleExecutorInterceptor.execute(LifecycleExecutorInterceptor.java:65)
	at org.apache.maven.DefaultMaven.doExecute(DefaultMaven.java:328)
	at org.apache.maven.DefaultMaven.execute(DefaultMaven.java:138)
	at org.apache.maven.cli.MavenCli.main(MavenCli.java:362)
	at sun.reflect.NativeMethodAccessorImpl.invoke0(Native Method)
	at sun.reflect.NativeMethodAccessorImpl.invoke(NativeMethodAccessorImpl.java:57)
	at sun.reflect.DelegatingMethodAccessorImpl.invoke(DelegatingMethodAccessorImpl.java:43)
	at java.lang.reflect.Method.invoke(Method.java:616)
	at org.codehaus.classworlds.Launcher.launchEnhanced(Launcher.java:315)
	at org.codehaus.classworlds.Launcher.launch(Launcher.java:255)
	at hudson.maven.agent.Main.launch(Main.java:204)
	at hudson.maven.MavenBuilder.call(MavenBuilder.java:154)
	at hudson.maven.Maven2Builder.call(Maven2Builder.java:79)
	at hudson.maven.Maven2Builder.call(Maven2Builder.java:55)
	at hudson.remoting.UserRequest.perform(UserRequest.java:118)
	at hudson.remoting.UserRequest.perform(UserRequest.java:48)
	at hudson.remoting.Request$2.run(Request.java:326)
	at hudson.remoting.InterceptingExecutorService$1.call(InterceptingExecutorService.java:72)
	at java.util.concurrent.FutureTask$Sync.innerRun(FutureTask.java:334)
	at java.util.concurrent.FutureTask.run(FutureTask.java:166)
	at java.util.concurrent.ThreadPoolExecutor.runWorker(ThreadPoolExecutor.java:1146)
	at java.util.concurrent.ThreadPoolExecutor$Worker.run(ThreadPoolExecutor.java:615)
	at java.lang.Thread.run(Thread.java:679)
Caused by: org.apache.maven.plugin.MojoExecutionException: Fatal error compiling
	at org.apache.maven.plugin.AbstractCompilerMojo.execute(AbstractCompilerMojo.java:683)
	at org.apache.maven.plugin.CompilerMojo.execute(CompilerMojo.java:128)
	at org.apache.maven.plugin.DefaultPluginManager.executeMojo(DefaultPluginManager.java:490)
	at hudson.maven.agent.PluginManagerInterceptor.executeMojo(PluginManagerInterceptor.java:182)
	at org.apache.maven.lifecycle.DefaultLifecycleExecutor.executeGoals(DefaultLifecycleExecutor.java:694)
	... 28 more
Caused by: org.codehaus.plexus.compiler.CompilerException: tools.jar not found: /usr/lib/jvm/java-6-openjdk-amd64/jre/../lib/tools.jar
	at org.codehaus.plexus.compiler.javac.JavacCompiler.createJavacClass(JavacCompiler.java:987)
	at org.codehaus.plexus.compiler.javac.JavacCompiler.getJavacClass(JavacCompiler.java:944)
	at org.codehaus.plexus.compiler.javac.JavacCompiler.compileInProcess(JavacCompiler.java:520)
	at org.codehaus.plexus.compiler.javac.JavacCompiler.compile(JavacCompiler.java:167)
	at org.apache.maven.plugin.AbstractCompilerMojo.execute(AbstractCompilerMojo.java:678)
	... 32 more
[INFO] ------------------------------------------------------------------------
[INFO] Total time: 1 minute 8 seconds
[INFO] Finished at: Sun Aug 25 02:53:11 UTC 2013
[INFO] Final Memory: 85M/583M
[INFO] ------------------------------------------------------------------------

Mime
View raw message