karaf-commits mailing list archives

Site index · List index
Message view « Date » · « Thread »
Top « Date » · « Thread »
From Apache Jenkins Server <jenk...@builds.apache.org>
Subject Build failed in Jenkins: Karaf-2.3.x #765
Date Thu, 06 Jun 2013 04:01:55 GMT
See <https://builds.apache.org/job/Karaf-2.3.x/765/>

------------------------------------------
[...truncated 19865 lines...]
Creating file: <https://builds.apache.org/job/Karaf-2.3.x/ws/karaf/itests/target/exam/486e034e-e4a5-4fc7-8cd6-be2119fba175/instances/itest/bin/start>
Creating file: <https://builds.apache.org/job/Karaf-2.3.x/ws/karaf/itests/target/exam/486e034e-e4a5-4fc7-8cd6-be2119fba175/instances/itest/bin/stop>

admin:list
  SSH Port   RMI Ports         State       Pid  Name
[    8101] [1099/44444     ] [Started ] [16051] root
[    8102] [1100/44445     ] [Stopped ] [    0] itest

admin:destroy itest

admin:list
  SSH Port   RMI Ports         State       Pid  Name
[    8101] [1099/44444     ] [Started ] [16051] root

[org.apache.karaf.tooling.exam.container.internal.KarafTestContainer] : Shutting down the
test container (Pax Runner)
[org.ops4j.pax.exam.junit.JUnit4TestRunner] : Invoke createDestroyViaMBean:org.apache.karaf.itests.AdminTest.createDestroyViaMBean:KarafTestContainer{mvn:org.apache.karaf/apache-karaf/2.3.2-SNAPSHOT/tar.gz}
@ [TestAddress:PaxExam-9a9b1456-1537-4162-9342-63c7a288b461 root:PaxExam-b8ea432c-fd60-4791-8236-157a0161237e]
Arguments: [Ljava.lang.Object;@2b86ac
[org.ops4j.store.intern.TemporaryStore] : Storage Area is /tmp/1370491279705-0
[org.ops4j.pax.url.mvn.internal.Connection] : Resolving [mvn:org.apache.karaf/apache-karaf/2.3.2-SNAPSHOT/tar.gz]
[org.ops4j.pax.url.mvn.internal.Connection] : Collecting versions from repository [<https://builds.apache.org/job/Karaf-2.3.x/ws/.repository/,releases=true,snapshots=true]>
[org.ops4j.pax.url.mvn.internal.Connection] :   Resolving snapshot version [2.3.2-SNAPSHOT]
[org.ops4j.pax.url.mvn.internal.Connection] :   Resolving metadata
[org.apache.karaf.tooling.exam.container.internal.KarafTestContainer] : Test Container started
in 1 millis
[org.apache.karaf.tooling.exam.container.internal.KarafTestContainer] : Wait for test container
to finish its initialization [ RelativeTimeout value = 180000 ]
[org.ops4j.pax.exam.rbc.client.RemoteBundleContextClient] : Waiting for remote bundle context..
on 21436 name: efae380d-7c32-4132-99db-6665bb148aa0 timout: [ RelativeTimeout value = 180000
]
        __ __                  ____      
       / //_/____ __________ _/ __/      
      / ,<  / __ `/ ___/ __ `/ /_        
     / /| |/ /_/ / /  / /_/ / __/        
    /_/ |_|\__,_/_/   \__,_/_/         

  Apache Karaf (2.3.2-SNAPSHOT)

Hit '<tab>' for a list of available commands
and '[cmd] --help' for help on a specific command.
Hit '<ctrl-d>' or type 'osgi:shutdown' or 'logout' to shutdown Karaf.

karaf@root> [org.ops4j.pax.exam.rbc.client.RemoteBundleContextClient] : Remote bundle context
found after 5601 millis
[org.ops4j.pax.exam.container.remote.RBCRemoteTarget] : Preparing and Installing bundle (from
stream )..
[org.ops4j.pax.exam.rbc.client.RemoteBundleContextClient] : Packing probe into memory for
true RMI. Hopefully things will fill in..
[org.ops4j.pax.exam.container.remote.RBCRemoteTarget] : Installed bundle (from stream) as
ID: 73
[org.ops4j.pax.exam.container.remote.RBCRemoteTarget] : call [[TestAddress:PaxExam-9a9b1456-1537-4162-9342-63c7a288b461
root:PaxExam-b8ea432c-fd60-4791-8236-157a0161237e]]
Creating new instance on SSH port 8102 and RMI ports 1100/44445 at: <https://builds.apache.org/job/Karaf-2.3.x/ws/karaf/itests/target/exam/6d82314e-67dc-4ca3-b5c8-e889fee53cf7/instances/itest>
Creating dir:  <https://builds.apache.org/job/Karaf-2.3.x/ws/karaf/itests/target/exam/6d82314e-67dc-4ca3-b5c8-e889fee53cf7/instances/itest/bin>
Creating dir:  <https://builds.apache.org/job/Karaf-2.3.x/ws/karaf/itests/target/exam/6d82314e-67dc-4ca3-b5c8-e889fee53cf7/instances/itest/etc>
Creating dir:  <https://builds.apache.org/job/Karaf-2.3.x/ws/karaf/itests/target/exam/6d82314e-67dc-4ca3-b5c8-e889fee53cf7/instances/itest/system>
Creating dir:  <https://builds.apache.org/job/Karaf-2.3.x/ws/karaf/itests/target/exam/6d82314e-67dc-4ca3-b5c8-e889fee53cf7/instances/itest/deploy>
Creating dir:  <https://builds.apache.org/job/Karaf-2.3.x/ws/karaf/itests/target/exam/6d82314e-67dc-4ca3-b5c8-e889fee53cf7/instances/itest/data>
Creating file: <https://builds.apache.org/job/Karaf-2.3.x/ws/karaf/itests/target/exam/6d82314e-67dc-4ca3-b5c8-e889fee53cf7/instances/itest/etc/config.properties>
Creating file: <https://builds.apache.org/job/Karaf-2.3.x/ws/karaf/itests/target/exam/6d82314e-67dc-4ca3-b5c8-e889fee53cf7/instances/itest/etc/jre.properties>
Creating file: <https://builds.apache.org/job/Karaf-2.3.x/ws/karaf/itests/target/exam/6d82314e-67dc-4ca3-b5c8-e889fee53cf7/instances/itest/etc/custom.properties>
Creating file: <https://builds.apache.org/job/Karaf-2.3.x/ws/karaf/itests/target/exam/6d82314e-67dc-4ca3-b5c8-e889fee53cf7/instances/itest/etc/java.util.logging.properties>
Creating file: <https://builds.apache.org/job/Karaf-2.3.x/ws/karaf/itests/target/exam/6d82314e-67dc-4ca3-b5c8-e889fee53cf7/instances/itest/etc/org.apache.felix.fileinstall-deploy.cfg>
Creating file: <https://builds.apache.org/job/Karaf-2.3.x/ws/karaf/itests/target/exam/6d82314e-67dc-4ca3-b5c8-e889fee53cf7/instances/itest/etc/org.apache.karaf.log.cfg>
Creating file: <https://builds.apache.org/job/Karaf-2.3.x/ws/karaf/itests/target/exam/6d82314e-67dc-4ca3-b5c8-e889fee53cf7/instances/itest/etc/org.apache.karaf.features.cfg>
Creating file: <https://builds.apache.org/job/Karaf-2.3.x/ws/karaf/itests/target/exam/6d82314e-67dc-4ca3-b5c8-e889fee53cf7/instances/itest/etc/org.ops4j.pax.logging.cfg>
Creating file: <https://builds.apache.org/job/Karaf-2.3.x/ws/karaf/itests/target/exam/6d82314e-67dc-4ca3-b5c8-e889fee53cf7/instances/itest/etc/org.ops4j.pax.url.mvn.cfg>
Creating file: <https://builds.apache.org/job/Karaf-2.3.x/ws/karaf/itests/target/exam/6d82314e-67dc-4ca3-b5c8-e889fee53cf7/instances/itest/etc/startup.properties>
Creating file: <https://builds.apache.org/job/Karaf-2.3.x/ws/karaf/itests/target/exam/6d82314e-67dc-4ca3-b5c8-e889fee53cf7/instances/itest/etc/users.properties>
Creating file: <https://builds.apache.org/job/Karaf-2.3.x/ws/karaf/itests/target/exam/6d82314e-67dc-4ca3-b5c8-e889fee53cf7/instances/itest/etc/keys.properties>
Creating file: <https://builds.apache.org/job/Karaf-2.3.x/ws/karaf/itests/target/exam/6d82314e-67dc-4ca3-b5c8-e889fee53cf7/instances/itest/etc/system.properties>
Creating file: <https://builds.apache.org/job/Karaf-2.3.x/ws/karaf/itests/target/exam/6d82314e-67dc-4ca3-b5c8-e889fee53cf7/instances/itest/etc/org.apache.karaf.shell.cfg>
Creating file: <https://builds.apache.org/job/Karaf-2.3.x/ws/karaf/itests/target/exam/6d82314e-67dc-4ca3-b5c8-e889fee53cf7/instances/itest/etc/org.apache.karaf.management.cfg>
Creating file: <https://builds.apache.org/job/Karaf-2.3.x/ws/karaf/itests/target/exam/6d82314e-67dc-4ca3-b5c8-e889fee53cf7/instances/itest/bin/karaf>
Creating file: <https://builds.apache.org/job/Karaf-2.3.x/ws/karaf/itests/target/exam/6d82314e-67dc-4ca3-b5c8-e889fee53cf7/instances/itest/bin/start>
Creating file: <https://builds.apache.org/job/Karaf-2.3.x/ws/karaf/itests/target/exam/6d82314e-67dc-4ca3-b5c8-e889fee53cf7/instances/itest/bin/stop>
[org.apache.karaf.tooling.exam.container.internal.KarafTestContainer] : Shutting down the
test container (Pax Runner)
[org.ops4j.pax.exam.junit.JUnit4TestRunner] : Invoke cloneCommand:org.apache.karaf.itests.AdminTest.cloneCommand:KarafTestContainer{mvn:org.apache.karaf/apache-karaf/2.3.2-SNAPSHOT/tar.gz}
@ [TestAddress:PaxExam-c298ab30-42eb-40ca-8e3e-b383dfe552e6 root:PaxExam-2dd92e27-2e3d-490f-b00e-d02aaba3b6a1]
Arguments: [Ljava.lang.Object;@196c6ea
[org.ops4j.store.intern.TemporaryStore] : Storage Area is /tmp/1370491290158-0
[org.ops4j.pax.url.mvn.internal.Connection] : Resolving [mvn:org.apache.karaf/apache-karaf/2.3.2-SNAPSHOT/tar.gz]
[org.ops4j.pax.url.mvn.internal.Connection] : Collecting versions from repository [<https://builds.apache.org/job/Karaf-2.3.x/ws/.repository/,releases=true,snapshots=true]>
[org.ops4j.pax.url.mvn.internal.Connection] :   Resolving snapshot version [2.3.2-SNAPSHOT]
[org.ops4j.pax.url.mvn.internal.Connection] :   Resolving metadata
[org.apache.karaf.tooling.exam.container.internal.KarafTestContainer] : Test Container started
in 0 millis
[org.apache.karaf.tooling.exam.container.internal.KarafTestContainer] : Wait for test container
to finish its initialization [ RelativeTimeout value = 180000 ]
[org.ops4j.pax.exam.rbc.client.RemoteBundleContextClient] : Waiting for remote bundle context..
on 21436 name: 73be1e02-96a9-44f1-8663-0a49595b5551 timout: [ RelativeTimeout value = 180000
]
        __ __                  ____      
       / //_/____ __________ _/ __/      
      / ,<  / __ `/ ___/ __ `/ /_        
     / /| |/ /_/ / /  / /_/ / __/        
    /_/ |_|\__,_/_/   \__,_/_/         

  Apache Karaf (2.3.2-SNAPSHOT)

Hit '<tab>' for a list of available commands
and '[cmd] --help' for help on a specific command.
Hit '<ctrl-d>' or type 'osgi:shutdown' or 'logout' to shutdown Karaf.

karaf@root> [org.ops4j.pax.exam.rbc.client.RemoteBundleContextClient] : Remote bundle context
found after 5260 millis
[org.ops4j.pax.exam.container.remote.RBCRemoteTarget] : Preparing and Installing bundle (from
stream )..
[org.ops4j.pax.exam.rbc.client.RemoteBundleContextClient] : Packing probe into memory for
true RMI. Hopefully things will fill in..
[org.ops4j.pax.exam.container.remote.RBCRemoteTarget] : Installed bundle (from stream) as
ID: 73
[org.ops4j.pax.exam.container.remote.RBCRemoteTarget] : call [[TestAddress:PaxExam-c298ab30-42eb-40ca-8e3e-b383dfe552e6
root:PaxExam-2dd92e27-2e3d-490f-b00e-d02aaba3b6a1]]
admin:clone root itest

admin:list
  SSH Port   RMI Ports         State       Pid  Name
[    8101] [1099/44444     ] [Started ] [16555] root
[    8101] [1099/44444     ] [Stopped ] [    0] itest

[org.apache.karaf.tooling.exam.container.internal.KarafTestContainer] : Shutting down the
test container (Pax Runner)
[org.ops4j.pax.exam.junit.JUnit4TestRunner] : Invoke cloneViaMBean:org.apache.karaf.itests.AdminTest.cloneViaMBean:KarafTestContainer{mvn:org.apache.karaf/apache-karaf/2.3.2-SNAPSHOT/tar.gz}
@ [TestAddress:PaxExam-21a7b2a8-b066-42b7-b3ef-2dadb35dc415 root:PaxExam-a14ac08f-a2e8-410a-b91c-1a09b38b3793]
Arguments: [Ljava.lang.Object;@1dd5ba0
[org.ops4j.store.intern.TemporaryStore] : Storage Area is /tmp/1370491296235-0
[org.ops4j.pax.url.mvn.internal.Connection] : Resolving [mvn:org.apache.karaf/apache-karaf/2.3.2-SNAPSHOT/tar.gz]
[org.ops4j.pax.url.mvn.internal.Connection] : Collecting versions from repository [<https://builds.apache.org/job/Karaf-2.3.x/ws/.repository/,releases=true,snapshots=true]>
[org.ops4j.pax.url.mvn.internal.Connection] :   Resolving snapshot version [2.3.2-SNAPSHOT]
[org.ops4j.pax.url.mvn.internal.Connection] :   Resolving metadata
[org.apache.karaf.tooling.exam.container.internal.KarafTestContainer] : Test Container started
in 0 millis
[org.apache.karaf.tooling.exam.container.internal.KarafTestContainer] : Wait for test container
to finish its initialization [ RelativeTimeout value = 180000 ]
[org.ops4j.pax.exam.rbc.client.RemoteBundleContextClient] : Waiting for remote bundle context..
on 21436 name: 5272a6ab-0481-44e0-9e21-74ff67519eca timout: [ RelativeTimeout value = 180000
]
        __ __                  ____      
       / //_/____ __________ _/ __/      
      / ,<  / __ `/ ___/ __ `/ /_        
     / /| |/ /_/ / /  / /_/ / __/        
    /_/ |_|\__,_/_/   \__,_/_/         

  Apache Karaf (2.3.2-SNAPSHOT)

Hit '<tab>' for a list of available commands
and '[cmd] --help' for help on a specific command.
Hit '<ctrl-d>' or type 'osgi:shutdown' or 'logout' to shutdown Karaf.

karaf@root> [org.ops4j.pax.exam.rbc.client.RemoteBundleContextClient] : Remote bundle context
found after 7614 millis
[org.ops4j.pax.exam.container.remote.RBCRemoteTarget] : Preparing and Installing bundle (from
stream )..
[org.ops4j.pax.exam.rbc.client.RemoteBundleContextClient] : Packing probe into memory for
true RMI. Hopefully things will fill in..
[org.ops4j.pax.exam.container.remote.RBCRemoteTarget] : Installed bundle (from stream) as
ID: 73
[org.ops4j.pax.exam.container.remote.RBCRemoteTarget] : call [[TestAddress:PaxExam-21a7b2a8-b066-42b7-b3ef-2dadb35dc415
root:PaxExam-a14ac08f-a2e8-410a-b91c-1a09b38b3793]]
[org.apache.karaf.tooling.exam.container.internal.KarafTestContainer] : Shutting down the
test container (Pax Runner)
[org.ops4j.pax.exam.junit.JUnit4TestRunner] : Invoke renameCommand:org.apache.karaf.itests.AdminTest.renameCommand:KarafTestContainer{mvn:org.apache.karaf/apache-karaf/2.3.2-SNAPSHOT/tar.gz}
@ [TestAddress:PaxExam-4aa82613-e742-4ce9-80b6-44301798ce07 root:PaxExam-13784d32-0206-4908-b0e9-a1f33a2a5235]
Arguments: [Ljava.lang.Object;@1aa6968
[org.ops4j.store.intern.TemporaryStore] : Storage Area is /tmp/1370491304675-0
[org.ops4j.pax.url.mvn.internal.Connection] : Resolving [mvn:org.apache.karaf/apache-karaf/2.3.2-SNAPSHOT/tar.gz]
[org.ops4j.pax.url.mvn.internal.Connection] : Collecting versions from repository [<https://builds.apache.org/job/Karaf-2.3.x/ws/.repository/,releases=true,snapshots=true]>
[org.ops4j.pax.url.mvn.internal.Connection] :   Resolving snapshot version [2.3.2-SNAPSHOT]
[org.ops4j.pax.url.mvn.internal.Connection] :   Resolving metadata
[org.apache.karaf.tooling.exam.container.internal.KarafTestContainer] : Test Container started
in 1 millis
[org.apache.karaf.tooling.exam.container.internal.KarafTestContainer] : Wait for test container
to finish its initialization [ RelativeTimeout value = 180000 ]
[org.ops4j.pax.exam.rbc.client.RemoteBundleContextClient] : Waiting for remote bundle context..
on 21436 name: fe281719-7e86-44c4-9616-4bea869cabb5 timout: [ RelativeTimeout value = 180000
]
        __ __                  ____      
       / //_/____ __________ _/ __/      
      / ,<  / __ `/ ___/ __ `/ /_        
     / /| |/ /_/ / /  / /_/ / __/        
    /_/ |_|\__,_/_/   \__,_/_/         

  Apache Karaf (2.3.2-SNAPSHOT)

Hit '<tab>' for a list of available commands
and '[cmd] --help' for help on a specific command.
Hit '<ctrl-d>' or type 'osgi:shutdown' or 'logout' to shutdown Karaf.

karaf@root> [org.ops4j.pax.exam.rbc.client.RemoteBundleContextClient] : Remote bundle context
found after 5120 millis
[org.ops4j.pax.exam.container.remote.RBCRemoteTarget] : Preparing and Installing bundle (from
stream )..
[org.ops4j.pax.exam.rbc.client.RemoteBundleContextClient] : Packing probe into memory for
true RMI. Hopefully things will fill in..
[org.ops4j.pax.exam.container.remote.RBCRemoteTarget] : Installed bundle (from stream) as
ID: 73
[org.ops4j.pax.exam.container.remote.RBCRemoteTarget] : call [[TestAddress:PaxExam-4aa82613-e742-4ce9-80b6-44301798ce07
root:PaxExam-13784d32-0206-4908-b0e9-a1f33a2a5235]]
admin:create itest
Creating new instance on SSH port 8102 and RMI ports 1100/44445 at: <https://builds.apache.org/job/Karaf-2.3.x/ws/karaf/itests/target/exam/82f85ea1-fa85-47ba-8230-4666c19dbabd/instances/itest>
Creating dir:  <https://builds.apache.org/job/Karaf-2.3.x/ws/karaf/itests/target/exam/82f85ea1-fa85-47ba-8230-4666c19dbabd/instances/itest/bin>
Creating dir:  <https://builds.apache.org/job/Karaf-2.3.x/ws/karaf/itests/target/exam/82f85ea1-fa85-47ba-8230-4666c19dbabd/instances/itest/etc>
Creating dir:  <https://builds.apache.org/job/Karaf-2.3.x/ws/karaf/itests/target/exam/82f85ea1-fa85-47ba-8230-4666c19dbabd/instances/itest/system>
Creating dir:  <https://builds.apache.org/job/Karaf-2.3.x/ws/karaf/itests/target/exam/82f85ea1-fa85-47ba-8230-4666c19dbabd/instances/itest/deploy>
Creating dir:  <https://builds.apache.org/job/Karaf-2.3.x/ws/karaf/itests/target/exam/82f85ea1-fa85-47ba-8230-4666c19dbabd/instances/itest/data>
Creating file: <https://builds.apache.org/job/Karaf-2.3.x/ws/karaf/itests/target/exam/82f85ea1-fa85-47ba-8230-4666c19dbabd/instances/itest/etc/config.properties>
Creating file: <https://builds.apache.org/job/Karaf-2.3.x/ws/karaf/itests/target/exam/82f85ea1-fa85-47ba-8230-4666c19dbabd/instances/itest/etc/jre.properties>
Creating file: <https://builds.apache.org/job/Karaf-2.3.x/ws/karaf/itests/target/exam/82f85ea1-fa85-47ba-8230-4666c19dbabd/instances/itest/etc/custom.properties>
Creating file: <https://builds.apache.org/job/Karaf-2.3.x/ws/karaf/itests/target/exam/82f85ea1-fa85-47ba-8230-4666c19dbabd/instances/itest/etc/java.util.logging.properties>
Creating file: <https://builds.apache.org/job/Karaf-2.3.x/ws/karaf/itests/target/exam/82f85ea1-fa85-47ba-8230-4666c19dbabd/instances/itest/etc/org.apache.felix.fileinstall-deploy.cfg>
Creating file: <https://builds.apache.org/job/Karaf-2.3.x/ws/karaf/itests/target/exam/82f85ea1-fa85-47ba-8230-4666c19dbabd/instances/itest/etc/org.apache.karaf.log.cfg>
Creating file: <https://builds.apache.org/job/Karaf-2.3.x/ws/karaf/itests/target/exam/82f85ea1-fa85-47ba-8230-4666c19dbabd/instances/itest/etc/org.apache.karaf.features.cfg>
Creating file: <https://builds.apache.org/job/Karaf-2.3.x/ws/karaf/itests/target/exam/82f85ea1-fa85-47ba-8230-4666c19dbabd/instances/itest/etc/org.ops4j.pax.logging.cfg>
Creating file: <https://builds.apache.org/job/Karaf-2.3.x/ws/karaf/itests/target/exam/82f85ea1-fa85-47ba-8230-4666c19dbabd/instances/itest/etc/org.ops4j.pax.url.mvn.cfg>
Creating file: <https://builds.apache.org/job/Karaf-2.3.x/ws/karaf/itests/target/exam/82f85ea1-fa85-47ba-8230-4666c19dbabd/instances/itest/etc/startup.properties>
Creating file: <https://builds.apache.org/job/Karaf-2.3.x/ws/karaf/itests/target/exam/82f85ea1-fa85-47ba-8230-4666c19dbabd/instances/itest/etc/users.properties>
Creating file: <https://builds.apache.org/job/Karaf-2.3.x/ws/karaf/itests/target/exam/82f85ea1-fa85-47ba-8230-4666c19dbabd/instances/itest/etc/keys.properties>
Creating file: <https://builds.apache.org/job/Karaf-2.3.x/ws/karaf/itests/target/exam/82f85ea1-fa85-47ba-8230-4666c19dbabd/instances/itest/etc/system.properties>
Creating file: <https://builds.apache.org/job/Karaf-2.3.x/ws/karaf/itests/target/exam/82f85ea1-fa85-47ba-8230-4666c19dbabd/instances/itest/etc/org.apache.karaf.shell.cfg>
Creating file: <https://builds.apache.org/job/Karaf-2.3.x/ws/karaf/itests/target/exam/82f85ea1-fa85-47ba-8230-4666c19dbabd/instances/itest/etc/org.apache.karaf.management.cfg>
Creating file: <https://builds.apache.org/job/Karaf-2.3.x/ws/karaf/itests/target/exam/82f85ea1-fa85-47ba-8230-4666c19dbabd/instances/itest/bin/karaf>
Creating file: <https://builds.apache.org/job/Karaf-2.3.x/ws/karaf/itests/target/exam/82f85ea1-fa85-47ba-8230-4666c19dbabd/instances/itest/bin/start>
Creating file: <https://builds.apache.org/job/Karaf-2.3.x/ws/karaf/itests/target/exam/82f85ea1-fa85-47ba-8230-4666c19dbabd/instances/itest/bin/stop>

admin:rename itest new_itest
Renaming instance itest to new_itest

admin:list
  SSH Port   RMI Ports         State       Pid  Name
[    8101] [1099/44444     ] [Started ] [17072] root
[    8102] [1100/44445     ] [Stopped ] [    0] new_itest

[org.apache.karaf.tooling.exam.container.internal.KarafTestContainer] : Shutting down the
test container (Pax Runner)
Tests run: 5, Failures: 0, Errors: 0, Skipped: 0, Time elapsed: 44.546 sec

Results :

Tests run: 67, Failures: 0, Errors: 0, Skipped: 0

ERROR: Processing failed due to a bug in the code. Please report this to jenkinsci-users@googlegroups.com
hudson.remoting.RequestAbortedException: hudson.remoting.RequestAbortedException: java.io.StreamCorruptedException:
invalid type code: 00
	at hudson.remoting.Request.call(Request.java:174)
	at hudson.remoting.Channel.call(Channel.java:672)
	at hudson.maven.ProcessCache$MavenProcess.call(ProcessCache.java:156)
	at hudson.maven.MavenModuleSetBuild$MavenModuleSetBuildExecution.doRun(MavenModuleSetBuild.java:755)
	at hudson.model.AbstractBuild$AbstractBuildExecution.run(AbstractBuild.java:592)
	at hudson.model.Run.execute(Run.java:1568)
	at hudson.maven.MavenModuleSetBuild.run(MavenModuleSetBuild.java:477)
	at hudson.model.ResourceController.execute(ResourceController.java:88)
	at hudson.model.Executor.run(Executor.java:236)
Caused by: hudson.remoting.RequestAbortedException: java.io.StreamCorruptedException: invalid
type code: 00
	at hudson.remoting.Request.abort(Request.java:299)
	at hudson.remoting.Channel.terminate(Channel.java:732)
	at hudson.slaves.Channels$1.terminate(Channels.java:77)
	at hudson.remoting.SynchronousCommandTransport$ReaderThread.run(SynchronousCommandTransport.java:69)
Caused by: java.io.StreamCorruptedException: invalid type code: 00
	at java.io.ObjectInputStream.readObject0(ObjectInputStream.java:1374)
	at java.io.ObjectInputStream.defaultReadFields(ObjectInputStream.java:1970)
	at java.io.ObjectInputStream.readSerialData(ObjectInputStream.java:1894)
	at java.io.ObjectInputStream.readOrdinaryObject(ObjectInputStream.java:1777)
	at java.io.ObjectInputStream.readObject0(ObjectInputStream.java:1347)
	at java.io.ObjectInputStream.readObject(ObjectInputStream.java:369)
	at hudson.remoting.Command.readFrom(Command.java:92)
	at hudson.remoting.ClassicCommandTransport.read(ClassicCommandTransport.java:59)
	at hudson.remoting.SynchronousCommandTransport$ReaderThread.run(SynchronousCommandTransport.java:48)
project=hudson.maven.MavenModuleSet@18b70013[Karaf-2.3.x]
project.getModules()=[hudson.maven.MavenModule@60aed5b9[Karaf-2.3.x/org.apache.karaf:apache-karaf][Karaf-2.3.x/org.apache.karaf:apache-karaf][relativePath:assemblies/apache-karaf],
hudson.maven.MavenModule@76519645[Karaf-2.3.x/org.apache.karaf:archetypes][Karaf-2.3.x/org.apache.karaf:archetypes][relativePath:archetypes],
hudson.maven.MavenModule@6660c8b2[Karaf-2.3.x/org.apache.karaf:karaf][Karaf-2.3.x/org.apache.karaf:karaf][relativePath:],
hudson.maven.MavenModule@42269412[Karaf-2.3.x/org.apache.karaf:manual][Karaf-2.3.x/org.apache.karaf:manual][relativePath:manual],
hudson.maven.MavenModule@5c1852a0[Karaf-2.3.x/org.apache.karaf:org.apache.karaf.client][Karaf-2.3.x/org.apache.karaf:org.apache.karaf.client][relativePath:client],
hudson.maven.MavenModule@40d8b59c[Karaf-2.3.x/org.apache.karaf:org.apache.karaf.exception][Karaf-2.3.x/org.apache.karaf:org.apache.karaf.exception][relativePath:exception],
hudson.maven.MavenModule@537b3606[Karaf-2.3.x/org.apache.karaf:org.apache.karaf.main][Karaf-2.3.x/org.apache.karaf:org.apache.karaf.main][relativePath:main],
hudson.maven.MavenModule@3e17eebb[Karaf-2.3.x/org.apache.karaf:org.apache.karaf.util][Karaf-2.3.x/org.apache.karaf:org.apache.karaf.util][relativePath:util],
hudson.maven.MavenModule@153a56d6[Karaf-2.3.x/org.apache.karaf.admin:admin][Karaf-2.3.x/org.apache.karaf.admin:admin][relativePath:admin],
hudson.maven.MavenModule@291b067d[Karaf-2.3.x/org.apache.karaf.admin:org.apache.karaf.admin.command][Karaf-2.3.x/org.apache.karaf.admin:org.apache.karaf.admin.command][relativePath:admin/command],
hudson.maven.MavenModule@2d470da0[Karaf-2.3.x/org.apache.karaf.admin:org.apache.karaf.admin.core][Karaf-2.3.x/org.apache.karaf.admin:org.apache.karaf.admin.core][relativePath:admin/core],
hudson.maven.MavenModule@13cf9a99[Karaf-2.3.x/org.apache.karaf.admin:org.apache.karaf.admin.management][Karaf-2.3.x/org.apache.karaf.admin:org.apache.karaf.admin.management][relativePath:admin/management],
hudson.maven.MavenModule@22aebcf8[Karaf-2.3.x/org.apache.karaf.archetypes:karaf-assembly-archetype][Karaf-2.3.x/org.apache.karaf.archetypes:karaf-assembly-archetype][relativePath:archetypes/assembly],
hudson.maven.MavenModule@7df84f91[Karaf-2.3.x/org.apache.karaf.archetypes:karaf-blueprint-archetype][Karaf-2.3.x/org.apache.karaf.archetypes:karaf-blueprint-archetype][relativePath:archetypes/blueprint],
hudson.maven.MavenModule@392ff933[Karaf-2.3.x/org.apache.karaf.archetypes:karaf-bundle-archetype][Karaf-2.3.x/org.apache.karaf.archetypes:karaf-bundle-archetype][relativePath:archetypes/bundle],
hudson.maven.MavenModule@7c91a099[Karaf-2.3.x/org.apache.karaf.archetypes:karaf-command-archetype][Karaf-2.3.x/org.apache.karaf.archetypes:karaf-command-archetype][relativePath:archetypes/command],
hudson.maven.MavenModule@3cc6dcb3[Karaf-2.3.x/org.apache.karaf.archetypes:karaf-feature-archetype][Karaf-2.3.x/org.apache.karaf.archetypes:karaf-feature-archetype][relativePath:archetypes/feature],
hudson.maven.MavenModule@23c38af1[Karaf-2.3.x/org.apache.karaf.archetypes:karaf-kar-archetype][Karaf-2.3.x/org.apache.karaf.archetypes:karaf-kar-archetype][relativePath:archetypes/kar],
hudson.maven.MavenModule@7ad6e68e[Karaf-2.3.x/org.apache.karaf.assemblies:assemblies][Karaf-2.3.x/org.apache.karaf.assemblies:assemblies][relativePath:assemblies],
hudson.maven.MavenModule@32bab3a3[Karaf-2.3.x/org.apache.karaf.assemblies.features:enterprise][Karaf-2.3.x/org.apache.karaf.assemblies.features:enterprise][relativePath:assemblies/features/enterprise],
hudson.maven.MavenModule@7f67ac59[Karaf-2.3.x/org.apache.karaf.assemblies.features:features][Karaf-2.3.x/org.apache.karaf.assemblies.features:features][relativePath:assemblies/features],
hudson.maven.MavenModule@6f644867[Karaf-2.3.x/org.apache.karaf.assemblies.features:standard][Karaf-2.3.x/org.apache.karaf.assemblies.features:standard][relativePath:assemblies/features/standard],
hudson.maven.MavenModule@20cd9b53[Karaf-2.3.x/org.apache.karaf.demos:demos][Karaf-2.3.x/org.apache.karaf.demos:demos][relativePath:demos],
hudson.maven.MavenModule@1a9076f8[Karaf-2.3.x/org.apache.karaf.demos:dump][Karaf-2.3.x/org.apache.karaf.demos:dump][relativePath:demos/dump],
hudson.maven.MavenModule@272a168[Karaf-2.3.x/org.apache.karaf.demos:org.apache.karaf.demos.branding][Karaf-2.3.x/org.apache.karaf.demos:org.apache.karaf.demos.branding][relativePath:demos/branding],
hudson.maven.MavenModule@33c2b419[Karaf-2.3.x/org.apache.karaf.demos:org.apache.karaf.demos.branding.shell][Karaf-2.3.x/org.apache.karaf.demos:org.apache.karaf.demos.branding.shell][relativePath:demos/branding/shell],
hudson.maven.MavenModule@33bdefdb[Karaf-2.3.x/org.apache.karaf.demos:org.apache.karaf.demos.command][Karaf-2.3.x/org.apache.karaf.demos:org.apache.karaf.demos.command][relativePath:demos/command],
hudson.maven.MavenModule@7ace2d66[Karaf-2.3.x/org.apache.karaf.demos:org.apache.karaf.demos.deployer][Karaf-2.3.x/org.apache.karaf.demos:org.apache.karaf.demos.deployer][relativePath:demos/deployer],
hudson.maven.MavenModule@7606c286[Karaf-2.3.x/org.apache.karaf.demos:web][Karaf-2.3.x/org.apache.karaf.demos:web][relativePath:demos/web],
hudson.maven.MavenModule@35cd27f3[Karaf-2.3.x/org.apache.karaf.demos.deployer.bundle:my-bundle][Karaf-2.3.x/org.apache.karaf.demos.deployer.bundle:my-bundle][relativePath:demos/deployer/bundle],
hudson.maven.MavenModule@2ff9de1d[Karaf-2.3.x/org.apache.karaf.demos.deployer.feature:my-feature][Karaf-2.3.x/org.apache.karaf.demos.deployer.feature:my-feature][relativePath:demos/deployer/feature],
hudson.maven.MavenModule@3d655a86[Karaf-2.3.x/org.apache.karaf.demos.deployer.kar:my-kar][Karaf-2.3.x/org.apache.karaf.demos.deployer.kar:my-kar][relativePath:demos/deployer/kar],
hudson.maven.MavenModule@491a32e7[Karaf-2.3.x/org.apache.karaf.demos.deployer.wrap:osgi.commons-lang][Karaf-2.3.x/org.apache.karaf.demos.deployer.wrap:osgi.commons-lang][relativePath:demos/deployer/wrap],
hudson.maven.MavenModule@5704012f[Karaf-2.3.x/org.apache.karaf.deployer:deployer][Karaf-2.3.x/org.apache.karaf.deployer:deployer][relativePath:deployer],
hudson.maven.MavenModule@47e9e14a[Karaf-2.3.x/org.apache.karaf.deployer:org.apache.karaf.deployer.blueprint][Karaf-2.3.x/org.apache.karaf.deployer:org.apache.karaf.deployer.blueprint][relativePath:deployer/blueprint],
hudson.maven.MavenModule@4bc5e628[Karaf-2.3.x/org.apache.karaf.deployer:org.apache.karaf.deployer.features][Karaf-2.3.x/org.apache.karaf.deployer:org.apache.karaf.deployer.features][relativePath:deployer/features],
hudson.maven.MavenModule@2d8972f5[Karaf-2.3.x/org.apache.karaf.deployer:org.apache.karaf.deployer.kar][Karaf-2.3.x/org.apache.karaf.deployer:org.apache.karaf.deployer.kar][relativePath:deployer/kar],
hudson.maven.MavenModule@1ada4a2e[Karaf-2.3.x/org.apache.karaf.deployer:org.apache.karaf.deployer.spring][Karaf-2.3.x/org.apache.karaf.deployer:org.apache.karaf.deployer.spring][relativePath:deployer/spring],
hudson.maven.MavenModule@713c1fc7[Karaf-2.3.x/org.apache.karaf.deployer:org.apache.karaf.deployer.wrap][Karaf-2.3.x/org.apache.karaf.deployer:org.apache.karaf.deployer.wrap][relativePath:deployer/wrap],
hudson.maven.MavenModule@224a7be5[Karaf-2.3.x/org.apache.karaf.diagnostic:diagnostic][Karaf-2.3.x/org.apache.karaf.diagnostic:diagnostic][relativePath:diagnostic],
hudson.maven.MavenModule@480c08f9[Karaf-2.3.x/org.apache.karaf.diagnostic:org.apache.karaf.diagnostic.command][Karaf-2.3.x/org.apache.karaf.diagnostic:org.apache.karaf.diagnostic.command][relativePath:diagnostic/command],
hudson.maven.MavenModule@e213863[Karaf-2.3.x/org.apache.karaf.diagnostic:org.apache.karaf.diagnostic.common][Karaf-2.3.x/org.apache.karaf.diagnostic:org.apache.karaf.diagnostic.common][relativePath:diagnostic/common],
hudson.maven.MavenModule@26fcf2d4[Karaf-2.3.x/org.apache.karaf.diagnostic:org.apache.karaf.diagnostic.core][Karaf-2.3.x/org.apache.karaf.diagnostic:org.apache.karaf.diagnostic.core][relativePath:diagnostic/core],
hudson.maven.MavenModule@28aa504b[Karaf-2.3.x/org.apache.karaf.diagnostic:org.apache.karaf.diagnostic.management][Karaf-2.3.x/org.apache.karaf.diagnostic:org.apache.karaf.diagnostic.management][relativePath:diagnostic/management],
hudson.maven.MavenModule@457d80c8[Karaf-2.3.x/org.apache.karaf.features:features][Karaf-2.3.x/org.apache.karaf.features:features][relativePath:features],
hudson.maven.MavenModule@3291ee1c[Karaf-2.3.x/org.apache.karaf.features:org.apache.karaf.features.command][Karaf-2.3.x/org.apache.karaf.features:org.apache.karaf.features.command][relativePath:features/command],
hudson.maven.MavenModule@aa78a34[Karaf-2.3.x/org.apache.karaf.features:org.apache.karaf.features.core][Karaf-2.3.x/org.apache.karaf.features:org.apache.karaf.features.core][relativePath:features/core],
hudson.maven.MavenModule@7d626162[Karaf-2.3.x/org.apache.karaf.features:org.apache.karaf.features.management][Karaf-2.3.x/org.apache.karaf.features:org.apache.karaf.features.management][relativePath:features/management],
hudson.maven.MavenModule@45e7a93d[Karaf-2.3.x/org.apache.karaf.features:org.apache.karaf.features.obr][Karaf-2.3.x/org.apache.karaf.features:org.apache.karaf.features.obr][relativePath:features/obr],
hudson.maven.MavenModule@72c34bab[Karaf-2.3.x/org.apache.karaf.itests:dependencies][Karaf-2.3.x/org.apache.karaf.itests:dependencies][relativePath:itests/dependencies],
hudson.maven.MavenModule@6c1807a5[Karaf-2.3.x/org.apache.karaf.itests:itests][Karaf-2.3.x/org.apache.karaf.itests:itests][relativePath:itests],
hudson.maven.MavenModule@739d0269[Karaf-2.3.x/org.apache.karaf.itests:kittests][Karaf-2.3.x/org.apache.karaf.itests:kittests][relativePath:itests/kittests],
hudson.maven.MavenModule@490976cb[Karaf-2.3.x/org.apache.karaf.itests:tests][Karaf-2.3.x/org.apache.karaf.itests:tests][relativePath:itests/tests],
hudson.maven.MavenModule@1d9e1914[Karaf-2.3.x/org.apache.karaf.jaas:jaas][Karaf-2.3.x/org.apache.karaf.jaas:jaas][relativePath:jaas],
hudson.maven.MavenModule@c562ee3[Karaf-2.3.x/org.apache.karaf.jaas:org.apache.karaf.jaas.authz][Karaf-2.3.x/org.apache.karaf.jaas:org.apache.karaf.jaas.authz][relativePath:jaas/authz],
hudson.maven.MavenModule@76807f3c[Karaf-2.3.x/org.apache.karaf.jaas:org.apache.karaf.jaas.boot][Karaf-2.3.x/org.apache.karaf.jaas:org.apache.karaf.jaas.boot][relativePath:jaas/boot],
hudson.maven.MavenModule@6e2178eb[Karaf-2.3.x/org.apache.karaf.jaas:org.apache.karaf.jaas.command][Karaf-2.3.x/org.apache.karaf.jaas:org.apache.karaf.jaas.command][relativePath:jaas/command],
hudson.maven.MavenModule@5789c4c9[Karaf-2.3.x/org.apache.karaf.jaas:org.apache.karaf.jaas.config][Karaf-2.3.x/org.apache.karaf.jaas:org.apache.karaf.jaas.config][relativePath:jaas/config],
hudson.maven.MavenModule@15d69505[Karaf-2.3.x/org.apache.karaf.jaas:org.apache.karaf.jaas.jasypt][Karaf-2.3.x/org.apache.karaf.jaas:org.apache.karaf.jaas.jasypt][relativePath:jaas/jasypt],
hudson.maven.MavenModule@3ad18676[Karaf-2.3.x/org.apache.karaf.jaas:org.apache.karaf.jaas.modules][Karaf-2.3.x/org.apache.karaf.jaas:org.apache.karaf.jaas.modules][relativePath:jaas/modules],
hudson.maven.MavenModule@11d2cb25[Karaf-2.3.x/org.apache.karaf.management:management][Karaf-2.3.x/org.apache.karaf.management:management][relativePath:management],
hudson.maven.MavenModule@2616f347[Karaf-2.3.x/org.apache.karaf.management:org.apache.karaf.management.server][Karaf-2.3.x/org.apache.karaf.management:org.apache.karaf.management.server][relativePath:management/server],
hudson.maven.MavenModule@2cbdcdda[Karaf-2.3.x/org.apache.karaf.management.mbeans:mbeans][Karaf-2.3.x/org.apache.karaf.management.mbeans:mbeans][relativePath:management/mbeans],
hudson.maven.MavenModule@6115ba28[Karaf-2.3.x/org.apache.karaf.management.mbeans:org.apache.karaf.management.mbeans.bundles][Karaf-2.3.x/org.apache.karaf.management.mbeans:org.apache.karaf.management.mbeans.bundles][relativePath:management/mbeans/bundles],
hudson.maven.MavenModule@5970c9e3[Karaf-2.3.x/org.apache.karaf.management.mbeans:org.apache.karaf.management.mbeans.config][Karaf-2.3.x/org.apache.karaf.management.mbeans:org.apache.karaf.management.mbeans.config][relativePath:management/mbeans/config],
hudson.maven.MavenModule@7bd683f4[Karaf-2.3.x/org.apache.karaf.management.mbeans:org.apache.karaf.management.mbeans.dev][Karaf-2.3.x/org.apache.karaf.management.mbeans:org.apache.karaf.management.mbeans.dev][relativePath:management/mbeans/dev],
hudson.maven.MavenModule@407147b0[Karaf-2.3.x/org.apache.karaf.management.mbeans:org.apache.karaf.management.mbeans.log][Karaf-2.3.x/org.apache.karaf.management.mbeans:org.apache.karaf.management.mbeans.log][relativePath:management/mbeans/log],
hudson.maven.MavenModule@4d1994dd[Karaf-2.3.x/org.apache.karaf.management.mbeans:org.apache.karaf.management.mbeans.obr][Karaf-2.3.x/org.apache.karaf.management.mbeans:org.apache.karaf.management.mbeans.obr][relativePath:management/mbeans/obr],
hudson.maven.MavenModule@4a7c60b6[Karaf-2.3.x/org.apache.karaf.management.mbeans:org.apache.karaf.management.mbeans.packages][Karaf-2.3.x/org.apache.karaf.management.mbeans:org.apache.karaf.management.mbeans.packages][relativePath:management/mbeans/packages],
hudson.maven.MavenModule@2bb172ee[Karaf-2.3.x/org.apache.karaf.management.mbeans:org.apache.karaf.management.mbeans.scr][Karaf-2.3.x/org.apache.karaf.management.mbeans:org.apache.karaf.management.mbeans.scr][relativePath:management/mbeans/scr],
hudson.maven.MavenModule@ef07dab[Karaf-2.3.x/org.apache.karaf.management.mbeans:org.apache.karaf.management.mbeans.services][Karaf-2.3.x/org.apache.karaf.management.mbeans:org.apache.karaf.management.mbeans.services][relativePath:management/mbeans/services],
hudson.maven.MavenModule@4eca6d36[Karaf-2.3.x/org.apache.karaf.management.mbeans:org.apache.karaf.management.mbeans.system][Karaf-2.3.x/org.apache.karaf.management.mbeans:org.apache.karaf.management.mbeans.system][relativePath:management/mbeans/system],
hudson.maven.MavenModule@4bc81ca3[Karaf-2.3.x/org.apache.karaf.management.mbeans:org.apache.karaf.management.mbeans.web][Karaf-2.3.x/org.apache.karaf.management.mbeans:org.apache.karaf.management.mbeans.web][relativePath:management/mbeans/web],
hudson.maven.MavenModule@3ed03833[Karaf-2.3.x/org.apache.karaf.shell:org.apache.karaf.shell.commands][Karaf-2.3.x/org.apache.karaf.shell:org.apache.karaf.shell.commands][relativePath:shell/commands],
hudson.maven.MavenModule@5819bc7c[Karaf-2.3.x/org.apache.karaf.shell:org.apache.karaf.shell.config][Karaf-2.3.x/org.apache.karaf.shell:org.apache.karaf.shell.config][relativePath:shell/config],
hudson.maven.MavenModule@1a59e14[Karaf-2.3.x/org.apache.karaf.shell:org.apache.karaf.shell.console][Karaf-2.3.x/org.apache.karaf.shell:org.apache.karaf.shell.console][relativePath:shell/console],
hudson.maven.MavenModule@202d33e4[Karaf-2.3.x/org.apache.karaf.shell:org.apache.karaf.shell.dev][Karaf-2.3.x/org.apache.karaf.shell:org.apache.karaf.shell.dev][relativePath:shell/dev],
hudson.maven.MavenModule@77a9ce3c[Karaf-2.3.x/org.apache.karaf.shell:org.apache.karaf.shell.log][Karaf-2.3.x/org.apache.karaf.shell:org.apache.karaf.shell.log][relativePath:shell/log],
hudson.maven.MavenModule@2d230284[Karaf-2.3.x/org.apache.karaf.shell:org.apache.karaf.shell.obr][Karaf-2.3.x/org.apache.karaf.shell:org.apache.karaf.shell.obr][relativePath:shell/obr],
hudson.maven.MavenModule@557a3f42[Karaf-2.3.x/org.apache.karaf.shell:org.apache.karaf.shell.osgi][Karaf-2.3.x/org.apache.karaf.shell:org.apache.karaf.shell.osgi][relativePath:shell/osgi],
hudson.maven.MavenModule@4ccf31e5[Karaf-2.3.x/org.apache.karaf.shell:org.apache.karaf.shell.packages][Karaf-2.3.x/org.apache.karaf.shell:org.apache.karaf.shell.packages][relativePath:shell/packages],
hudson.maven.MavenModule@36d4d8c8[Karaf-2.3.x/org.apache.karaf.shell:org.apache.karaf.shell.scr][Karaf-2.3.x/org.apache.karaf.shell:org.apache.karaf.shell.scr][relativePath:shell/scr],
hudson.maven.MavenModule@4fe44e97[Karaf-2.3.x/org.apache.karaf.shell:org.apache.karaf.shell.ssh][Karaf-2.3.x/org.apache.karaf.shell:org.apache.karaf.shell.ssh][relativePath:shell/ssh],
hudson.maven.MavenModule@15e3c47b[Karaf-2.3.x/org.apache.karaf.shell:org.apache.karaf.shell.web][Karaf-2.3.x/org.apache.karaf.shell:org.apache.karaf.shell.web][relativePath:shell/web],
hudson.maven.MavenModule@1c787277[Karaf-2.3.x/org.apache.karaf.shell:org.apache.karaf.shell.wrapper][Karaf-2.3.x/org.apache.karaf.shell:org.apache.karaf.shell.wrapper][relativePath:shell/wrapper],
hudson.maven.MavenModule@27a2f13b[Karaf-2.3.x/org.apache.karaf.shell:shell][Karaf-2.3.x/org.apache.karaf.shell:shell][relativePath:shell],
hudson.maven.MavenModule@3a8b6cd1[Karaf-2.3.x/org.apache.karaf.tooling:cmdhelp-maven-plugin][Karaf-2.3.x/org.apache.karaf.tooling:cmdhelp-maven-plugin][relativePath:tooling/cmdhelp-maven-plugin],
hudson.maven.MavenModule@17952b5e[Karaf-2.3.x/org.apache.karaf.tooling:features-maven-plugin][Karaf-2.3.x/org.apache.karaf.tooling:features-maven-plugin][relativePath:tooling/features-maven-plugin],
hudson.maven.MavenModule@6e203f68[Karaf-2.3.x/org.apache.karaf.tooling:org.apache.karaf.tooling.testing][Karaf-2.3.x/org.apache.karaf.tooling:org.apache.karaf.tooling.testing][relativePath:tooling/testing],
hudson.maven.MavenModule@4252346a[Karaf-2.3.x/org.apache.karaf.tooling:tooling][Karaf-2.3.x/org.apache.karaf.tooling:tooling][relativePath:tooling],
hudson.maven.MavenModule@22ef3d2a[Karaf-2.3.x/org.apache.karaf.tooling.exam:exam][Karaf-2.3.x/org.apache.karaf.tooling.exam:exam][relativePath:tooling/exam],
hudson.maven.MavenModule@898a251[Karaf-2.3.x/org.apache.karaf.tooling.exam:org.apache.karaf.tooling.exam.container][Karaf-2.3.x/org.apache.karaf.tooling.exam:org.apache.karaf.tooling.exam.container][relativePath:tooling/exam/container],
hudson.maven.MavenModule@5cc8783f[Karaf-2.3.x/org.apache.karaf.tooling.exam:org.apache.karaf.tooling.exam.options][Karaf-2.3.x/org.apache.karaf.tooling.exam:org.apache.karaf.tooling.exam.options][relativePath:tooling/exam/options],
hudson.maven.MavenModule@6d4e9faf[Karaf-2.3.x/org.apache.karaf.webconsole:org.apache.karaf.webconsole.admin][Karaf-2.3.x/org.apache.karaf.webconsole:org.apache.karaf.webconsole.admin][relativePath:webconsole/admin],
hudson.maven.MavenModule@44d5d239[Karaf-2.3.x/org.apache.karaf.webconsole:org.apache.karaf.webconsole.branding][Karaf-2.3.x/org.apache.karaf.webconsole:org.apache.karaf.webconsole.branding][relativePath:webconsole/branding],
hudson.maven.MavenModule@31dcbf7d[Karaf-2.3.x/org.apache.karaf.webconsole:org.apache.karaf.webconsole.console][Karaf-2.3.x/org.apache.karaf.webconsole:org.apache.karaf.webconsole.console][relativePath:webconsole/console],
hudson.maven.MavenModule@139fc11e[Karaf-2.3.x/org.apache.karaf.webconsole:org.apache.karaf.webconsole.features][Karaf-2.3.x/org.apache.karaf.webconsole:org.apache.karaf.webconsole.features][relativePath:webconsole/features],
hudson.maven.MavenModule@5d3fa2a2[Karaf-2.3.x/org.apache.karaf.webconsole:org.apache.karaf.webconsole.gogo][Karaf-2.3.x/org.apache.karaf.webconsole:org.apache.karaf.webconsole.gogo][relativePath:webconsole/gogo],
hudson.maven.MavenModule@7cce6981[Karaf-2.3.x/org.apache.karaf.webconsole:webconsole][Karaf-2.3.x/org.apache.karaf.webconsole:webconsole][relativePath:webconsole]]
project.getRootModule()=hudson.maven.MavenModule@6660c8b2[Karaf-2.3.x/org.apache.karaf:karaf][Karaf-2.3.x/org.apache.karaf:karaf][relativePath:]
FATAL: hudson.remoting.RequestAbortedException: java.io.StreamCorruptedException: invalid
type code: 00
hudson.remoting.RequestAbortedException: hudson.remoting.RequestAbortedException: java.io.StreamCorruptedException:
invalid type code: 00
	at hudson.remoting.Request.call(Request.java:174)
	at hudson.remoting.Channel.call(Channel.java:672)
	at hudson.maven.ProcessCache$MavenProcess.call(ProcessCache.java:156)
	at hudson.maven.MavenModuleSetBuild$MavenModuleSetBuildExecution.doRun(MavenModuleSetBuild.java:755)
	at hudson.model.AbstractBuild$AbstractBuildExecution.run(AbstractBuild.java:592)
	at hudson.model.Run.execute(Run.java:1568)
	at hudson.maven.MavenModuleSetBuild.run(MavenModuleSetBuild.java:477)
	at hudson.model.ResourceController.execute(ResourceController.java:88)
	at hudson.model.Executor.run(Executor.java:236)
Caused by: hudson.remoting.RequestAbortedException: java.io.StreamCorruptedException: invalid
type code: 00
	at hudson.remoting.Request.abort(Request.java:299)
	at hudson.remoting.Channel.terminate(Channel.java:732)
	at hudson.slaves.Channels$1.terminate(Channels.java:77)
	at hudson.remoting.SynchronousCommandTransport$ReaderThread.run(SynchronousCommandTransport.java:69)
Caused by: java.io.StreamCorruptedException: invalid type code: 00
	at java.io.ObjectInputStream.readObject0(ObjectInputStream.java:1374)
	at java.io.ObjectInputStream.defaultReadFields(ObjectInputStream.java:1970)
	at java.io.ObjectInputStream.readSerialData(ObjectInputStream.java:1894)
	at java.io.ObjectInputStream.readOrdinaryObject(ObjectInputStream.java:1777)
	at java.io.ObjectInputStream.readObject0(ObjectInputStream.java:1347)
	at java.io.ObjectInputStream.readObject(ObjectInputStream.java:369)
	at hudson.remoting.Command.readFrom(Command.java:92)
	at hudson.remoting.ClassicCommandTransport.read(ClassicCommandTransport.java:59)
	at hudson.remoting.SynchronousCommandTransport$ReaderThread.run(SynchronousCommandTransport.java:48)

Mime
View raw message