karaf-commits mailing list archives

Site index · List index
Message view « Date » · « Thread »
Top « Date » · « Thread »
From Apache Jenkins Server <jenk...@builds.apache.org>
Subject Build failed in Jenkins: Karaf-2.2.x #999
Date Thu, 25 Apr 2013 13:47:08 GMT
See <https://builds.apache.org/job/Karaf-2.2.x/999/>

------------------------------------------
[...truncated 2700 lines...]
[INFO] Unable to find resource 'org.ops4j.base:ops4j-base-store:jar:1.2.2' in repository servicemix
(http://svn.apache.org/repos/asf/servicemix/m2-repo)
Downloading: http://repo1.maven.org/maven2/org/ops4j/base/ops4j-base-store/1.2.2/ops4j-base-store-1.2.2.jar
7K downloaded  (ops4j-base-store-1.2.2.jar)
[INFO] [antrun:run {execution: copy-notice}]
[INFO] Executing tasks

main:
     [copy] Copying 1 file to <https://builds.apache.org/job/Karaf-2.2.x/ws/karaf/main/target/maven-shared-archive-resources/META-INF>
[INFO] Executed tasks
[debug] execute contextualize
[INFO] [resources:resources {execution: default-resources}]
[INFO] Using 'UTF-8' encoding to copy filtered resources.
[INFO] Copying 2 resources
[INFO] Copying 3 resources
[INFO] [compiler:compile {execution: default-compile}]
[INFO] Compiling 16 source files to <https://builds.apache.org/job/Karaf-2.2.x/ws/karaf/main/target/classes>
[debug] execute contextualize
[INFO] [resources:testResources {execution: default-testResources}]
[INFO] Using 'UTF-8' encoding to copy filtered resources.
[INFO] Copying 5 resources
[INFO] Copying 3 resources
[INFO] [compiler:testCompile {execution: default-testCompile}]
[INFO] Compiling 18 source files to <https://builds.apache.org/job/Karaf-2.2.x/ws/karaf/main/target/test-classes>
[INFO] [surefire:test {execution: default-test}]
[INFO] Surefire report directory: <https://builds.apache.org/job/Karaf-2.2.x/ws/karaf/main/target/surefire-reports>

-------------------------------------------------------
 T E S T S
-------------------------------------------------------
Running org.apache.karaf.main.MainLockingTest
Apr 25, 2013 1:40:33 PM org.ops4j.pax.swissbox.tinybundles.core.metadata.RawBuilder$1 run
INFO: Copy thread finished.
Apr 25, 2013 1:40:34 PM org.apache.karaf.main.Main doLock
INFO: Lost the lock, reducing start level to 1
Apr 25, 2013 1:40:45 PM org.apache.karaf.main.Main doLock
INFO: Waiting for the lock ...
Apr 25, 2013 1:40:46 PM org.apache.karaf.main.Main doLock
INFO: Lock acquired.
Tests run: 1, Failures: 0, Errors: 0, Skipped: 0, Time elapsed: 25.493 sec
Running org.apache.karaf.main.MySQLJDBCLockIntegrationTest
Tests run: 1, Failures: 0, Errors: 0, Skipped: 1, Time elapsed: 0.001 sec
Running org.apache.karaf.main.MySQLJDBCLockTest
Apr 25, 2013 1:40:57 PM org.apache.karaf.main.DefaultJDBCLock schemaExists
SEVERE: Error testing for db table: java.lang.NullPointerException
Apr 25, 2013 1:40:57 PM org.apache.karaf.main.DefaultJDBCLock createSchema
SEVERE: Could not create schema: java.lang.IllegalStateException: missing behavior definition
for the preceding method call:
Connection.getMetaData()
Usage is: expect(a.foo()).andXXX()
Apr 25, 2013 1:40:57 PM org.apache.karaf.main.DefaultJDBCLock updateLock
WARNING: Failed to update database lock: java.sql.SQLException
Apr 25, 2013 1:40:57 PM org.apache.karaf.main.DefaultJDBCLock updateLock
WARNING: Failed to update database lock: java.sql.SQLException
Apr 25, 2013 1:40:57 PM org.apache.karaf.main.DefaultJDBCLock isAlive
SEVERE: Lost lock!
Apr 25, 2013 1:40:57 PM org.apache.karaf.main.DefaultJDBCLock isAlive
SEVERE: Lost lock!
Apr 25, 2013 1:40:57 PM org.apache.karaf.main.DefaultJDBCLock updateLock
WARNING: Failed to update database lock: java.sql.SQLException
Tests run: 14, Failures: 0, Errors: 0, Skipped: 0, Time elapsed: 0.139 sec
Running org.apache.karaf.main.DerbyJDBCLockIntegrationTest
Tests run: 1, Failures: 0, Errors: 0, Skipped: 1, Time elapsed: 0 sec
Running org.apache.karaf.main.OracleJDBCLockIntegrationTest
Tests run: 1, Failures: 0, Errors: 0, Skipped: 1, Time elapsed: 0 sec
Running org.apache.karaf.main.PostgreSQLJDBCLockTest
Apr 25, 2013 1:40:57 PM org.apache.karaf.main.DefaultJDBCLock updateLock
WARNING: Failed to update database lock: java.sql.SQLException
Apr 25, 2013 1:40:57 PM org.apache.karaf.main.DefaultJDBCLock updateLock
WARNING: Failed to update database lock: java.sql.SQLException
Apr 25, 2013 1:40:57 PM org.apache.karaf.main.DefaultJDBCLock schemaExists
SEVERE: Error testing for db table: java.lang.NullPointerException
Apr 25, 2013 1:40:57 PM org.apache.karaf.main.DefaultJDBCLock createSchema
SEVERE: Could not create schema: java.lang.IllegalStateException: missing behavior definition
for the preceding method call:
Connection.getMetaData()
Usage is: expect(a.foo()).andXXX()
Apr 25, 2013 1:40:57 PM org.apache.karaf.main.DefaultJDBCLock isAlive
SEVERE: Lost lock!
Apr 25, 2013 1:40:57 PM org.apache.karaf.main.DefaultJDBCLock isAlive
SEVERE: Lost lock!
Apr 25, 2013 1:40:57 PM org.apache.karaf.main.DefaultJDBCLock updateLock
WARNING: Failed to update database lock: java.sql.SQLException
Tests run: 14, Failures: 0, Errors: 0, Skipped: 0, Time elapsed: 0.023 sec
Running org.apache.karaf.main.StringMapTest
Tests run: 1, Failures: 0, Errors: 0, Skipped: 0, Time elapsed: 0.004 sec
Running org.apache.karaf.main.OracleJDBCLockTest
Apr 25, 2013 1:40:57 PM org.apache.karaf.main.DefaultJDBCLock aquireLock
WARNING: Failed to acquire database lock: java.sql.SQLException
Apr 25, 2013 1:40:57 PM org.apache.karaf.main.DefaultJDBCLock aquireLock
WARNING: Failed to acquire database lock: java.sql.SQLException
Apr 25, 2013 1:40:57 PM org.apache.karaf.main.DefaultJDBCLock aquireLock
WARNING: Failed to acquire database lock: java.sql.SQLException
Apr 25, 2013 1:40:57 PM org.apache.karaf.main.DefaultJDBCLock isAlive
SEVERE: Lost lock!
Apr 25, 2013 1:40:57 PM org.apache.karaf.main.DefaultJDBCLock isAlive
SEVERE: Lost lock!
Tests run: 13, Failures: 0, Errors: 0, Skipped: 0, Time elapsed: 0.022 sec
Running org.apache.karaf.main.PostgreSQLJDBCLockIntegrationTest
Tests run: 1, Failures: 0, Errors: 0, Skipped: 1, Time elapsed: 0 sec
Running org.apache.karaf.main.MainStartTest
Apr 25, 2013 1:40:58 PM org.ops4j.pax.swissbox.tinybundles.core.metadata.RawBuilder$1 run
INFO: Copy thread finished.
Tests run: 2, Failures: 0, Errors: 0, Skipped: 1, Time elapsed: 11.032 sec
Running org.apache.karaf.main.StatementsTest
Tests run: 6, Failures: 0, Errors: 0, Skipped: 0, Time elapsed: 0.002 sec
Running org.apache.karaf.main.DerbyJDBCLockTest
Apr 25, 2013 1:41:08 PM org.apache.karaf.main.DefaultJDBCLock schemaExists
SEVERE: Error testing for db table: java.lang.NullPointerException
Apr 25, 2013 1:41:08 PM org.apache.karaf.main.DefaultJDBCLock createSchema
SEVERE: Could not create schema: java.lang.IllegalStateException: missing behavior definition
for the preceding method call:
Connection.getMetaData()
Usage is: expect(a.foo()).andXXX()
Apr 25, 2013 1:41:08 PM org.apache.karaf.main.DefaultJDBCLock updateLock
WARNING: Failed to update database lock: java.sql.SQLException
Apr 25, 2013 1:41:08 PM org.apache.karaf.main.DefaultJDBCLock updateLock
WARNING: Failed to update database lock: java.sql.SQLException
Apr 25, 2013 1:41:08 PM org.apache.karaf.main.DefaultJDBCLock isAlive
SEVERE: Lost lock!
Apr 25, 2013 1:41:08 PM org.apache.karaf.main.DefaultJDBCLock isAlive
SEVERE: Lost lock!
Apr 25, 2013 1:41:08 PM org.apache.karaf.main.DefaultJDBCLock updateLock
WARNING: Failed to update database lock: java.sql.SQLException
Tests run: 14, Failures: 0, Errors: 0, Skipped: 0, Time elapsed: 0.022 sec
Running org.apache.karaf.main.DefaultJDBCLockIntegrationTest
Tests run: 1, Failures: 0, Errors: 0, Skipped: 1, Time elapsed: 0 sec
Running org.apache.karaf.main.DefaultJDBCLockTest
Apr 25, 2013 1:41:08 PM org.apache.karaf.main.DefaultJDBCLock schemaExists
SEVERE: Error testing for db table: java.lang.NullPointerException
Apr 25, 2013 1:41:08 PM org.apache.karaf.main.DefaultJDBCLock createSchema
SEVERE: Could not create schema: java.lang.IllegalStateException: missing behavior definition
for the preceding method call:
Connection.getMetaData()
Usage is: expect(a.foo()).andXXX()
Apr 25, 2013 1:41:08 PM org.apache.karaf.main.DefaultJDBCLock updateLock
WARNING: Failed to update database lock: java.sql.SQLException
Apr 25, 2013 1:41:08 PM org.apache.karaf.main.DefaultJDBCLock updateLock
WARNING: Failed to update database lock: java.sql.SQLException
Apr 25, 2013 1:41:08 PM org.apache.karaf.main.DefaultJDBCLock isAlive
SEVERE: Lost lock!
Apr 25, 2013 1:41:08 PM org.apache.karaf.main.DefaultJDBCLock isAlive
SEVERE: Lost lock!
Apr 25, 2013 1:41:08 PM org.apache.karaf.main.DefaultJDBCLock updateLock
WARNING: Failed to update database lock: java.sql.SQLException
Tests run: 14, Failures: 0, Errors: 0, Skipped: 0, Time elapsed: 0.02 sec

Results :

Tests run: 84, Failures: 0, Errors: 0, Skipped: 6

[JENKINS] Recording test results
[INFO] [bundle:bundle {execution: default-bundle}]
[INFO] [install:install {execution: default-install}]
[INFO] Installing <https://builds.apache.org/job/Karaf-2.2.x/ws/karaf/main/target/org.apache.karaf.main-2.2.11-SNAPSHOT.jar>
to <https://builds.apache.org/job/Karaf-2.2.x/ws/.repository/org/apache/karaf/org.apache.karaf.main/2.2.11-SNAPSHOT/org.apache.karaf.main-2.2.11-SNAPSHOT.jar>
[INFO] [bundle:install {execution: default-install}]
[INFO] Writing OBR metadata
[INFO] Installing org/apache/karaf/org.apache.karaf.main/2.2.11-SNAPSHOT/org.apache.karaf.main-2.2.11-SNAPSHOT.jar
[INFO] Writing OBR metadata
[INFO] [bundle:cleanVersions {execution: cleanVersions}]
[WARNING] The parameter expression: 'project.build.resources' used in mojo: 'process' has
been deprecated. Use 'project.resources' instead.
[INFO] [remote-resources:process {execution: default}]
[INFO] [antrun:run {execution: copy-notice}]
[INFO] Executing tasks

main:
     [copy] Copying 1 file to <https://builds.apache.org/job/Karaf-2.2.x/ws/karaf/main/target/maven-shared-archive-resources/META-INF>
[INFO] Executed tasks
[debug] execute contextualize
[INFO] [resources:resources {execution: default-resources}]
[INFO] Using 'UTF-8' encoding to copy filtered resources.
[INFO] Copying 2 resources
[INFO] Copying 3 resources
[INFO] Copying 3 resources
[INFO] [compiler:compile {execution: default-compile}]
[INFO] Nothing to compile - all classes are up to date
[debug] execute contextualize
[INFO] [resources:testResources {execution: default-testResources}]
[INFO] Using 'UTF-8' encoding to copy filtered resources.
[INFO] Copying 5 resources
[INFO] Copying 3 resources
[INFO] Copying 3 resources
[INFO] [compiler:testCompile {execution: default-testCompile}]
[INFO] Nothing to compile - all classes are up to date
[INFO] [surefire:test {execution: default-test}]
[INFO] Skipping execution of surefire because it has already been run for this configuration
[INFO] [bundle:bundle {execution: default-bundle}]
[JENKINS] Recording test results
[INFO] [install:install {execution: default-install}]
[INFO] Installing <https://builds.apache.org/job/Karaf-2.2.x/ws/karaf/main/target/org.apache.karaf.main-2.2.11-SNAPSHOT.jar>
to <https://builds.apache.org/job/Karaf-2.2.x/ws/.repository/org/apache/karaf/org.apache.karaf.main/2.2.11-SNAPSHOT/org.apache.karaf.main-2.2.11-SNAPSHOT.jar>
[INFO] [bundle:install {execution: default-install}]
[INFO] Installing org/apache/karaf/org.apache.karaf.main/2.2.11-SNAPSHOT/org.apache.karaf.main-2.2.11-SNAPSHOT.jar
[INFO] Writing OBR metadata
[INFO] [deploy:deploy {execution: default-deploy}]
[INFO] Retrieving previous build number from apache.snapshots.https
[WARNING] *** CHECKSUM FAILED - Checksum failed on download: local = '1f5559e8cdf073197c080e9864d89da39d033bb6';
remote = 'f9e62061274c90f9b16a0db941b8b8b62d318f61' - RETRYING
[WARNING] *** CHECKSUM FAILED - Checksum failed on download: local = '1f5559e8cdf073197c080e9864d89da39d033bb6';
remote = 'f9e62061274c90f9b16a0db941b8b8b62d318f61' - IGNORING
Uploading: https://repository.apache.org/content/repositories/snapshots/org/apache/karaf/org.apache.karaf.main/2.2.11-SNAPSHOT/org.apache.karaf.main-2.2.11-20130425.133953-118.jar
154K uploaded  (org.apache.karaf.main-2.2.11-20130425.133953-118.jar)
[INFO] Retrieving previous metadata from apache.snapshots.https
[INFO] Uploading repository metadata for: 'artifact org.apache.karaf:org.apache.karaf.main'
[INFO] Retrieving previous metadata from apache.snapshots.https
[WARNING] *** CHECKSUM FAILED - Checksum failed on download: local = '1f5559e8cdf073197c080e9864d89da39d033bb6';
remote = 'f9e62061274c90f9b16a0db941b8b8b62d318f61' - RETRYING
[WARNING] *** CHECKSUM FAILED - Checksum failed on download: local = '1f5559e8cdf073197c080e9864d89da39d033bb6';
remote = 'f9e62061274c90f9b16a0db941b8b8b62d318f61' - IGNORING
[INFO] Uploading repository metadata for: 'snapshot org.apache.karaf:org.apache.karaf.main:2.2.11-SNAPSHOT'
[INFO] Uploading project information for org.apache.karaf.main 2.2.11-20130425.133953-118
[INFO] [bundle:deploy {execution: default-deploy}]
[INFO] Remote OBR update disabled (enable with -DremoteOBR)
[JENKINS] Archiving <https://builds.apache.org/job/Karaf-2.2.x/ws/karaf/main/pom.xml>
to /home/hudson/hudson/jobs/Karaf-2.2.x/modules/org.apache.karaf$org.apache.karaf.main/builds/2013-04-25_13-38-48/archive/org.apache.karaf/org.apache.karaf.main/2.2.11-SNAPSHOT/org.apache.karaf.main-2.2.11-SNAPSHOT.pom
[JENKINS] Archiving <https://builds.apache.org/job/Karaf-2.2.x/ws/karaf/main/target/org.apache.karaf.main-2.2.11-SNAPSHOT.jar>
to /home/hudson/hudson/jobs/Karaf-2.2.x/modules/org.apache.karaf$org.apache.karaf.main/builds/2013-04-25_13-38-48/archive/org.apache.karaf/org.apache.karaf.main/2.2.11-20130425.133953-118/org.apache.karaf.main-2.2.11-20130425.133953-118.jar
[INFO] ------------------------------------------------------------------------
[INFO] Building Apache Karaf :: JAAS
[INFO]    task-segment: [clean, install, deploy]
[INFO] ------------------------------------------------------------------------
[INFO] [clean:clean {execution: default-clean}]
[INFO] [bundle:cleanVersions {execution: cleanVersions}]
[WARNING] The parameter expression: 'project.build.resources' used in mojo: 'process' has
been deprecated. Use 'project.resources' instead.
[INFO] [remote-resources:process {execution: default}]
[INFO] [antrun:run {execution: copy-notice}]
[INFO] Executing tasks

main:
     [copy] Warning: Could not find file <https://builds.apache.org/job/Karaf-2.2.x/ws/karaf/jaas/NOTICE>
to copy.
[INFO] Executed tasks
[INFO] [site:attach-descriptor {execution: default-attach-descriptor}]
[INFO] [install:install {execution: default-install}]
[INFO] Installing <https://builds.apache.org/job/Karaf-2.2.x/ws/karaf/jaas/pom.xml>
to <https://builds.apache.org/job/Karaf-2.2.x/ws/.repository/org/apache/karaf/jaas/jaas/2.2.11-SNAPSHOT/jaas-2.2.11-SNAPSHOT.pom>
[INFO] [bundle:cleanVersions {execution: cleanVersions}]
[WARNING] The parameter expression: 'project.build.resources' used in mojo: 'process' has
been deprecated. Use 'project.resources' instead.
[INFO] [remote-resources:process {execution: default}]
[INFO] [antrun:run {execution: copy-notice}]
[INFO] Executing tasks

main:
     [copy] Warning: Could not find file <https://builds.apache.org/job/Karaf-2.2.x/ws/karaf/jaas/NOTICE>
to copy.
[INFO] Executed tasks
[INFO] [site:attach-descriptor {execution: default-attach-descriptor}]
[INFO] [install:install {execution: default-install}]
[INFO] Installing <https://builds.apache.org/job/Karaf-2.2.x/ws/karaf/jaas/pom.xml>
to <https://builds.apache.org/job/Karaf-2.2.x/ws/.repository/org/apache/karaf/jaas/jaas/2.2.11-SNAPSHOT/jaas-2.2.11-SNAPSHOT.pom>
[INFO] [deploy:deploy {execution: default-deploy}]
[INFO] Retrieving previous build number from apache.snapshots.https
[WARNING] *** CHECKSUM FAILED - Checksum failed on download: local = '77a15442bed80e9b15bc87b3921a1d4e31f43dad';
remote = '94ad070d92fa7b7345b022aed2c2aaf3c155c864' - RETRYING
[WARNING] *** CHECKSUM FAILED - Checksum failed on download: local = '77a15442bed80e9b15bc87b3921a1d4e31f43dad';
remote = '94ad070d92fa7b7345b022aed2c2aaf3c155c864' - IGNORING
Uploading: https://repository.apache.org/content/repositories/snapshots/org/apache/karaf/jaas/jaas/2.2.11-SNAPSHOT/jaas-2.2.11-20130425.133953-118.pom
1K uploaded  (jaas-2.2.11-20130425.133953-118.pom)
[INFO] Retrieving previous metadata from apache.snapshots.https
[WARNING] *** CHECKSUM FAILED - Checksum failed on download: local = '77a15442bed80e9b15bc87b3921a1d4e31f43dad';
remote = '94ad070d92fa7b7345b022aed2c2aaf3c155c864' - RETRYING
[WARNING] *** CHECKSUM FAILED - Checksum failed on download: local = '77a15442bed80e9b15bc87b3921a1d4e31f43dad';
remote = '94ad070d92fa7b7345b022aed2c2aaf3c155c864' - IGNORING
[INFO] Uploading repository metadata for: 'snapshot org.apache.karaf.jaas:jaas:2.2.11-SNAPSHOT'
[INFO] Retrieving previous metadata from apache.snapshots.https
[INFO] Uploading repository metadata for: 'artifact org.apache.karaf.jaas:jaas'
Sending e-mails to: commits@karaf.apache.org
ERROR: Maven JVM terminated unexpectedly with exit code 143


Mime
View raw message