karaf-commits mailing list archives

Site index · List index
Message view « Date » · « Thread »
Top « Date » · « Thread »
From Apache Jenkins Server <jenk...@builds.apache.org>
Subject Build failed in Jenkins: Karaf #1983
Date Sat, 27 Apr 2013 07:46:35 GMT
See <https://builds.apache.org/job/Karaf/1983/>

------------------------------------------
[...truncated 12734 lines...]
[org.apache.karaf.tooling.exam.container.internal.KarafTestContainer] : Shutting down the test container (Pax Runner)
Tests run: 1, Failures: 0, Errors: 0, Skipped: 0, Time elapsed: 29.178 sec
Running org.apache.karaf.tooling.exam.regression.KarafBundleContextNotNullTest
[org.ops4j.pax.exam.spi.DefaultExamSystem] : Pax Exam System (Version: 2.6.0) created.
[org.ops4j.store.intern.TemporaryStore] : Storage Area is /tmp/1367048697534-0
[org.apache.karaf.tooling.exam.container.internal.RMIRegistry] : Created Registry on 21455
[org.apache.karaf.tooling.exam.container.internal.RMIRegistry] : Currently 43 out of 98 ports are in use. Port range is from 21413 up to 21511
[org.apache.karaf.tooling.exam.container.internal.RMIRegistry] : Created Registry on 21456
[org.apache.karaf.tooling.exam.container.internal.RMIRegistry] : Currently 44 out of 98 ports are in use. Port range is from 21413 up to 21511
[org.ops4j.pax.exam.spi.PaxExamRuntime] : Found TestContainerFactory: org.apache.karaf.tooling.exam.container.internal.KarafTestContainerFactory
[org.ops4j.pax.exam.junit.JUnit4TestRunner] : No User defined probe hook found
[org.ops4j.pax.exam.spi.intern.DefaultTestAddress] : NEW ADDRESS= PaxExam-98c4b55f-453c-4c38-923a-3e7b0595f50b parent=null root=[TestAddress:PaxExam-98c4b55f-453c-4c38-923a-3e7b0595f50b root:PaxExam-98c4b55f-453c-4c38-923a-3e7b0595f50b] args=[Ljava.lang.Object;@1f4ace9
[org.ops4j.pax.tinybundles.core.intern.RawBuilder] : make()
[org.ops4j.store.intern.TemporaryStore] : Enter store()
[org.ops4j.pax.tinybundles.core.intern.RawBuilder] : Creating manifest from added headers.
[org.ops4j.pax.tinybundles.core.intern.RawBuilder] : DynamicImport-Package = *
[org.ops4j.pax.tinybundles.core.intern.RawBuilder] : Ignore-Package = 
[org.ops4j.pax.tinybundles.core.intern.RawBuilder] : PaxExam-Executable = PaxExam-98c4b55f-453c-4c38-923a-3e7b0595f50b,
[org.ops4j.pax.tinybundles.core.intern.RawBuilder] : PaxExam-98c4b55f-453c-4c38-923a-3e7b0595f50b = org.apache.karaf.tooling.exam.regression.KarafBundleContextNotNullTest;test
[org.ops4j.pax.tinybundles.core.intern.RawBuilder] : Bundle-SymbolicName = PAXEXAM-PROBE-432577d0-3418-4c80-ab88-e48a76d0aca9
[org.ops4j.pax.tinybundles.core.intern.RawBuilder] : Bundle-ManifestVersion = 2
[org.ops4j.pax.tinybundles.core.intern.RawBuilder] : Copying resource org/apache/karaf/tooling/exam/regression/KarafBundleContextNotNullTest.class
[org.ops4j.pax.tinybundles.core.intern.RawBuilder] : Copying resource org/apache/karaf/tooling/exam/regression/DuplicatedPropertyEntryTest.class
[org.ops4j.pax.tinybundles.core.intern.RawBuilder] : Copying resource replaced.cfg
[org.ops4j.pax.tinybundles.core.intern.RawBuilder] : Copying resource org/apache/karaf/tooling/exam/regression/MixFeatureAndDeployFolderFalseTest.class
[org.ops4j.pax.tinybundles.core.intern.RawBuilder] : Copying resource org/apache/karaf/tooling/exam/regression/UnpackDirectoryTest.class
[org.ops4j.pax.tinybundles.core.intern.RawBuilder] : Copying resource org/apache/karaf/tooling/exam/regression/KarafWithBundleTest.class
[org.ops4j.pax.tinybundles.core.intern.RawBuilder] : Copying resource org/apache/karaf/tooling/exam/regression/RegressionTestSupport.class
[org.ops4j.pax.tinybundles.core.intern.RawBuilder] : Copying resource org/apache/karaf/tooling/exam/regression/SystemPackageOptionTest.class
[org.ops4j.pax.tinybundles.core.intern.RawBuilder] : Copying resource META-INF/DEPENDENCIES
[org.ops4j.pax.tinybundles.core.intern.RawBuilder] : Copying resource org/apache/karaf/tooling/exam/regression/ReplaceConfigFileTest.class
[org.ops4j.pax.tinybundles.core.intern.RawBuilder] : Copying resource org/apache/karaf/tooling/exam/regression/Backward224Test.class
[org.ops4j.pax.tinybundles.core.intern.RawBuilder] : Copying resource META-INF/LICENSE
[org.ops4j.pax.tinybundles.core.intern.RawBuilder] : Copying resource org/apache/karaf/tooling/exam/regression/TurnOffLogModificationTest.class
[org.ops4j.pax.tinybundles.core.intern.RawBuilder] : Copying resource BaseKarafDefaultFrameworkDuplicatedPropertyEntryTestFirstKey
[org.ops4j.pax.tinybundles.core.intern.RawBuilder] : Copying resource org/apache/karaf/tooling/exam/regression/BootClasspathLibraryOptionTest.class
[org.ops4j.pax.tinybundles.core.intern.RawBuilder] : Copying resource org/apache/karaf/tooling/exam/regression/LogLevelTest.class
[org.ops4j.pax.tinybundles.core.intern.RawBuilder] : Copying resource org/apache/karaf/tooling/exam/regression/BaseKarafDefaultFrameworkTest.class
[org.ops4j.pax.tinybundles.core.intern.RawBuilder] : Copying resource org/apache/karaf/tooling/exam/regression/KarafWithBundleTest$1.class
[org.ops4j.pax.tinybundles.core.intern.RawBuilder] : Copying resource org/apache/karaf/tooling/exam/regression/UseFeatureInsteadOfDeployFolderTest.class
[org.ops4j.pax.tinybundles.core.intern.RawBuilder] : Copying resource org/apache/karaf/tooling/exam/regression/BootDelegationOptionTest.class
[org.ops4j.pax.tinybundles.core.intern.RawBuilder] : Copying resource org/apache/karaf/tooling/exam/regression/supports/ServletActivator.class
[org.ops4j.pax.tinybundles.core.intern.RawBuilder] : Copying resource org/apache/karaf/tooling/exam/regression/BundleStartLvlTest.class
[org.ops4j.pax.tinybundles.core.intern.RawBuilder] : Copying resource org/apache/karaf/tooling/exam/regression/FrameworkWithShellOffTest.class
[org.ops4j.pax.tinybundles.core.intern.RawBuilder] : Copying resource META-INF/NOTICE
[org.ops4j.pax.tinybundles.core.intern.RawBuilder] : Copying resource org/apache/karaf/tooling/exam/regression/FeaturesScannerProvisionTest.class
[org.ops4j.pax.tinybundles.core.intern.RawBuilder] : Copying resource org/apache/karaf/tooling/exam/regression/VmSettingsTest.class
[org.ops4j.pax.tinybundles.core.intern.RawBuilder] : Copying resource BaseKarafDefaultFrameworkDuplicatedPropertyEntryTestSecondKey
[org.ops4j.pax.tinybundles.core.intern.RawBuilder] : Copying resource org/apache/karaf/tooling/exam/regression/KeepFolderTest.class
[org.ops4j.pax.tinybundles.core.intern.RawBuilder] : Copying resource org/apache/karaf/tooling/exam/regression/EquinoxFrameworkTest.class
[org.ops4j.pax.tinybundles.core.intern.RawBuilder] : Copying resource org/apache/karaf/tooling/exam/regression/supports/ServletActivator$HttpServiceTracker.class
[org.ops4j.pax.tinybundles.core.intern.RawBuilder] : Copying resource org/apache/karaf/tooling/exam/regression/DuplicatedPropertyEntryFromFileTest.class
[org.ops4j.pax.tinybundles.core.intern.RawBuilder] : Copying resource org/apache/karaf/tooling/exam/regression/NativeKarafFrameworkTest.class
[org.ops4j.pax.tinybundles.core.intern.RawBuilder] : Copying resource org/apache/karaf/tooling/exam/regression/supports/EchoServlet.class
[org.ops4j.pax.tinybundles.core.intern.RawBuilder] : Copying resource org/apache/karaf/tooling/exam/regression/RemoveRuntimeFolderTest.class
[org.ops4j.store.intern.TemporaryStore] : Exit store(): a372cb122b82a1e74094af19fee79867391268e8
[org.ops4j.pax.exam.spi.DefaultExamReactor] : Staging reactor with probes: 1 using strategy: org.ops4j.pax.exam.spi.reactors.AllConfinedStagedReactorFactory@16defcf
[org.ops4j.store.intern.TemporaryStore] : Storage Area is /tmp/1367048697589-0
[org.ops4j.pax.exam.spi.intern.DefaultTestAddress] : NEW ADDRESS= PaxExam-7bb8f8b3-48b8-424d-b0c0-9ccd042f88ea parent=[TestAddress:PaxExam-98c4b55f-453c-4c38-923a-3e7b0595f50b root:PaxExam-98c4b55f-453c-4c38-923a-3e7b0595f50b] root=[TestAddress:PaxExam-98c4b55f-453c-4c38-923a-3e7b0595f50b root:PaxExam-98c4b55f-453c-4c38-923a-3e7b0595f50b] args=[Ljava.lang.Object;@9b00cb
[org.ops4j.pax.exam.junit.JUnit4TestRunner] : Invoke test:org.apache.karaf.tooling.exam.regression.KarafBundleContextNotNullTest.test:KarafTestContainer{mvn:org.apache.karaf/apache-karaf/3.0.0-SNAPSHOT/zip} @ [TestAddress:PaxExam-7bb8f8b3-48b8-424d-b0c0-9ccd042f88ea root:PaxExam-98c4b55f-453c-4c38-923a-3e7b0595f50b] Arguments: [Ljava.lang.Object;@1f4ace9
[org.ops4j.store.intern.TemporaryStore] : Storage Area is /tmp/1367048697596-0
[org.ops4j.pax.url.mvn.internal.Connection] : Resolving [mvn:org.apache.karaf/apache-karaf/3.0.0-SNAPSHOT/zip]
[org.ops4j.pax.url.mvn.internal.LogAdapter] : Using manager SimpleLocalRepositoryManager with priority 0 for <https://builds.apache.org/job/Karaf/ws/.repository>
[org.ops4j.pax.url.mvn.internal.LogAdapter] : Skipped remote update check for org.apache.karaf:apache-karaf:3.0.0-SNAPSHOT/maven-metadata.xml, locally installed metadata up-to-date.
[org.ops4j.pax.url.mvn.internal.AetherBasedResolver] : Resolved (org.apache.karaf:apache-karaf:zip:3.0.0-SNAPSHOT) as <https://builds.apache.org/job/Karaf/ws/.repository/org/apache/karaf/apache-karaf/3.0.0-SNAPSHOT/apache-karaf-3.0.0-SNAPSHOT.zip>
[org.apache.karaf.tooling.exam.container.internal.KarafTestContainer] : Test Container started in 1 millis
[org.apache.karaf.tooling.exam.container.internal.KarafTestContainer] : Wait for test container to finish its initialization [ RelativeTimeout value = 180000 ]
[org.ops4j.pax.exam.rbc.client.RemoteBundleContextClient] : Waiting for remote bundle context.. on 21456 name: 2d08b55f-520d-4f1d-be96-088cc1dba13d timout: [ RelativeTimeout value = 180000 ]
2013-04-27 07:45:01,841 | WARN  | FelixStartLevel  | FeatureValidationUtil            | 10 - org.apache.karaf.features.core - 3.0.0.SNAPSHOT | Old style feature file without namespace found (URI: file:/home/jenkins/.pax/exam/examfeatures.xml). This format is deprecated and support for it will soon be removed
        __ __                  ____      
       / //_/____ __________ _/ __/      
      / ,<  / __ `/ ___/ __ `/ /_        
     / /| |/ /_/ / /  / /_/ / __/        
    /_/ |_|\__,_/_/   \__,_/_/         

  Apache Karaf (3.0.0-SNAPSHOT)

Hit '<tab>' for a list of available commands
and '[cmd] --help' for help on a specific command.
Hit '<ctrl-d>' or type 'system:shutdown' or 'logout' to shutdown Karaf.

karaf@root()> [org.ops4j.pax.exam.rbc.client.RemoteBundleContextClient] : Remote bundle context found after 4963 millis
[org.ops4j.pax.exam.container.remote.RBCRemoteTarget] : Preparing and Installing bundle (from stream )..
[org.ops4j.pax.exam.rbc.client.RemoteBundleContextClient] : Packing probe into memory for true RMI. Hopefully things will fill in..
[org.ops4j.pax.exam.container.remote.RBCRemoteTarget] : Installed bundle (from stream) as ID: 93
[org.ops4j.pax.exam.container.remote.RBCRemoteTarget] : call [[TestAddress:PaxExam-7bb8f8b3-48b8-424d-b0c0-9ccd042f88ea root:PaxExam-98c4b55f-453c-4c38-923a-3e7b0595f50b]]
=================================
Before bundleContext validation
=================================
=================================
After  bundleContext validation
=================================
[org.apache.karaf.tooling.exam.container.internal.KarafTestContainer] : Shutting down the test container (Pax Runner)
[org.ops4j.pax.exam.spi.DefaultExamSystem] : Option org.apache.karaf.tooling.exam.options.KarafDistributionConfigurationOption has not been recognized.
[org.ops4j.pax.exam.spi.DefaultExamSystem] : Option org.ops4j.pax.exam.options.FrameworkStartLevelOption has not been recognized.
Tests run: 1, Failures: 0, Errors: 0, Skipped: 0, Time elapsed: 5.684 sec
Running org.apache.karaf.tooling.exam.regression.EquinoxFrameworkTest
[org.ops4j.pax.exam.spi.DefaultExamSystem] : Pax Exam System (Version: 2.6.0) created.
[org.ops4j.store.intern.TemporaryStore] : Storage Area is /tmp/1367048703218-0
[org.apache.karaf.tooling.exam.container.internal.RMIRegistry] : Created Registry on 21457
[org.apache.karaf.tooling.exam.container.internal.RMIRegistry] : Currently 45 out of 98 ports are in use. Port range is from 21413 up to 21511
[org.apache.karaf.tooling.exam.container.internal.RMIRegistry] : Created Registry on 21458
[org.apache.karaf.tooling.exam.container.internal.RMIRegistry] : Currently 46 out of 98 ports are in use. Port range is from 21413 up to 21511
[org.ops4j.pax.exam.spi.PaxExamRuntime] : Found TestContainerFactory: org.apache.karaf.tooling.exam.container.internal.KarafTestContainerFactory
[org.ops4j.pax.exam.junit.JUnit4TestRunner] : No User defined probe hook found
[org.ops4j.pax.exam.spi.intern.DefaultTestAddress] : NEW ADDRESS= PaxExam-4e711faf-0718-4d42-8da7-fe01ab0a0c52 parent=null root=[TestAddress:PaxExam-4e711faf-0718-4d42-8da7-fe01ab0a0c52 root:PaxExam-4e711faf-0718-4d42-8da7-fe01ab0a0c52] args=[Ljava.lang.Object;@94baa
[org.ops4j.pax.tinybundles.core.intern.RawBuilder] : make()
[org.ops4j.store.intern.TemporaryStore] : Enter store()
[org.ops4j.pax.tinybundles.core.intern.RawBuilder] : Creating manifest from added headers.
[org.ops4j.pax.tinybundles.core.intern.RawBuilder] : DynamicImport-Package = *
[org.ops4j.pax.tinybundles.core.intern.RawBuilder] : Ignore-Package = 
[org.ops4j.pax.tinybundles.core.intern.RawBuilder] : PaxExam-Executable = PaxExam-4e711faf-0718-4d42-8da7-fe01ab0a0c52,
[org.ops4j.pax.tinybundles.core.intern.RawBuilder] : Bundle-SymbolicName = PAXEXAM-PROBE-b3c4f343-abfb-4f9d-89db-ebc35077b7a1
[org.ops4j.pax.tinybundles.core.intern.RawBuilder] : PaxExam-4e711faf-0718-4d42-8da7-fe01ab0a0c52 = org.apache.karaf.tooling.exam.regression.EquinoxFrameworkTest;test
[org.ops4j.pax.tinybundles.core.intern.RawBuilder] : Bundle-ManifestVersion = 2
[org.ops4j.pax.tinybundles.core.intern.RawBuilder] : Copying resource org/apache/karaf/tooling/exam/regression/KarafBundleContextNotNullTest.class
[org.ops4j.pax.tinybundles.core.intern.RawBuilder] : Copying resource org/apache/karaf/tooling/exam/regression/DuplicatedPropertyEntryTest.class
[org.ops4j.pax.tinybundles.core.intern.RawBuilder] : Copying resource replaced.cfg
[org.ops4j.pax.tinybundles.core.intern.RawBuilder] : Copying resource org/apache/karaf/tooling/exam/regression/MixFeatureAndDeployFolderFalseTest.class
[org.ops4j.pax.tinybundles.core.intern.RawBuilder] : Copying resource org/apache/karaf/tooling/exam/regression/UnpackDirectoryTest.class
[org.ops4j.pax.tinybundles.core.intern.RawBuilder] : Copying resource org/apache/karaf/tooling/exam/regression/KarafWithBundleTest.class
[org.ops4j.pax.tinybundles.core.intern.RawBuilder] : Copying resource org/apache/karaf/tooling/exam/regression/RegressionTestSupport.class
[org.ops4j.pax.tinybundles.core.intern.RawBuilder] : Copying resource org/apache/karaf/tooling/exam/regression/SystemPackageOptionTest.class
[org.ops4j.pax.tinybundles.core.intern.RawBuilder] : Copying resource META-INF/DEPENDENCIES
[org.ops4j.pax.tinybundles.core.intern.RawBuilder] : Copying resource org/apache/karaf/tooling/exam/regression/ReplaceConfigFileTest.class
[org.ops4j.pax.tinybundles.core.intern.RawBuilder] : Copying resource org/apache/karaf/tooling/exam/regression/Backward224Test.class
[org.ops4j.pax.tinybundles.core.intern.RawBuilder] : Copying resource META-INF/LICENSE
[org.ops4j.pax.tinybundles.core.intern.RawBuilder] : Copying resource org/apache/karaf/tooling/exam/regression/TurnOffLogModificationTest.class
[org.ops4j.pax.tinybundles.core.intern.RawBuilder] : Copying resource BaseKarafDefaultFrameworkDuplicatedPropertyEntryTestFirstKey
[org.ops4j.pax.tinybundles.core.intern.RawBuilder] : Copying resource org/apache/karaf/tooling/exam/regression/BootClasspathLibraryOptionTest.class
[org.ops4j.pax.tinybundles.core.intern.RawBuilder] : Copying resource org/apache/karaf/tooling/exam/regression/LogLevelTest.class
[org.ops4j.pax.tinybundles.core.intern.RawBuilder] : Copying resource org/apache/karaf/tooling/exam/regression/BaseKarafDefaultFrameworkTest.class
[org.ops4j.pax.tinybundles.core.intern.RawBuilder] : Copying resource org/apache/karaf/tooling/exam/regression/KarafWithBundleTest$1.class
[org.ops4j.pax.tinybundles.core.intern.RawBuilder] : Copying resource org/apache/karaf/tooling/exam/regression/UseFeatureInsteadOfDeployFolderTest.class
[org.ops4j.pax.tinybundles.core.intern.RawBuilder] : Copying resource org/apache/karaf/tooling/exam/regression/BootDelegationOptionTest.class
[org.ops4j.pax.tinybundles.core.intern.RawBuilder] : Copying resource org/apache/karaf/tooling/exam/regression/supports/ServletActivator.class
[org.ops4j.pax.tinybundles.core.intern.RawBuilder] : Copying resource org/apache/karaf/tooling/exam/regression/BundleStartLvlTest.class
[org.ops4j.pax.tinybundles.core.intern.RawBuilder] : Copying resource org/apache/karaf/tooling/exam/regression/FrameworkWithShellOffTest.class
[org.ops4j.pax.tinybundles.core.intern.RawBuilder] : Copying resource META-INF/NOTICE
[org.ops4j.pax.tinybundles.core.intern.RawBuilder] : Copying resource org/apache/karaf/tooling/exam/regression/FeaturesScannerProvisionTest.class
[org.ops4j.pax.tinybundles.core.intern.RawBuilder] : Copying resource org/apache/karaf/tooling/exam/regression/VmSettingsTest.class
[org.ops4j.pax.tinybundles.core.intern.RawBuilder] : Copying resource BaseKarafDefaultFrameworkDuplicatedPropertyEntryTestSecondKey
[org.ops4j.pax.tinybundles.core.intern.RawBuilder] : Copying resource org/apache/karaf/tooling/exam/regression/KeepFolderTest.class
[org.ops4j.pax.tinybundles.core.intern.RawBuilder] : Copying resource org/apache/karaf/tooling/exam/regression/EquinoxFrameworkTest.class
[org.ops4j.pax.tinybundles.core.intern.RawBuilder] : Copying resource org/apache/karaf/tooling/exam/regression/supports/ServletActivator$HttpServiceTracker.class
[org.ops4j.pax.tinybundles.core.intern.RawBuilder] : Copying resource org/apache/karaf/tooling/exam/regression/DuplicatedPropertyEntryFromFileTest.class
[org.ops4j.pax.tinybundles.core.intern.RawBuilder] : Copying resource org/apache/karaf/tooling/exam/regression/NativeKarafFrameworkTest.class
[org.ops4j.pax.tinybundles.core.intern.RawBuilder] : Copying resource org/apache/karaf/tooling/exam/regression/supports/EchoServlet.class
[org.ops4j.pax.tinybundles.core.intern.RawBuilder] : Copying resource org/apache/karaf/tooling/exam/regression/RemoveRuntimeFolderTest.class
[org.ops4j.store.intern.TemporaryStore] : Exit store(): 237c4ac2b2faacefe73d7307e0b2a4ad0b28aec5
[org.ops4j.pax.exam.spi.DefaultExamReactor] : Staging reactor with probes: 1 using strategy: org.ops4j.pax.exam.spi.reactors.AllConfinedStagedReactorFactory@12724bb
[org.ops4j.store.intern.TemporaryStore] : Storage Area is /tmp/1367048703273-0
[org.ops4j.pax.exam.spi.intern.DefaultTestAddress] : NEW ADDRESS= PaxExam-51348300-f84c-456f-bbf9-b332714a5787 parent=[TestAddress:PaxExam-4e711faf-0718-4d42-8da7-fe01ab0a0c52 root:PaxExam-4e711faf-0718-4d42-8da7-fe01ab0a0c52] root=[TestAddress:PaxExam-4e711faf-0718-4d42-8da7-fe01ab0a0c52 root:PaxExam-4e711faf-0718-4d42-8da7-fe01ab0a0c52] args=[Ljava.lang.Object;@dc7cdd
[org.ops4j.pax.exam.junit.JUnit4TestRunner] : Invoke test:org.apache.karaf.tooling.exam.regression.EquinoxFrameworkTest.test:KarafTestContainer{mvn:org.apache.karaf/apache-karaf/3.0.0-SNAPSHOT/zip} @ [TestAddress:PaxExam-51348300-f84c-456f-bbf9-b332714a5787 root:PaxExam-4e711faf-0718-4d42-8da7-fe01ab0a0c52] Arguments: [Ljava.lang.Object;@94baa
[org.ops4j.store.intern.TemporaryStore] : Storage Area is /tmp/1367048703274-0
[org.ops4j.pax.url.mvn.internal.Connection] : Resolving [mvn:org.apache.karaf/apache-karaf/3.0.0-SNAPSHOT/zip]
[org.ops4j.pax.url.mvn.internal.LogAdapter] : Using manager SimpleLocalRepositoryManager with priority 0 for <https://builds.apache.org/job/Karaf/ws/.repository>
[org.ops4j.pax.url.mvn.internal.LogAdapter] : Skipped remote update check for org.apache.karaf:apache-karaf:3.0.0-SNAPSHOT/maven-metadata.xml, locally installed metadata up-to-date.
[org.ops4j.pax.url.mvn.internal.AetherBasedResolver] : Resolved (org.apache.karaf:apache-karaf:zip:3.0.0-SNAPSHOT) as <https://builds.apache.org/job/Karaf/ws/.repository/org/apache/karaf/apache-karaf/3.0.0-SNAPSHOT/apache-karaf-3.0.0-SNAPSHOT.zip>
[org.apache.karaf.tooling.exam.container.internal.KarafTestContainer] : Test Container started in 0 millis
[org.apache.karaf.tooling.exam.container.internal.KarafTestContainer] : Wait for test container to finish its initialization [ RelativeTimeout value = 180000 ]
[org.ops4j.pax.exam.rbc.client.RemoteBundleContextClient] : Waiting for remote bundle context.. on 21458 name: e60939d7-6336-4d2e-b0f5-3e07f7081027 timout: [ RelativeTimeout value = 180000 ]
2013-04-27 07:45:10,427 | WARN  | Event Dispatcher | FeatureValidationUtil            | 10 - org.apache.karaf.features.core - 3.0.0.SNAPSHOT | Old style feature file without namespace found (URI: file:/home/jenkins/.pax/exam/examfeatures.xml). This format is deprecated and support for it will soon be removed
        __ __                  ____      
       / //_/____ __________ _/ __/      
      / ,<  / __ `/ ___/ __ `/ /_        
     / /| |/ /_/ / /  / /_/ / __/        
    /_/ |_|\__,_/_/   \__,_/_/         

  Apache Karaf (3.0.0-SNAPSHOT)

Hit '<tab>' for a list of available commands
and '[cmd] --help' for help on a specific command.
Hit '<ctrl-d>' or type 'system:shutdown' or 'logout' to shutdown Karaf.

karaf@root()> [org.ops4j.pax.exam.rbc.client.RemoteBundleContextClient] : Remote bundle context found after 12095 millis
[org.ops4j.pax.exam.container.remote.RBCRemoteTarget] : Preparing and Installing bundle (from stream )..
[org.ops4j.pax.exam.rbc.client.RemoteBundleContextClient] : Packing probe into memory for true RMI. Hopefully things will fill in..
[org.ops4j.pax.exam.container.remote.RBCRemoteTarget] : Installed bundle (from stream) as ID: 93
[org.ops4j.pax.exam.container.remote.RBCRemoteTarget] : call [[TestAddress:PaxExam-51348300-f84c-456f-bbf9-b332714a5787 root:PaxExam-4e711faf-0718-4d42-8da7-fe01ab0a0c52]]
[org.apache.karaf.tooling.exam.container.internal.KarafTestContainer] : Shutting down the test container (Pax Runner)
[org.ops4j.pax.exam.spi.DefaultExamSystem] : Option org.apache.karaf.tooling.exam.options.KarafDistributionConfigurationOption has not been recognized.
[org.ops4j.pax.exam.spi.DefaultExamSystem] : Option org.ops4j.pax.exam.options.FrameworkStartLevelOption has not been recognized.
Tests run: 1, Failures: 0, Errors: 0, Skipped: 0, Time elapsed: 13.552 sec

Results :

Failed tests:   test:org.apache.karaf.tooling.exam.regression.FeaturesScannerProvisionTest.test:KarafTestContainer{mvn:org.apache.karaf\/apache-karaf\/3.0.0-SNAPSHOT\/zip}(org.apache.karaf.tooling.exam.regression.FeaturesScannerProvisionTest)

Tests run: 23, Failures: 1, Errors: 0, Skipped: 0

[ERROR] There are test failures.

Please refer to <https://builds.apache.org/job/Karaf/ws/karaf/tooling/exam/regression/target/surefire-reports> for the individual test results.
ERROR: Processing failed due to a bug in the code. Please report this to jenkinsci-users@googlegroups.com
hudson.remoting.RequestAbortedException: hudson.remoting.RequestAbortedException: java.io.StreamCorruptedException: invalid type code: 00
	at hudson.remoting.Request.call(Request.java:174)
	at hudson.remoting.Channel.call(Channel.java:672)
	at hudson.maven.ProcessCache$MavenProcess.call(ProcessCache.java:156)
	at hudson.maven.MavenModuleSetBuild$MavenModuleSetBuildExecution.doRun(MavenModuleSetBuild.java:755)
	at hudson.model.AbstractBuild$AbstractBuildExecution.run(AbstractBuild.java:592)
	at hudson.model.Run.execute(Run.java:1568)
	at hudson.maven.MavenModuleSetBuild.run(MavenModuleSetBuild.java:477)
	at hudson.model.ResourceController.execute(ResourceController.java:88)
	at hudson.model.Executor.run(Executor.java:236)
Caused by: hudson.remoting.RequestAbortedException: java.io.StreamCorruptedException: invalid type code: 00
	at hudson.remoting.Request.abort(Request.java:299)
	at hudson.remoting.Channel.terminate(Channel.java:732)
	at hudson.slaves.Channels$1.terminate(Channels.java:77)
	at hudson.remoting.SynchronousCommandTransport$ReaderThread.run(SynchronousCommandTransport.java:69)
Caused by: java.io.StreamCorruptedException: invalid type code: 00
	at java.io.ObjectInputStream.readObject0(ObjectInputStream.java:1374)
	at java.io.ObjectInputStream.defaultReadFields(ObjectInputStream.java:1970)
	at java.io.ObjectInputStream.readSerialData(ObjectInputStream.java:1894)
	at java.io.ObjectInputStream.readOrdinaryObject(ObjectInputStream.java:1777)
	at java.io.ObjectInputStream.readObject0(ObjectInputStream.java:1347)
	at java.io.ObjectInputStream.readObject(ObjectInputStream.java:369)
	at hudson.remoting.Command.readFrom(Command.java:92)
	at hudson.remoting.ClassicCommandTransport.read(ClassicCommandTransport.java:59)
	at hudson.remoting.SynchronousCommandTransport$ReaderThread.run(SynchronousCommandTransport.java:48)
project=hudson.maven.MavenModuleSet@5a066cc1[Karaf]
project.getModules()=[hudson.maven.MavenModule@1740d77b[Karaf/org.apache.karaf:apache-karaf][Karaf/org.apache.karaf:apache-karaf][relativePath:assemblies/apache-karaf], hudson.maven.MavenModule@2202d82a[Karaf/org.apache.karaf:apache-karaf-minimal][Karaf/org.apache.karaf:apache-karaf-minimal][relativePath:assemblies/apache-karaf-minimal], hudson.maven.MavenModule@68bdbed7[Karaf/org.apache.karaf:archetypes][Karaf/org.apache.karaf:archetypes][relativePath:archetypes], hudson.maven.MavenModule@13c4afa[Karaf/org.apache.karaf:demos][Karaf/org.apache.karaf:demos][relativePath:assemblies/demos], hudson.maven.MavenModule@64f1ebcd[Karaf/org.apache.karaf:itests][Karaf/org.apache.karaf:itests][relativePath:itests], hudson.maven.MavenModule@1d5e63b8[Karaf/org.apache.karaf:karaf][Karaf/org.apache.karaf:karaf][relativePath:], hudson.maven.MavenModule@46b01381[Karaf/org.apache.karaf:manual][Karaf/org.apache.karaf:manual][relativePath:manual], hudson.maven.MavenModule@1fe4d418[Karaf/org.apache.karaf:org.apache.karaf.client][Karaf/org.apache.karaf:org.apache.karaf.client][relativePath:client], hudson.maven.MavenModule@51d09e68[Karaf/org.apache.karaf:org.apache.karaf.doc][Karaf/org.apache.karaf:org.apache.karaf.doc][relativePath:documentation], hudson.maven.MavenModule@68208403[Karaf/org.apache.karaf:org.apache.karaf.exception][Karaf/org.apache.karaf:org.apache.karaf.exception][relativePath:exception], hudson.maven.MavenModule@2ebb165d[Karaf/org.apache.karaf:org.apache.karaf.main][Karaf/org.apache.karaf:org.apache.karaf.main][relativePath:main], hudson.maven.MavenModule@574fe7ce[Karaf/org.apache.karaf:org.apache.karaf.management][Karaf/org.apache.karaf:org.apache.karaf.management][relativePath:management], hudson.maven.MavenModule@7cb94ba2[Karaf/org.apache.karaf:org.apache.karaf.util][Karaf/org.apache.karaf:org.apache.karaf.util][relativePath:util], hudson.maven.MavenModule@3efbb22a[Karaf/org.apache.karaf:org.osgi.compendium][Karaf/org.apache.karaf:org.osgi.compendium][relativePath:osgicompendium], hudson.maven.MavenModule@7e6e03b3[Karaf/org.apache.karaf:org.osgi.core][Karaf/org.apache.karaf:org.osgi.core][relativePath:osgicore], hudson.maven.MavenModule@6914b8a6[Karaf/org.apache.karaf:scheduler][Karaf/org.apache.karaf:scheduler][relativePath:scheduler], hudson.maven.MavenModule@68b51d9d[Karaf/org.apache.karaf:tests][Karaf/org.apache.karaf:tests][relativePath:itests/tests], hudson.maven.MavenModule@4aab641f[Karaf/org.apache.karaf.admin:admin][Karaf/org.apache.karaf.admin:admin][relativePath:admin], hudson.maven.MavenModule@3a3a5585[Karaf/org.apache.karaf.admin:org.apache.karaf.admin.command][Karaf/org.apache.karaf.admin:org.apache.karaf.admin.command][relativePath:admin/command], hudson.maven.MavenModule@4bc4aca0[Karaf/org.apache.karaf.admin:org.apache.karaf.admin.core][Karaf/org.apache.karaf.admin:org.apache.karaf.admin.core][relativePath:admin/core], hudson.maven.MavenModule@5d21633c[Karaf/org.apache.karaf.admin:org.apache.karaf.admin.management][Karaf/org.apache.karaf.admin:org.apache.karaf.admin.management][relativePath:admin/management], hudson.maven.MavenModule@3afa27e8[Karaf/org.apache.karaf.archetypes:archetypes-command][Karaf/org.apache.karaf.archetypes:archetypes-command][relativePath:archetypes/command], hudson.maven.MavenModule@7d520e97[Karaf/org.apache.karaf.archetypes:archetypes-itests][Karaf/org.apache.karaf.archetypes:archetypes-itests][relativePath:archetypes/itests], hudson.maven.MavenModule@4f66d02f[Karaf/org.apache.karaf.archetypes:karaf-assembly-archetype][Karaf/org.apache.karaf.archetypes:karaf-assembly-archetype][relativePath:archetypes/assembly], hudson.maven.MavenModule@66ede662[Karaf/org.apache.karaf.archetypes:karaf-blueprint-archetype][Karaf/org.apache.karaf.archetypes:karaf-blueprint-archetype][relativePath:archetypes/blueprint], hudson.maven.MavenModule@cb060b9[Karaf/org.apache.karaf.archetypes:karaf-bundle-archetype][Karaf/org.apache.karaf.archetypes:karaf-bundle-archetype][relativePath:archetypes/bundle], hudson.maven.MavenModule@f9e1831[Karaf/org.apache.karaf.archetypes:karaf-command-archetype][Karaf/org.apache.karaf.archetypes:karaf-command-archetype][relativePath:archetypes/command], hudson.maven.MavenModule@544640f9[Karaf/org.apache.karaf.archetypes:karaf-feature-archetype][Karaf/org.apache.karaf.archetypes:karaf-feature-archetype][relativePath:archetypes/feature], hudson.maven.MavenModule@5053c6a8[Karaf/org.apache.karaf.archetypes:karaf-kar-archetype][Karaf/org.apache.karaf.archetypes:karaf-kar-archetype][relativePath:archetypes/kar], hudson.maven.MavenModule@163c1bc8[Karaf/org.apache.karaf.assemblies:apache-karaf][Karaf/org.apache.karaf.assemblies:apache-karaf][relativePath:assemblies/apache-karaf], hudson.maven.MavenModule@4443f2df[Karaf/org.apache.karaf.assemblies:apache-karaf-full][Karaf/org.apache.karaf.assemblies:apache-karaf-full][relativePath:assemblies/apache-karaf-full], hudson.maven.MavenModule@48fe317c[Karaf/org.apache.karaf.assemblies:apache-karaf-minimal][Karaf/org.apache.karaf.assemblies:apache-karaf-minimal][relativePath:assemblies/apache-karaf-minimal], hudson.maven.MavenModule@2c1768cb[Karaf/org.apache.karaf.assemblies:assemblies][Karaf/org.apache.karaf.assemblies:assemblies][relativePath:assemblies], hudson.maven.MavenModule@2862e954[Karaf/org.apache.karaf.assemblies.features:enterprise][Karaf/org.apache.karaf.assemblies.features:enterprise][relativePath:assemblies/features/enterprise], hudson.maven.MavenModule@34e0fe0a[Karaf/org.apache.karaf.assemblies.features:features][Karaf/org.apache.karaf.assemblies.features:features][relativePath:assemblies/features], hudson.maven.MavenModule@75c49e82[Karaf/org.apache.karaf.assemblies.features:karaf-framework][Karaf/org.apache.karaf.assemblies.features:karaf-framework][relativePath:assemblies/features/framework], hudson.maven.MavenModule@3f82a535[Karaf/org.apache.karaf.assemblies.features:karaf-full][Karaf/org.apache.karaf.assemblies.features:karaf-full][relativePath:assemblies/features/full], hudson.maven.MavenModule@1a2c5b26[Karaf/org.apache.karaf.assemblies.features:org.apache.karaf.feature.enterprise][Karaf/org.apache.karaf.assemblies.features:org.apache.karaf.feature.enterprise][relativePath:assemblies/features/enterprise], hudson.maven.MavenModule@56142936[Karaf/org.apache.karaf.assemblies.features:org.apache.karaf.feature.framework][Karaf/org.apache.karaf.assemblies.features:org.apache.karaf.feature.framework][relativePath:assemblies/features/framework], hudson.maven.MavenModule@459dc460[Karaf/org.apache.karaf.assemblies.features:org.apache.karaf.feature.full][Karaf/org.apache.karaf.assemblies.features:org.apache.karaf.feature.full][relativePath:assemblies/features/full], hudson.maven.MavenModule@78c79e54[Karaf/org.apache.karaf.assemblies.features:org.apache.karaf.feature.karaf-framework][Karaf/org.apache.karaf.assemblies.features:org.apache.karaf.feature.karaf-framework][relativePath:assemblies/features/framework], hudson.maven.MavenModule@796bdabe[Karaf/org.apache.karaf.assemblies.features:org.apache.karaf.feature.karaf-full][Karaf/org.apache.karaf.assemblies.features:org.apache.karaf.feature.karaf-full][relativePath:assemblies/features/full], hudson.maven.MavenModule@17e62e39[Karaf/org.apache.karaf.assemblies.features:org.apache.karaf.feature.standard][Karaf/org.apache.karaf.assemblies.features:org.apache.karaf.feature.standard][relativePath:assemblies/features/standard], hudson.maven.MavenModule@8e4ac71[Karaf/org.apache.karaf.assemblies.features:org.apache.karaf.features.enterprise][Karaf/org.apache.karaf.assemblies.features:org.apache.karaf.features.enterprise][relativePath:assemblies/features/enterprise], hudson.maven.MavenModule@5cf53346[Karaf/org.apache.karaf.assemblies.features:org.apache.karaf.features.framework][Karaf/org.apache.karaf.assemblies.features:org.apache.karaf.features.framework][relativePath:assemblies/features/framework], hudson.maven.MavenModule@65f96857[Karaf/org.apache.karaf.assemblies.features:org.apache.karaf.features.standard][Karaf/org.apache.karaf.assemblies.features:org.apache.karaf.features.standard][relativePath:assemblies/features/standard], hudson.maven.MavenModule@59315c0e[Karaf/org.apache.karaf.assemblies.features:standard][Karaf/org.apache.karaf.assemblies.features:standard][relativePath:assemblies/features/standard], hudson.maven.MavenModule@1f465da5[Karaf/org.apache.karaf.bundle:bundle][Karaf/org.apache.karaf.bundle:bundle][relativePath:bundle], hudson.maven.MavenModule@44ae0bad[Karaf/org.apache.karaf.bundle:org.apache.karaf.bundle.command][Karaf/org.apache.karaf.bundle:org.apache.karaf.bundle.command][relativePath:bundle/command], hudson.maven.MavenModule@7e80ae14[Karaf/org.apache.karaf.bundle:org.apache.karaf.bundle.core][Karaf/org.apache.karaf.bundle:org.apache.karaf.bundle.core][relativePath:bundle/core], hudson.maven.MavenModule@3792c8e1[Karaf/org.apache.karaf.bundle:org.apache.karaf.bundle.management][Karaf/org.apache.karaf.bundle:org.apache.karaf.bundle.management][relativePath:bundle/management], hudson.maven.MavenModule@3224e3ee[Karaf/org.apache.karaf.bundle:org.apache.karaf.bundle.springstate][Karaf/org.apache.karaf.bundle:org.apache.karaf.bundle.springstate][relativePath:bundle/springstate], hudson.maven.MavenModule@13f037fa[Karaf/org.apache.karaf.config:config][Karaf/org.apache.karaf.config:config][relativePath:config], hudson.maven.MavenModule@7feb084f[Karaf/org.apache.karaf.config:org.apache.karaf.config.command][Karaf/org.apache.karaf.config:org.apache.karaf.config.command][relativePath:config/command], hudson.maven.MavenModule@1f6ebc25[Karaf/org.apache.karaf.config:org.apache.karaf.config.core][Karaf/org.apache.karaf.config:org.apache.karaf.config.core][relativePath:config/core], hudson.maven.MavenModule@5c24848[Karaf/org.apache.karaf.config:org.apache.karaf.config.management][Karaf/org.apache.karaf.config:org.apache.karaf.config.management][relativePath:config/management], hudson.maven.MavenModule@1f023142[Karaf/org.apache.karaf.demos:demos][Karaf/org.apache.karaf.demos:demos][relativePath:demos], hudson.maven.MavenModule@48eff3f5[Karaf/org.apache.karaf.demos:dump][Karaf/org.apache.karaf.demos:dump][relativePath:demos/dump], hudson.maven.MavenModule@1797f3c[Karaf/org.apache.karaf.demos:my-kar][Karaf/org.apache.karaf.demos:my-kar][relativePath:demos/deployer/kar], hudson.maven.MavenModule@161771ec[Karaf/org.apache.karaf.demos:org.apache.karaf.demos.branding][Karaf/org.apache.karaf.demos:org.apache.karaf.demos.branding][relativePath:demos/branding], hudson.maven.MavenModule@4f903ce5[Karaf/org.apache.karaf.demos:org.apache.karaf.demos.branding.shell][Karaf/org.apache.karaf.demos:org.apache.karaf.demos.branding.shell][relativePath:demos/branding], hudson.maven.MavenModule@68e0732[Karaf/org.apache.karaf.demos:org.apache.karaf.demos.command][Karaf/org.apache.karaf.demos:org.apache.karaf.demos.command][relativePath:demos/command], hudson.maven.MavenModule@5d384848[Karaf/org.apache.karaf.demos:org.apache.karaf.demos.command.custom][Karaf/org.apache.karaf.demos:org.apache.karaf.demos.command.custom][relativePath:demos/command], hudson.maven.MavenModule@567a66fa[Karaf/org.apache.karaf.demos:org.apache.karaf.demos.deployer][Karaf/org.apache.karaf.demos:org.apache.karaf.demos.deployer][relativePath:demos/deployer], hudson.maven.MavenModule@1a119ec8[Karaf/org.apache.karaf.demos:org.apache.karaf.demos.dump][Karaf/org.apache.karaf.demos:org.apache.karaf.demos.dump][relativePath:demos/dump], hudson.maven.MavenModule@7acf69d6[Karaf/org.apache.karaf.demos:org.apache.karaf.demos.web][Karaf/org.apache.karaf.demos:org.apache.karaf.demos.web][relativePath:demos/web], hudson.maven.MavenModule@7dfed370[Karaf/org.apache.karaf.demos:web][Karaf/org.apache.karaf.demos:web][relativePath:demos/web], hudson.maven.MavenModule@64eb9eaf[Karaf/org.apache.karaf.demos.deployer.bundle:my-bundle][Karaf/org.apache.karaf.demos.deployer.bundle:my-bundle][relativePath:demos/deployer/bundle], hudson.maven.MavenModule@28ff26ec[Karaf/org.apache.karaf.deployer:deployer][Karaf/org.apache.karaf.deployer:deployer][relativePath:deployer], hudson.maven.MavenModule@75464fb[Karaf/org.apache.karaf.deployer:org.apache.karaf.deployer.blueprint][Karaf/org.apache.karaf.deployer:org.apache.karaf.deployer.blueprint][relativePath:deployer/blueprint], hudson.maven.MavenModule@35b19e7f[Karaf/org.apache.karaf.deployer:org.apache.karaf.deployer.features][Karaf/org.apache.karaf.deployer:org.apache.karaf.deployer.features][relativePath:deployer/features], hudson.maven.MavenModule@201cbf63[Karaf/org.apache.karaf.deployer:org.apache.karaf.deployer.kar][Karaf/org.apache.karaf.deployer:org.apache.karaf.deployer.kar][relativePath:deployer/kar], hudson.maven.MavenModule@3f590d0d[Karaf/org.apache.karaf.deployer:org.apache.karaf.deployer.spring][Karaf/org.apache.karaf.deployer:org.apache.karaf.deployer.spring][relativePath:deployer/spring], hudson.maven.MavenModule@472d9f97[Karaf/org.apache.karaf.deployer:org.apache.karaf.deployer.war][Karaf/org.apache.karaf.deployer:org.apache.karaf.deployer.war][relativePath:deployer/war], hudson.maven.MavenModule@6f67f0f8[Karaf/org.apache.karaf.deployer:org.apache.karaf.deployer.wrap][Karaf/org.apache.karaf.deployer:org.apache.karaf.deployer.wrap][relativePath:deployer/wrap], hudson.maven.MavenModule@4489703[Karaf/org.apache.karaf.dev:dev][Karaf/org.apache.karaf.dev:dev][relativePath:dev], hudson.maven.MavenModule@39b24827[Karaf/org.apache.karaf.dev:org.apache.karaf.dev.command][Karaf/org.apache.karaf.dev:org.apache.karaf.dev.command][relativePath:dev/command], hudson.maven.MavenModule@679f1608[Karaf/org.apache.karaf.dev:org.apache.karaf.dev.core][Karaf/org.apache.karaf.dev:org.apache.karaf.dev.core][relativePath:dev/core], hudson.maven.MavenModule@10fd62ec[Karaf/org.apache.karaf.diagnostic:diagnostic][Karaf/org.apache.karaf.diagnostic:diagnostic][relativePath:diagnostic], hudson.maven.MavenModule@6b697caa[Karaf/org.apache.karaf.diagnostic:org.apache.karaf.diagnostic.command][Karaf/org.apache.karaf.diagnostic:org.apache.karaf.diagnostic.command][relativePath:diagnostic/command], hudson.maven.MavenModule@7d5f9c5d[Karaf/org.apache.karaf.diagnostic:org.apache.karaf.diagnostic.common][Karaf/org.apache.karaf.diagnostic:org.apache.karaf.diagnostic.common][relativePath:diagnostic/common], hudson.maven.MavenModule@5a77b3fd[Karaf/org.apache.karaf.diagnostic:org.apache.karaf.diagnostic.core][Karaf/org.apache.karaf.diagnostic:org.apache.karaf.diagnostic.core][relativePath:diagnostic/core], hudson.maven.MavenModule@1012ddf9[Karaf/org.apache.karaf.diagnostic:org.apache.karaf.diagnostic.management][Karaf/org.apache.karaf.diagnostic:org.apache.karaf.diagnostic.management][relativePath:diagnostic/management], hudson.maven.MavenModule@68c9d571[Karaf/org.apache.karaf.features:enterprise][Karaf/org.apache.karaf.features:enterprise][relativePath:assemblies/features/enterprise], hudson.maven.MavenModule@1adc2376[Karaf/org.apache.karaf.features:features][Karaf/org.apache.karaf.features:features][relativePath:features], hudson.maven.MavenModule@6a9c25c0[Karaf/org.apache.karaf.features:framework][Karaf/org.apache.karaf.features:framework][relativePath:assemblies/features/framework], hudson.maven.MavenModule@317296ee[Karaf/org.apache.karaf.features:org.apache.karaf.features.command][Karaf/org.apache.karaf.features:org.apache.karaf.features.command][relativePath:features/command], hudson.maven.MavenModule@5a12fc9e[Karaf/org.apache.karaf.features:org.apache.karaf.features.core][Karaf/org.apache.karaf.features:org.apache.karaf.features.core][relativePath:features/core], hudson.maven.MavenModule@46ab0ead[Karaf/org.apache.karaf.features:org.apache.karaf.features.encryption][Karaf/org.apache.karaf.features:org.apache.karaf.features.encryption][relativePath:features/encryption], hudson.maven.MavenModule@850a41a[Karaf/org.apache.karaf.features:org.apache.karaf.features.management][Karaf/org.apache.karaf.features:org.apache.karaf.features.management][relativePath:features/management], hudson.maven.MavenModule@14871745[Karaf/org.apache.karaf.features:org.apache.karaf.features.obr][Karaf/org.apache.karaf.features:org.apache.karaf.features.obr][relativePath:features/obr], hudson.maven.MavenModule@3108bd8a[Karaf/org.apache.karaf.features:spring][Karaf/org.apache.karaf.features:spring][relativePath:assemblies/features/spring], hudson.maven.MavenModule@34d3c82c[Karaf/org.apache.karaf.features:standard][Karaf/org.apache.karaf.features:standard][relativePath:assemblies/features/standard], hudson.maven.MavenModule@6645ab39[Karaf/org.apache.karaf.features.assembly:assembly][Karaf/org.apache.karaf.features.assembly:assembly][relativePath:features/assembly], hudson.maven.MavenModule@67ec5fa3[Karaf/org.apache.karaf.features.assembly:enterprise][Karaf/org.apache.karaf.features.assembly:enterprise][relativePath:features/assembly/enterprise], hudson.maven.MavenModule@4f7afba2[Karaf/org.apache.karaf.features.assembly:karaf-framework][Karaf/org.apache.karaf.features.assembly:karaf-framework][relativePath:features/assembly/framework], hudson.maven.MavenModule@131e7172[Karaf/org.apache.karaf.features.assembly:standard][Karaf/org.apache.karaf.features.assembly:standard][relativePath:features/assembly/standard], hudson.maven.MavenModule@3bfadbcc[Karaf/org.apache.karaf.http:http][Karaf/org.apache.karaf.http:http][relativePath:http], hudson.maven.MavenModule@52744cd7[Karaf/org.apache.karaf.http:org.apache.karaf.http.command][Karaf/org.apache.karaf.http:org.apache.karaf.http.command][relativePath:http/command], hudson.maven.MavenModule@5160e18b[Karaf/org.apache.karaf.http:org.apache.karaf.http.core][Karaf/org.apache.karaf.http:org.apache.karaf.http.core][relativePath:http/core], hudson.maven.MavenModule@2f77966a[Karaf/org.apache.karaf.instance:instance][Karaf/org.apache.karaf.instance:instance][relativePath:instance], hudson.maven.MavenModule@5434217e[Karaf/org.apache.karaf.instance:org.apache.karaf.instance.command][Karaf/org.apache.karaf.instance:org.apache.karaf.instance.command][relativePath:instance/command], hudson.maven.MavenModule@2a830262[Karaf/org.apache.karaf.instance:org.apache.karaf.instance.core][Karaf/org.apache.karaf.instance:org.apache.karaf.instance.core][relativePath:instance/core], hudson.maven.MavenModule@33a9fd2c[Karaf/org.apache.karaf.instance:org.apache.karaf.instance.management][Karaf/org.apache.karaf.instance:org.apache.karaf.instance.management][relativePath:instance/management], hudson.maven.MavenModule@5d2c6e33[Karaf/org.apache.karaf.itests:dependencies][Karaf/org.apache.karaf.itests:dependencies][relativePath:itests/dependencies], hudson.maven.MavenModule@7f1185bb[Karaf/org.apache.karaf.itests:itests][Karaf/org.apache.karaf.itests:itests][relativePath:itests], hudson.maven.MavenModule@ff7060f[Karaf/org.apache.karaf.itests:kittests][Karaf/org.apache.karaf.itests:kittests][relativePath:itests/kittests], hudson.maven.MavenModule@22aecaf9[Karaf/org.apache.karaf.itests:tests][Karaf/org.apache.karaf.itests:tests][relativePath:itests/tests], hudson.maven.MavenModule@5762f929[Karaf/org.apache.karaf.jaas:jaas][Karaf/org.apache.karaf.jaas:jaas][relativePath:jaas], hudson.maven.MavenModule@22d41f91[Karaf/org.apache.karaf.jaas:org.apache.karaf.jaas.boot][Karaf/org.apache.karaf.jaas:org.apache.karaf.jaas.boot][relativePath:jaas/boot], hudson.maven.MavenModule@14647a74[Karaf/org.apache.karaf.jaas:org.apache.karaf.jaas.command][Karaf/org.apache.karaf.jaas:org.apache.karaf.jaas.command][relativePath:jaas/command], hudson.maven.MavenModule@50a36021[Karaf/org.apache.karaf.jaas:org.apache.karaf.jaas.config][Karaf/org.apache.karaf.jaas:org.apache.karaf.jaas.config][relativePath:jaas/config], hudson.maven.MavenModule@15fc3fe3[Karaf/org.apache.karaf.jaas:org.apache.karaf.jaas.jasypt][Karaf/org.apache.karaf.jaas:org.apache.karaf.jaas.jasypt][relativePath:jaas/jasypt], hudson.maven.MavenModule@18fb339[Karaf/org.apache.karaf.jaas:org.apache.karaf.jaas.karafrealm][Karaf/org.apache.karaf.jaas:org.apache.karaf.jaas.karafrealm][relativePath:jaas/karafrealm], hudson.maven.MavenModule@63c65b5b[Karaf/org.apache.karaf.jaas:org.apache.karaf.jaas.modules][Karaf/org.apache.karaf.jaas:org.apache.karaf.jaas.modules][relativePath:jaas/modules], hudson.maven.MavenModule@7397e689[Karaf/org.apache.karaf.kar:kar][Karaf/org.apache.karaf.kar:kar][relativePath:kar], hudson.maven.MavenModule@79a067a8[Karaf/org.apache.karaf.kar:org.apache.karaf.kar.command][Karaf/org.apache.karaf.kar:org.apache.karaf.kar.command][relativePath:kar/command], hudson.maven.MavenModule@11f584fa[Karaf/org.apache.karaf.kar:org.apache.karaf.kar.core][Karaf/org.apache.karaf.kar:org.apache.karaf.kar.core][relativePath:kar/core], hudson.maven.MavenModule@13f63fc[Karaf/org.apache.karaf.kar:org.apache.karaf.kar.management][Karaf/org.apache.karaf.kar:org.apache.karaf.kar.management][relativePath:kar/management], hudson.maven.MavenModule@ded424c[Karaf/org.apache.karaf.log:log][Karaf/org.apache.karaf.log:log][relativePath:log], hudson.maven.MavenModule@539b92b8[Karaf/org.apache.karaf.log:org.apache.karaf.log.command][Karaf/org.apache.karaf.log:org.apache.karaf.log.command][relativePath:log/command], hudson.maven.MavenModule@abd98ea[Karaf/org.apache.karaf.log:org.apache.karaf.log.core][Karaf/org.apache.karaf.log:org.apache.karaf.log.core][relativePath:log/core], hudson.maven.MavenModule@25823028[Karaf/org.apache.karaf.management:management][Karaf/org.apache.karaf.management:management][relativePath:management], hudson.maven.MavenModule@627a555[Karaf/org.apache.karaf.management:org.apache.karaf.management.server][Karaf/org.apache.karaf.management:org.apache.karaf.management.server][relativePath:management/server], hudson.maven.MavenModule@68bd3607[Karaf/org.apache.karaf.management.mbeans:mbeans][Karaf/org.apache.karaf.management.mbeans:mbeans][relativePath:management/mbeans], hudson.maven.MavenModule@5e263b49[Karaf/org.apache.karaf.management.mbeans:org.apache.karaf.management.mbeans.bundles][Karaf/org.apache.karaf.management.mbeans:org.apache.karaf.management.mbeans.bundles][relativePath:management/mbeans/bundles], hudson.maven.MavenModule@1ffe65e9[Karaf/org.apache.karaf.management.mbeans:org.apache.karaf.management.mbeans.config][Karaf/org.apache.karaf.management.mbeans:org.apache.karaf.management.mbeans.config][relativePath:management/mbeans/config], hudson.maven.MavenModule@76d4b467[Karaf/org.apache.karaf.management.mbeans:org.apache.karaf.management.mbeans.dev][Karaf/org.apache.karaf.management.mbeans:org.apache.karaf.management.mbeans.dev][relativePath:management/mbeans/dev], hudson.maven.MavenModule@6901324[Karaf/org.apache.karaf.management.mbeans:org.apache.karaf.management.mbeans.http][Karaf/org.apache.karaf.management.mbeans:org.apache.karaf.management.mbeans.http][relativePath:management/mbeans/http], hudson.maven.MavenModule@5cd8a3d9[Karaf/org.apache.karaf.management.mbeans:org.apache.karaf.management.mbeans.log][Karaf/org.apache.karaf.management.mbeans:org.apache.karaf.management.mbeans.log][relativePath:management/mbeans/log], hudson.maven.MavenModule@12ed2b2e[Karaf/org.apache.karaf.management.mbeans:org.apache.karaf.management.mbeans.obr][Karaf/org.apache.karaf.management.mbeans:org.apache.karaf.management.mbeans.obr][relativePath:management/mbeans/obr], hudson.maven.MavenModule@10ade2b7[Karaf/org.apache.karaf.management.mbeans:org.apache.karaf.management.mbeans.packages][Karaf/org.apache.karaf.management.mbeans:org.apache.karaf.management.mbeans.packages][relativePath:management/mbeans/packages], hudson.maven.MavenModule@7ff64ef[Karaf/org.apache.karaf.management.mbeans:org.apache.karaf.management.mbeans.services][Karaf/org.apache.karaf.management.mbeans:org.apache.karaf.management.mbeans.services][relativePath:management/mbeans/services], hudson.maven.MavenModule@103b8b03[Karaf/org.apache.karaf.management.mbeans:org.apache.karaf.management.mbeans.system][Karaf/org.apache.karaf.management.mbeans:org.apache.karaf.management.mbeans.system][relativePath:management/mbeans/system], hudson.maven.MavenModule@35237a48[Karaf/org.apache.karaf.management.mbeans:org.apache.karaf.management.mbeans.web][Karaf/org.apache.karaf.management.mbeans:org.apache.karaf.management.mbeans.web][relativePath:management/mbeans/web], hudson.maven.MavenModule@14d7729b[Karaf/org.apache.karaf.obr:obr][Karaf/org.apache.karaf.obr:obr][relativePath:obr], hudson.maven.MavenModule@4ca528cd[Karaf/org.apache.karaf.obr:org.apache.karaf.obr.command][Karaf/org.apache.karaf.obr:org.apache.karaf.obr.command][relativePath:obr/command], hudson.maven.MavenModule@6f19d20a[Karaf/org.apache.karaf.obr:org.apache.karaf.obr.core][Karaf/org.apache.karaf.obr:org.apache.karaf.obr.core][relativePath:obr/core], hudson.maven.MavenModule@2c312839[Karaf/org.apache.karaf.osgi:org.osgi.compendium][Karaf/org.apache.karaf.osgi:org.osgi.compendium][relativePath:osgi/compendium], hudson.maven.MavenModule@4f47ccd9[Karaf/org.apache.karaf.osgi:org.osgi.core][Karaf/org.apache.karaf.osgi:org.osgi.core][relativePath:osgi/core], hudson.maven.MavenModule@72d9e338[Karaf/org.apache.karaf.osgi:osgi][Karaf/org.apache.karaf.osgi:osgi][relativePath:osgi], hudson.maven.MavenModule@82cc782[Karaf/org.apache.karaf.package:org.apache.karaf.package.command][Karaf/org.apache.karaf.package:org.apache.karaf.package.command][relativePath:package/command], hudson.maven.MavenModule@33de2bff[Karaf/org.apache.karaf.package:org.apache.karaf.package.core][Karaf/org.apache.karaf.package:org.apache.karaf.package.core][relativePath:package/core], hudson.maven.MavenModule@3ed4ac70[Karaf/org.apache.karaf.package:org.apache.karaf.package.management][Karaf/org.apache.karaf.package:org.apache.karaf.package.management][relativePath:package/management], hudson.maven.MavenModule@3f1a8cf3[Karaf/org.apache.karaf.package:package][Karaf/org.apache.karaf.package:package][relativePath:package], hudson.maven.MavenModule@681bc5e2[Karaf/org.apache.karaf.region:org.apache.karaf.region.command][Karaf/org.apache.karaf.region:org.apache.karaf.region.command][relativePath:region/command], hudson.maven.MavenModule@7c850d49[Karaf/org.apache.karaf.region:org.apache.karaf.region.commands][Karaf/org.apache.karaf.region:org.apache.karaf.region.commands][relativePath:region/commands], hudson.maven.MavenModule@775cadd3[Karaf/org.apache.karaf.region:org.apache.karaf.region.core][Karaf/org.apache.karaf.region:org.apache.karaf.region.core][relativePath:region/core], hudson.maven.MavenModule@659834dd[Karaf/org.apache.karaf.region:org.apache.karaf.region.persist][Karaf/org.apache.karaf.region:org.apache.karaf.region.persist][relativePath:region/persist], hudson.maven.MavenModule@6bb6cd46[Karaf/org.apache.karaf.region:region][Karaf/org.apache.karaf.region:region][relativePath:region], hudson.maven.MavenModule@2e5ee5e9[Karaf/org.apache.karaf.scheduler:org.apache.karaf.scheduler.core][Karaf/org.apache.karaf.scheduler:org.apache.karaf.scheduler.core][relativePath:scheduler/core], hudson.maven.MavenModule@58483bc7[Karaf/org.apache.karaf.scr:org.apache.karaf.scr.command][Karaf/org.apache.karaf.scr:org.apache.karaf.scr.command][relativePath:scr/command], hudson.maven.MavenModule@6e4cb318[Karaf/org.apache.karaf.scr:org.apache.karaf.scr.examples][Karaf/org.apache.karaf.scr:org.apache.karaf.scr.examples][relativePath:scr/examples], hudson.maven.MavenModule@32b737d[Karaf/org.apache.karaf.scr:org.apache.karaf.scr.feature][Karaf/org.apache.karaf.scr:org.apache.karaf.scr.feature][relativePath:scr/feature], hudson.maven.MavenModule@6d82253a[Karaf/org.apache.karaf.scr:org.apache.karaf.scr.management][Karaf/org.apache.karaf.scr:org.apache.karaf.scr.management][relativePath:scr/management], hudson.maven.MavenModule@7b5a3b00[Karaf/org.apache.karaf.scr:scr][Karaf/org.apache.karaf.scr:scr][relativePath:scr], hudson.maven.MavenModule@79e4a7b4[Karaf/org.apache.karaf.scr.examples:org.apache.karaf.scr.examples.component.factories][Karaf/org.apache.karaf.scr.examples:org.apache.karaf.scr.examples.component.factories][relativePath:scr/examples/component-factory], hudson.maven.MavenModule@7a7c2b7e[Karaf/org.apache.karaf.scr.examples:org.apache.karaf.scr.examples.managed.service][Karaf/org.apache.karaf.scr.examples:org.apache.karaf.scr.examples.managed.service][relativePath:scr/examples/managed-service], hudson.maven.MavenModule@a5f8bd4[Karaf/org.apache.karaf.scr.examples:org.apache.karaf.scr.examples.service][Karaf/org.apache.karaf.scr.examples:org.apache.karaf.scr.examples.service][relativePath:scr/examples/service], hudson.maven.MavenModule@60d7bc44[Karaf/org.apache.karaf.service:org.apache.karaf.service.command][Karaf/org.apache.karaf.service:org.apache.karaf.service.command][relativePath:service/command], hudson.maven.MavenModule@73894607[Karaf/org.apache.karaf.service:org.apache.karaf.service.core][Karaf/org.apache.karaf.service:org.apache.karaf.service.core][relativePath:service/core], hudson.maven.MavenModule@3954b0d3[Karaf/org.apache.karaf.service:service][Karaf/org.apache.karaf.service:service][relativePath:service], hudson.maven.MavenModule@19ab152b[Karaf/org.apache.karaf.shell:org.apache.karaf.shell.bundles][Karaf/org.apache.karaf.shell:org.apache.karaf.shell.bundles][relativePath:shell/bundles], hudson.maven.MavenModule@67250a0c[Karaf/org.apache.karaf.shell:org.apache.karaf.shell.commands][Karaf/org.apache.karaf.shell:org.apache.karaf.shell.commands][relativePath:shell/commands], hudson.maven.MavenModule@2efac737[Karaf/org.apache.karaf.shell:org.apache.karaf.shell.config][Karaf/org.apache.karaf.shell:org.apache.karaf.shell.config][relativePath:shell/config], hudson.maven.MavenModule@30b6cebb[Karaf/org.apache.karaf.shell:org.apache.karaf.shell.console][Karaf/org.apache.karaf.shell:org.apache.karaf.shell.console][relativePath:shell/console], hudson.maven.MavenModule@522d03f9[Karaf/org.apache.karaf.shell:org.apache.karaf.shell.dev][Karaf/org.apache.karaf.shell:org.apache.karaf.shell.dev][relativePath:shell/dev], hudson.maven.MavenModule@31be6ff9[Karaf/org.apache.karaf.shell:org.apache.karaf.shell.help][Karaf/org.apache.karaf.shell:org.apache.karaf.shell.help][relativePath:shell/help], hudson.maven.MavenModule@95ffa95[Karaf/org.apache.karaf.shell:org.apache.karaf.shell.http][Karaf/org.apache.karaf.shell:org.apache.karaf.shell.http][relativePath:shell/http], hudson.maven.MavenModule@7c3c5101[Karaf/org.apache.karaf.shell:org.apache.karaf.shell.log][Karaf/org.apache.karaf.shell:org.apache.karaf.shell.log][relativePath:shell/log], hudson.maven.MavenModule@5bea585f[Karaf/org.apache.karaf.shell:org.apache.karaf.shell.obr][Karaf/org.apache.karaf.shell:org.apache.karaf.shell.obr][relativePath:shell/obr], hudson.maven.MavenModule@764ff41d[Karaf/org.apache.karaf.shell:org.apache.karaf.shell.osgi][Karaf/org.apache.karaf.shell:org.apache.karaf.shell.osgi][relativePath:shell/osgi], hudson.maven.MavenModule@7b23d899[Karaf/org.apache.karaf.shell:org.apache.karaf.shell.packages][Karaf/org.apache.karaf.shell:org.apache.karaf.shell.packages][relativePath:shell/packages], hudson.maven.MavenModule@6e6163f7[Karaf/org.apache.karaf.shell:org.apache.karaf.shell.services][Karaf/org.apache.karaf.shell:org.apache.karaf.shell.services][relativePath:shell/services], hudson.maven.MavenModule@4da95df2[Karaf/org.apache.karaf.shell:org.apache.karaf.shell.ssh][Karaf/org.apache.karaf.shell:org.apache.karaf.shell.ssh][relativePath:shell/ssh], hudson.maven.MavenModule@3bea25be[Karaf/org.apache.karaf.shell:org.apache.karaf.shell.system][Karaf/org.apache.karaf.shell:org.apache.karaf.shell.system][relativePath:shell/system], hudson.maven.MavenModule@2a56e2b3[Karaf/org.apache.karaf.shell:org.apache.karaf.shell.table][Karaf/org.apache.karaf.shell:org.apache.karaf.shell.table][relativePath:shell/table], hudson.maven.MavenModule@953fbad[Karaf/org.apache.karaf.shell:org.apache.karaf.shell.web][Karaf/org.apache.karaf.shell:org.apache.karaf.shell.web][relativePath:shell/web], hudson.maven.MavenModule@68b01fa3[Karaf/org.apache.karaf.shell:org.apache.karaf.shell.wrapper][Karaf/org.apache.karaf.shell:org.apache.karaf.shell.wrapper][relativePath:shell/wrapper], hudson.maven.MavenModule@2e3d6b7c[Karaf/org.apache.karaf.shell:shell][Karaf/org.apache.karaf.shell:shell][relativePath:shell], hudson.maven.MavenModule@425bb19b[Karaf/org.apache.karaf.system:org.apache.karaf.system.command][Karaf/org.apache.karaf.system:org.apache.karaf.system.command][relativePath:system/command], hudson.maven.MavenModule@2ed3c07[Karaf/org.apache.karaf.system:org.apache.karaf.system.commands][Karaf/org.apache.karaf.system:org.apache.karaf.system.commands][relativePath:system/commands], hudson.maven.MavenModule@11e95926[Karaf/org.apache.karaf.system:org.apache.karaf.system.core][Karaf/org.apache.karaf.system:org.apache.karaf.system.core][relativePath:system/core], hudson.maven.MavenModule@24fff111[Karaf/org.apache.karaf.system:org.apache.karaf.system.management][Karaf/org.apache.karaf.system:org.apache.karaf.system.management][relativePath:system/management], hudson.maven.MavenModule@6edbd6f9[Karaf/org.apache.karaf.system:system][Karaf/org.apache.karaf.system:system][relativePath:system], hudson.maven.MavenModule@1f2ba611[Karaf/org.apache.karaf.tooling:cmdhelp-maven-plugin][Karaf/org.apache.karaf.tooling:cmdhelp-maven-plugin][relativePath:tooling/cmdhelp-maven-plugin], hudson.maven.MavenModule@6aa3b613[Karaf/org.apache.karaf.tooling:features-maven-plugin][Karaf/org.apache.karaf.tooling:features-maven-plugin][relativePath:tooling/features-maven-plugin], hudson.maven.MavenModule@22feae4b[Karaf/org.apache.karaf.tooling:karaf-maven-plugin][Karaf/org.apache.karaf.tooling:karaf-maven-plugin][relativePath:tooling/karaf-maven-plugin], hudson.maven.MavenModule@2206d017[Karaf/org.apache.karaf.tooling:org.apache.karaf.tooling.testing][Karaf/org.apache.karaf.tooling:org.apache.karaf.tooling.testing][relativePath:tooling/testing], hudson.maven.MavenModule@7e64cfdf[Karaf/org.apache.karaf.tooling:tooling][Karaf/org.apache.karaf.tooling:tooling][relativePath:tooling], hudson.maven.MavenModule@c8b7a4d[Karaf/org.apache.karaf.tooling.exam:exam][Karaf/org.apache.karaf.tooling.exam:exam][relativePath:tooling/exam], hudson.maven.MavenModule@190a5baa[Karaf/org.apache.karaf.tooling.exam:org.apache.karaf.tooling.exam.container][Karaf/org.apache.karaf.tooling.exam:org.apache.karaf.tooling.exam.container][relativePath:tooling/exam/container], hudson.maven.MavenModule@770802bd[Karaf/org.apache.karaf.tooling.exam:org.apache.karaf.tooling.exam.options][Karaf/org.apache.karaf.tooling.exam:org.apache.karaf.tooling.exam.options][relativePath:tooling/exam/options], hudson.maven.MavenModule@2eec0358[Karaf/org.apache.karaf.tooling.exam:regression][Karaf/org.apache.karaf.tooling.exam:regression][relativePath:tooling/exam/regression], hudson.maven.MavenModule@8cf9e79[Karaf/org.apache.karaf.web:org.apache.karaf.web.command][Karaf/org.apache.karaf.web:org.apache.karaf.web.command][relativePath:web/command], hudson.maven.MavenModule@6d47a774[Karaf/org.apache.karaf.web:org.apache.karaf.web.commands][Karaf/org.apache.karaf.web:org.apache.karaf.web.commands][relativePath:web/commands], hudson.maven.MavenModule@76ad1e73[Karaf/org.apache.karaf.web:org.apache.karaf.web.core][Karaf/org.apache.karaf.web:org.apache.karaf.web.core][relativePath:web/core], hudson.maven.MavenModule@7b42e8b8[Karaf/org.apache.karaf.web:org.apache.karaf.web.management][Karaf/org.apache.karaf.web:org.apache.karaf.web.management][relativePath:web/management], hudson.maven.MavenModule@5faa4ce3[Karaf/org.apache.karaf.web:web][Karaf/org.apache.karaf.web:web][relativePath:web], hudson.maven.MavenModule@65bcc740[Karaf/org.apache.karaf.webconsole:org.apache.karaf.webconsole.admin][Karaf/org.apache.karaf.webconsole:org.apache.karaf.webconsole.admin][relativePath:webconsole/admin], hudson.maven.MavenModule@259dfc26[Karaf/org.apache.karaf.webconsole:org.apache.karaf.webconsole.branding][Karaf/org.apache.karaf.webconsole:org.apache.karaf.webconsole.branding][relativePath:webconsole/branding], hudson.maven.MavenModule@27153615[Karaf/org.apache.karaf.webconsole:org.apache.karaf.webconsole.console][Karaf/org.apache.karaf.webconsole:org.apache.karaf.webconsole.console][relativePath:webconsole/console], hudson.maven.MavenModule@6191b0be[Karaf/org.apache.karaf.webconsole:org.apache.karaf.webconsole.features][Karaf/org.apache.karaf.webconsole:org.apache.karaf.webconsole.features][relativePath:webconsole/features], hudson.maven.MavenModule@23eabbfd[Karaf/org.apache.karaf.webconsole:org.apache.karaf.webconsole.gogo][Karaf/org.apache.karaf.webconsole:org.apache.karaf.webconsole.gogo][relativePath:webconsole/gogo], hudson.maven.MavenModule@7dbf177[Karaf/org.apache.karaf.webconsole:org.apache.karaf.webconsole.http][Karaf/org.apache.karaf.webconsole:org.apache.karaf.webconsole.http][relativePath:webconsole/http], hudson.maven.MavenModule@78c9bfa8[Karaf/org.apache.karaf.webconsole:org.apache.karaf.webconsole.instance][Karaf/org.apache.karaf.webconsole:org.apache.karaf.webconsole.instance][relativePath:webconsole/instance], hudson.maven.MavenModule@545ec8c[Karaf/org.apache.karaf.webconsole:webconsole][Karaf/org.apache.karaf.webconsole:webconsole][relativePath:webconsole], hudson.maven.MavenModule@31acde08[Karaf/org.apache.karaf.wrapper:org.apache.karaf.wrapper.command][Karaf/org.apache.karaf.wrapper:org.apache.karaf.wrapper.command][relativePath:wrapper/command], hudson.maven.MavenModule@4cbd6eee[Karaf/org.apache.karaf.wrapper:org.apache.karaf.wrapper.commands][Karaf/org.apache.karaf.wrapper:org.apache.karaf.wrapper.commands][relativePath:wrapper/commands], hudson.maven.MavenModule@4c24f8b2[Karaf/org.apache.karaf.wrapper:org.apache.karaf.wrapper.core][Karaf/org.apache.karaf.wrapper:org.apache.karaf.wrapper.core][relativePath:wrapper/core], hudson.maven.MavenModule@28bdf29e[Karaf/org.apache.karaf.wrapper:org.apache.karaf.wrapper.management][Karaf/org.apache.karaf.wrapper:org.apache.karaf.wrapper.management][relativePath:wrapper/management], hudson.maven.MavenModule@f43952c[Karaf/org.apache.karaf.wrapper:wrapper][Karaf/org.apache.karaf.wrapper:wrapper][relativePath:wrapper]]
project.getRootModule()=hudson.maven.MavenModule@1d5e63b8[Karaf/org.apache.karaf:karaf][Karaf/org.apache.karaf:karaf][relativePath:]
FATAL: hudson.remoting.RequestAbortedException: java.io.StreamCorruptedException: invalid type code: 00
hudson.remoting.RequestAbortedException: hudson.remoting.RequestAbortedException: java.io.StreamCorruptedException: invalid type code: 00
	at hudson.remoting.Request.call(Request.java:174)
	at hudson.remoting.Channel.call(Channel.java:672)
	at hudson.maven.ProcessCache$MavenProcess.call(ProcessCache.java:156)
	at hudson.maven.MavenModuleSetBuild$MavenModuleSetBuildExecution.doRun(MavenModuleSetBuild.java:755)
	at hudson.model.AbstractBuild$AbstractBuildExecution.run(AbstractBuild.java:592)
	at hudson.model.Run.execute(Run.java:1568)
	at hudson.maven.MavenModuleSetBuild.run(MavenModuleSetBuild.java:477)
	at hudson.model.ResourceController.execute(ResourceController.java:88)
	at hudson.model.Executor.run(Executor.java:236)
Caused by: hudson.remoting.RequestAbortedException: java.io.StreamCorruptedException: invalid type code: 00
	at hudson.remoting.Request.abort(Request.java:299)
	at hudson.remoting.Channel.terminate(Channel.java:732)
	at hudson.slaves.Channels$1.terminate(Channels.java:77)
	at hudson.remoting.SynchronousCommandTransport$ReaderThread.run(SynchronousCommandTransport.java:69)
Caused by: java.io.StreamCorruptedException: invalid type code: 00
	at java.io.ObjectInputStream.readObject0(ObjectInputStream.java:1374)
	at java.io.ObjectInputStream.defaultReadFields(ObjectInputStream.java:1970)
	at java.io.ObjectInputStream.readSerialData(ObjectInputStream.java:1894)
	at java.io.ObjectInputStream.readOrdinaryObject(ObjectInputStream.java:1777)
	at java.io.ObjectInputStream.readObject0(ObjectInputStream.java:1347)
	at java.io.ObjectInputStream.readObject(ObjectInputStream.java:369)
	at hudson.remoting.Command.readFrom(Command.java:92)
	at hudson.remoting.ClassicCommandTransport.read(ClassicCommandTransport.java:59)
	at hudson.remoting.SynchronousCommandTransport$ReaderThread.run(SynchronousCommandTransport.java:48)

Mime
View raw message