karaf-commits mailing list archives

Site index · List index
Message view « Date » · « Thread »
Top « Date » · « Thread »
From Apache Jenkins Server <jenk...@builds.apache.org>
Subject Build failed in Jenkins: Karaf-2.2.x #988
Date Sun, 14 Apr 2013 01:58:54 GMT
See <https://builds.apache.org/job/Karaf-2.2.x/988/>

------------------------------------------
[...truncated 5899 lines...]
[INFO] [install:install {execution: default-install}]
[INFO] Installing <https://builds.apache.org/job/Karaf-2.2.x/ws/karaf/shell/wrapper/target/org.apache.karaf.shell.wrapper-2.2.11-SNAPSHOT.jar>
to <https://builds.apache.org/job/Karaf-2.2.x/ws/.repository/org/apache/karaf/shell/org.apache.karaf.shell.wrapper/2.2.11-SNAPSHOT/org.apache.karaf.shell.wrapper-2.2.11-SNAPSHOT.jar>
[INFO] [bundle:install {execution: default-install}]
[INFO] Installing org/apache/karaf/shell/org.apache.karaf.shell.wrapper/2.2.11-SNAPSHOT/org.apache.karaf.shell.wrapper-2.2.11-SNAPSHOT.jar
[INFO] Writing OBR metadata
[INFO] [deploy:deploy {execution: default-deploy}]
[INFO] Retrieving previous build number from apache.snapshots.https
[WARNING] *** CHECKSUM FAILED - Checksum failed on download: local = 'f26070b1ab966876d2ec46ab1ca8be8ce3df9a89';
remote = '68547e6c09277502229e65eb0f975985be21f016' - RETRYING
[WARNING] *** CHECKSUM FAILED - Checksum failed on download: local = 'f26070b1ab966876d2ec46ab1ca8be8ce3df9a89';
remote = '68547e6c09277502229e65eb0f975985be21f016' - IGNORING
Uploading: https://repository.apache.org/content/repositories/snapshots/org/apache/karaf/shell/org.apache.karaf.shell.wrapper/2.2.11-SNAPSHOT/org.apache.karaf.shell.wrapper-2.2.11-20130414.015150-105.jar
1106K uploaded  (org.apache.karaf.shell.wrapper-2.2.11-20130414.015150-105.jar)
[INFO] Uploading project information for org.apache.karaf.shell.wrapper 2.2.11-20130414.015150-105
[INFO] Retrieving previous metadata from apache.snapshots.https
[WARNING] *** CHECKSUM FAILED - Checksum failed on download: local = 'f26070b1ab966876d2ec46ab1ca8be8ce3df9a89';
remote = '68547e6c09277502229e65eb0f975985be21f016' - RETRYING
[WARNING] *** CHECKSUM FAILED - Checksum failed on download: local = 'f26070b1ab966876d2ec46ab1ca8be8ce3df9a89';
remote = '68547e6c09277502229e65eb0f975985be21f016' - IGNORING
[INFO] Uploading repository metadata for: 'snapshot org.apache.karaf.shell:org.apache.karaf.shell.wrapper:2.2.11-SNAPSHOT'
[INFO] Retrieving previous metadata from apache.snapshots.https
[INFO] Uploading repository metadata for: 'artifact org.apache.karaf.shell:org.apache.karaf.shell.wrapper'
[INFO] [bundle:deploy {execution: default-deploy}]
[INFO] Remote OBR update disabled (enable with -DremoteOBR)
[JENKINS] Archiving <https://builds.apache.org/job/Karaf-2.2.x/ws/karaf/shell/wrapper/pom.xml>
to /home/hudson/hudson/jobs/Karaf-2.2.x/modules/org.apache.karaf.shell$org.apache.karaf.shell.wrapper/builds/2013-04-14_01-50-57/archive/org.apache.karaf.shell/org.apache.karaf.shell.wrapper/2.2.11-SNAPSHOT/org.apache.karaf.shell.wrapper-2.2.11-SNAPSHOT.pom
[JENKINS] Archiving <https://builds.apache.org/job/Karaf-2.2.x/ws/karaf/shell/wrapper/target/org.apache.karaf.shell.wrapper-2.2.11-SNAPSHOT.jar>
to /home/hudson/hudson/jobs/Karaf-2.2.x/modules/org.apache.karaf.shell$org.apache.karaf.shell.wrapper/builds/2013-04-14_01-50-57/archive/org.apache.karaf.shell/org.apache.karaf.shell.wrapper/2.2.11-20130414.015150-105/org.apache.karaf.shell.wrapper-2.2.11-20130414.015150-105.jar
[INFO] ------------------------------------------------------------------------
[INFO] Building Apache Karaf :: Shell :: Development Commands
[INFO]    task-segment: [clean, install, deploy]
[INFO] ------------------------------------------------------------------------
[INFO] [clean:clean {execution: default-clean}]
[INFO] [bundle:cleanVersions {execution: cleanVersions}]
[WARNING] The parameter expression: 'project.build.resources' used in mojo: 'process' has
been deprecated. Use 'project.resources' instead.
[INFO] [remote-resources:process {execution: default}]
[INFO] [antrun:run {execution: copy-notice}]
[INFO] Executing tasks

main:
     [copy] Copying 1 file to <https://builds.apache.org/job/Karaf-2.2.x/ws/karaf/shell/dev/target/maven-shared-archive-resources/META-INF>
[INFO] Executed tasks
[debug] execute contextualize
[INFO] [resources:resources {execution: default-resources}]
[INFO] Using 'UTF-8' encoding to copy filtered resources.
[INFO] Copying 4 resources
[INFO] Copying 1 resource
[INFO] Copying 3 resources
[INFO] [compiler:compile {execution: default-compile}]
[INFO] Compiling 16 source files to <https://builds.apache.org/job/Karaf-2.2.x/ws/karaf/shell/dev/target/classes>
[debug] execute contextualize
[INFO] [resources:testResources {execution: default-testResources}]
[INFO] Using 'UTF-8' encoding to copy filtered resources.
[INFO] Copying 2 resources
[INFO] Copying 3 resources
[INFO] [compiler:testCompile {execution: default-testCompile}]
[INFO] Compiling 5 source files to <https://builds.apache.org/job/Karaf-2.2.x/ws/karaf/shell/dev/target/test-classes>
[INFO] [surefire:test {execution: default-test}]
[INFO] Surefire report directory: <https://builds.apache.org/job/Karaf-2.2.x/ws/karaf/shell/dev/target/surefire-reports>

-------------------------------------------------------
 T E S T S
-------------------------------------------------------
Running org.apache.karaf.shell.dev.framework.FelixTest
- set felix.log.level=4 in etc/config.properties

Restart Karaf now to enable Felix debug logging
- removed felix.log.level from etc/config.properties

Restart Karaf now to disable Felix debug logging
Tests run: 2, Failures: 0, Errors: 0, Skipped: 0, Time elapsed: 0.144 sec
Running org.apache.karaf.shell.dev.framework.EquinoxTest
- set osgi.debug=etc/equinox-debug.properties in etc/config.properties
- created etc/equinox-debug.properties to configure Equinox debugging options

Enable specific debug options in etc/equinox-debug.properties
and restart Karaf now to enable Equinox debug logging
- removed osgi.debug from etc/config.properties

Restart Karaf now to disable Equinox debug logging
Tests run: 2, Failures: 0, Errors: 0, Skipped: 0, Time elapsed: 0.064 sec
Running org.apache.karaf.shell.dev.util.BundlesTest
Tests run: 1, Failures: 0, Errors: 0, Skipped: 0, Time elapsed: 0.002 sec
Running org.apache.karaf.shell.dev.util.TreeTest
Tests run: 6, Failures: 0, Errors: 0, Skipped: 0, Time elapsed: 0.006 sec
Running org.apache.karaf.shell.dev.util.ImportTest
Tests run: 5, Failures: 0, Errors: 0, Skipped: 0, Time elapsed: 0.012 sec

Results :

Tests run: 16, Failures: 0, Errors: 0, Skipped: 0

[JENKINS] Recording test results
[INFO] [bundle:bundle {execution: default-bundle}]
[INFO] [install:install {execution: default-install}]
[INFO] Installing <https://builds.apache.org/job/Karaf-2.2.x/ws/karaf/shell/dev/target/org.apache.karaf.shell.dev-2.2.11-SNAPSHOT.jar>
to <https://builds.apache.org/job/Karaf-2.2.x/ws/.repository/org/apache/karaf/shell/org.apache.karaf.shell.dev/2.2.11-SNAPSHOT/org.apache.karaf.shell.dev-2.2.11-SNAPSHOT.jar>
[INFO] [bundle:install {execution: default-install}]
[INFO] Installing org/apache/karaf/shell/org.apache.karaf.shell.dev/2.2.11-SNAPSHOT/org.apache.karaf.shell.dev-2.2.11-SNAPSHOT.jar
[INFO] Writing OBR metadata
[INFO] [bundle:cleanVersions {execution: cleanVersions}]
[WARNING] The parameter expression: 'project.build.resources' used in mojo: 'process' has
been deprecated. Use 'project.resources' instead.
[INFO] [remote-resources:process {execution: default}]
[INFO] [antrun:run {execution: copy-notice}]
[INFO] Executing tasks

main:
     [copy] Copying 1 file to <https://builds.apache.org/job/Karaf-2.2.x/ws/karaf/shell/dev/target/maven-shared-archive-resources/META-INF>
[INFO] Executed tasks
[debug] execute contextualize
[INFO] [resources:resources {execution: default-resources}]
[INFO] Using 'UTF-8' encoding to copy filtered resources.
[INFO] Copying 4 resources
[INFO] Copying 1 resource
[INFO] Copying 3 resources
[INFO] Copying 3 resources
[INFO] [compiler:compile {execution: default-compile}]
[INFO] Nothing to compile - all classes are up to date
[debug] execute contextualize
[INFO] [resources:testResources {execution: default-testResources}]
[INFO] Using 'UTF-8' encoding to copy filtered resources.
[INFO] Copying 2 resources
[INFO] Copying 3 resources
[INFO] Copying 3 resources
[INFO] [compiler:testCompile {execution: default-testCompile}]
[INFO] Nothing to compile - all classes are up to date
[INFO] [surefire:test {execution: default-test}]
[INFO] Skipping execution of surefire because it has already been run for this configuration
[JENKINS] Recording test results
[INFO] [bundle:bundle {execution: default-bundle}]
[INFO] [install:install {execution: default-install}]
[INFO] Installing <https://builds.apache.org/job/Karaf-2.2.x/ws/karaf/shell/dev/target/org.apache.karaf.shell.dev-2.2.11-SNAPSHOT.jar>
to <https://builds.apache.org/job/Karaf-2.2.x/ws/.repository/org/apache/karaf/shell/org.apache.karaf.shell.dev/2.2.11-SNAPSHOT/org.apache.karaf.shell.dev-2.2.11-SNAPSHOT.jar>
[INFO] [bundle:install {execution: default-install}]
[INFO] Installing org/apache/karaf/shell/org.apache.karaf.shell.dev/2.2.11-SNAPSHOT/org.apache.karaf.shell.dev-2.2.11-SNAPSHOT.jar
[INFO] Writing OBR metadata
[INFO] [deploy:deploy {execution: default-deploy}]
[INFO] Retrieving previous build number from apache.snapshots.https
[WARNING] *** CHECKSUM FAILED - Checksum failed on download: local = 'a2286d2b492ccc26113bd98d956d8134b7b9d708';
remote = '5ac3ea896422d06b9d3e360472aa18c804a560ad' - RETRYING
[WARNING] *** CHECKSUM FAILED - Checksum failed on download: local = 'a2286d2b492ccc26113bd98d956d8134b7b9d708';
remote = '5ac3ea896422d06b9d3e360472aa18c804a560ad' - IGNORING
Uploading: https://repository.apache.org/content/repositories/snapshots/org/apache/karaf/shell/org.apache.karaf.shell.dev/2.2.11-SNAPSHOT/org.apache.karaf.shell.dev-2.2.11-20130414.015150-105.jar
156K uploaded  (org.apache.karaf.shell.dev-2.2.11-20130414.015150-105.jar)
[INFO] Uploading project information for org.apache.karaf.shell.dev 2.2.11-20130414.015150-105
[INFO] Retrieving previous metadata from apache.snapshots.https
[INFO] Uploading repository metadata for: 'artifact org.apache.karaf.shell:org.apache.karaf.shell.dev'
[INFO] Retrieving previous metadata from apache.snapshots.https
[WARNING] *** CHECKSUM FAILED - Checksum failed on download: local = 'a2286d2b492ccc26113bd98d956d8134b7b9d708';
remote = '5ac3ea896422d06b9d3e360472aa18c804a560ad' - RETRYING
[WARNING] *** CHECKSUM FAILED - Checksum failed on download: local = 'a2286d2b492ccc26113bd98d956d8134b7b9d708';
remote = '5ac3ea896422d06b9d3e360472aa18c804a560ad' - IGNORING
[INFO] Uploading repository metadata for: 'snapshot org.apache.karaf.shell:org.apache.karaf.shell.dev:2.2.11-SNAPSHOT'
[INFO] [bundle:deploy {execution: default-deploy}]
[INFO] Remote OBR update disabled (enable with -DremoteOBR)
[JENKINS] Archiving <https://builds.apache.org/job/Karaf-2.2.x/ws/karaf/shell/dev/pom.xml>
to /home/hudson/hudson/jobs/Karaf-2.2.x/modules/org.apache.karaf.shell$org.apache.karaf.shell.dev/builds/2013-04-14_01-50-57/archive/org.apache.karaf.shell/org.apache.karaf.shell.dev/2.2.11-SNAPSHOT/org.apache.karaf.shell.dev-2.2.11-SNAPSHOT.pom
[JENKINS] Archiving <https://builds.apache.org/job/Karaf-2.2.x/ws/karaf/shell/dev/target/org.apache.karaf.shell.dev-2.2.11-SNAPSHOT.jar>
to /home/hudson/hudson/jobs/Karaf-2.2.x/modules/org.apache.karaf.shell$org.apache.karaf.shell.dev/builds/2013-04-14_01-50-57/archive/org.apache.karaf.shell/org.apache.karaf.shell.dev/2.2.11-20130414.015150-105/org.apache.karaf.shell.dev-2.2.11-20130414.015150-105.jar
[INFO] ------------------------------------------------------------------------
[INFO] Building Apache Karaf :: Shell :: Web Commands
[INFO]    task-segment: [clean, install, deploy]
[INFO] ------------------------------------------------------------------------
[INFO] [clean:clean {execution: default-clean}]
[INFO] [bundle:cleanVersions {execution: cleanVersions}]
[WARNING] The parameter expression: 'project.build.resources' used in mojo: 'process' has
been deprecated. Use 'project.resources' instead.
[INFO] [remote-resources:process {execution: default}]
[INFO] [antrun:run {execution: copy-notice}]
[INFO] Executing tasks

main:
     [copy] Copying 1 file to <https://builds.apache.org/job/Karaf-2.2.x/ws/karaf/shell/web/target/maven-shared-archive-resources/META-INF>
[INFO] Executed tasks
[debug] execute contextualize
[INFO] [resources:resources {execution: default-resources}]
[INFO] Using 'UTF-8' encoding to copy filtered resources.
[INFO] Copying 2 resources
[INFO] Copying 1 resource
[INFO] Copying 3 resources
[INFO] [compiler:compile {execution: default-compile}]
[INFO] Compiling 2 source files to <https://builds.apache.org/job/Karaf-2.2.x/ws/karaf/shell/web/target/classes>
[debug] execute contextualize
[INFO] [resources:testResources {execution: default-testResources}]
[INFO] Using 'UTF-8' encoding to copy filtered resources.
[INFO] skip non existing resourceDirectory <https://builds.apache.org/job/Karaf-2.2.x/ws/karaf/shell/web/src/test/resources>
[INFO] Copying 3 resources
[INFO] [compiler:testCompile {execution: default-testCompile}]
[INFO] No sources to compile
[INFO] [surefire:test {execution: default-test}]
[INFO] Surefire report directory: <https://builds.apache.org/job/Karaf-2.2.x/ws/karaf/shell/web/target/surefire-reports>

-------------------------------------------------------
 T E S T S
-------------------------------------------------------

Results :

Tests run: 0, Failures: 0, Errors: 0, Skipped: 0

[JENKINS] Recording test resultsApr 14, 2013 1:56:13 AM hudson.remoting.SynchronousCommandTransport$ReaderThread
run
SEVERE: I/O error in channel channel
java.io.StreamCorruptedException
	at java.io.ObjectInputStream.readObject0(ObjectInputStream.java:1332)
	at java.io.ObjectInputStream.readObject(ObjectInputStream.java:348)
	at hudson.remoting.Command.readFrom(Command.java:92)
	at hudson.remoting.ClassicCommandTransport.read(ClassicCommandTransport.java:59)
	at hudson.remoting.SynchronousCommandTransport$ReaderThread.run(SynchronousCommandTransport.java:48)
channel stopped
[INFO] ------------------------------------------------------------------------
[ERROR] FATAL ERROR
[INFO] ------------------------------------------------------------------------
[INFO] null
[INFO] ------------------------------------------------------------------------
[INFO] Trace
java.lang.reflect.UndeclaredThrowableException
	at $Proxy2.isArchivingDisabled(Unknown Source)
	at hudson.maven.MavenBuildProxy$Filter.isArchivingDisabled(MavenBuildProxy.java:227)
	at hudson.maven.reporters.MavenArtifact.archive(MavenArtifact.java:223)
	at hudson.maven.reporters.MavenArtifactArchiver.postBuild(MavenArtifactArchiver.java:108)
	at hudson.maven.Maven2Builder.postModule(Maven2Builder.java:129)
	at hudson.maven.MavenBuilder$Adapter.fireLeaveModule(MavenBuilder.java:354)
	at hudson.maven.MavenBuilder$Adapter.postBuild(MavenBuilder.java:308)
	at org.apache.maven.lifecycle.LifecycleExecutorInterceptor.execute(LifecycleExecutorInterceptor.java:68)
	at org.apache.maven.DefaultMaven.doExecute(DefaultMaven.java:328)
	at org.apache.maven.DefaultMaven.execute(DefaultMaven.java:138)
	at org.apache.maven.cli.MavenCli.main(MavenCli.java:362)
	at sun.reflect.NativeMethodAccessorImpl.invoke0(Native Method)
	at sun.reflect.NativeMethodAccessorImpl.invoke(NativeMethodAccessorImpl.java:39)
	at sun.reflect.DelegatingMethodAccessorImpl.invoke(DelegatingMethodAccessorImpl.java:25)
	at java.lang.reflect.Method.invoke(Method.java:592)
	at org.codehaus.classworlds.Launcher.launchEnhanced(Launcher.java:315)
	at org.codehaus.classworlds.Launcher.launch(Launcher.java:255)
	at hudson.maven.agent.Main.launch(Main.java:185)
	at hudson.maven.MavenBuilder.call(MavenBuilder.java:154)
	at hudson.maven.Maven2Builder.call(Maven2Builder.java:79)
	at hudson.maven.Maven2Builder.call(Maven2Builder.java:55)
	at hudson.remoting.UserRequest.perform(UserRequest.java:118)
	at hudson.remoting.UserRequest.perform(UserRequest.java:48)
	at hudson.remoting.Request$2.run(Request.java:326)
	at hudson.remoting.InterceptingExecutorService$1.call(InterceptingExecutorService.java:72)
	at java.util.concurrent.FutureTask$Sync.innerRun(FutureTask.java:269)
	at java.util.concurrent.FutureTask.run(FutureTask.java:123)
	at java.util.concurrent.ThreadPoolExecutor$Worker.runTask(ThreadPoolExecutor.java:651)
	at java.util.concurrent.ThreadPoolExecutor$Worker.run(ThreadPoolExecutor.java:676)
	at java.lang.Thread.run(Thread.java:595)
Caused by: hudson.remoting.ChannelClosedException: channel is already closed
	at hudson.remoting.Channel.send(Channel.java:494)
	at hudson.remoting.Request.call(Request.java:129)
	at hudson.remoting.Channel.call(Channel.java:672)
	at hudson.remoting.RemoteInvocationHandler.invoke(RemoteInvocationHandler.java:158)
	... 30 more
Caused by: java.io.StreamCorruptedException
	at java.io.ObjectInputStream.readObject0(ObjectInputStream.java:1332)
	at java.io.ObjectInputStream.readObject(ObjectInputStream.java:348)
	at hudson.remoting.Command.readFrom(Command.java:92)
	at hudson.remoting.ClassicCommandTransport.read(ClassicCommandTransport.java:59)
	at hudson.remoting.SynchronousCommandTransport$ReaderThread.run(SynchronousCommandTransport.java:48)
[INFO] ------------------------------------------------------------------------
[INFO] Total time: 4 minutes 40 seconds
[INFO] Finished at: Sun Apr 14 01:56:13 UTC 2013

ERROR: Maven JVM terminated unexpectedly with exit code 0


Mime
View raw message