karaf-commits mailing list archives

Site index · List index
Message view « Date » · « Thread »
Top « Date » · « Thread »
From Apache Jenkins Server <jenk...@builds.apache.org>
Subject Build failed in Jenkins: Karaf-2.2.x #956
Date Sun, 10 Mar 2013 00:41:35 GMT
See <https://builds.apache.org/job/Karaf-2.2.x/956/>

------------------------------------------
[...truncated 8325 lines...]
[JENKINS] Recording test results
[INFO] [jar:jar {execution: default-jar}]
[INFO] Building jar: <https://builds.apache.org/job/Karaf-2.2.x/ws/karaf/exception/target/org.apache.karaf.exception-2.2.11-SNAPSHOT.jar>
[INFO] [install:install {execution: default-install}]
[INFO] Installing <https://builds.apache.org/job/Karaf-2.2.x/ws/karaf/exception/target/org.apache.karaf.exception-2.2.11-SNAPSHOT.jar>
to <https://builds.apache.org/job/Karaf-2.2.x/ws/.repository/org/apache/karaf/org.apache.karaf.exception/2.2.11-SNAPSHOT/org.apache.karaf.exception-2.2.11-SNAPSHOT.jar>
[INFO] [bundle:cleanVersions {execution: cleanVersions}]
[WARNING] The parameter expression: 'project.build.resources' used in mojo: 'process' has
been deprecated. Use 'project.resources' instead.
[INFO] [remote-resources:process {execution: default}]
[INFO] [antrun:run {execution: copy-notice}]
[INFO] Executing tasks

main:
     [copy] Copying 1 file to <https://builds.apache.org/job/Karaf-2.2.x/ws/karaf/exception/target/maven-shared-archive-resources/META-INF>
[INFO] Executed tasks
[debug] execute contextualize
[INFO] [resources:resources {execution: default-resources}]
[INFO] Using 'UTF-8' encoding to copy filtered resources.
[INFO] skip non existing resourceDirectory <https://builds.apache.org/job/Karaf-2.2.x/ws/karaf/exception/src/main/resources>
[INFO] Copying 3 resources
[INFO] Copying 3 resources
[INFO] [compiler:compile {execution: default-compile}]
[INFO] Nothing to compile - all classes are up to date
[debug] execute contextualize
[INFO] [resources:testResources {execution: default-testResources}]
[INFO] Using 'UTF-8' encoding to copy filtered resources.
[INFO] skip non existing resourceDirectory <https://builds.apache.org/job/Karaf-2.2.x/ws/karaf/exception/src/test/resources>
[INFO] Copying 3 resources
[INFO] Copying 3 resources
[INFO] [compiler:testCompile {execution: default-testCompile}]
[INFO] No sources to compile
[INFO] [surefire:test {execution: default-test}]
[INFO] Skipping execution of surefire because it has already been run for this configuration
[JENKINS] Recording test results
[INFO] [jar:jar {execution: default-jar}]
[INFO] [install:install {execution: default-install}]
[INFO] Installing <https://builds.apache.org/job/Karaf-2.2.x/ws/karaf/exception/target/org.apache.karaf.exception-2.2.11-SNAPSHOT.jar>
to <https://builds.apache.org/job/Karaf-2.2.x/ws/.repository/org/apache/karaf/org.apache.karaf.exception/2.2.11-SNAPSHOT/org.apache.karaf.exception-2.2.11-SNAPSHOT.jar>
[INFO] [deploy:deploy {execution: default-deploy}]
[INFO] Retrieving previous build number from apache.snapshots.https
[WARNING] *** CHECKSUM FAILED - Checksum failed on download: local = '2f96de0656b6bff56a57f5aae3febe28a20076af';
remote = '3f10c9560d5d22788fd8804158f75236938f5036' - RETRYING
[WARNING] *** CHECKSUM FAILED - Checksum failed on download: local = '2f96de0656b6bff56a57f5aae3febe28a20076af';
remote = '3f10c9560d5d22788fd8804158f75236938f5036' - IGNORING
Uploading: https://repository.apache.org/content/repositories/snapshots/org/apache/karaf/org.apache.karaf.exception/2.2.11-SNAPSHOT/org.apache.karaf.exception-2.2.11-20130310.003325-78.jar
8K uploaded  (org.apache.karaf.exception-2.2.11-20130310.003325-78.jar)
[INFO] Retrieving previous metadata from apache.snapshots.https
[INFO] Uploading repository metadata for: 'artifact org.apache.karaf:org.apache.karaf.exception'
[INFO] Uploading project information for org.apache.karaf.exception 2.2.11-20130310.003325-78
[INFO] Retrieving previous metadata from apache.snapshots.https
[WARNING] *** CHECKSUM FAILED - Checksum failed on download: local = '2f96de0656b6bff56a57f5aae3febe28a20076af';
remote = '3f10c9560d5d22788fd8804158f75236938f5036' - RETRYING
[WARNING] *** CHECKSUM FAILED - Checksum failed on download: local = '2f96de0656b6bff56a57f5aae3febe28a20076af';
remote = '3f10c9560d5d22788fd8804158f75236938f5036' - IGNORING
[INFO] Uploading repository metadata for: 'snapshot org.apache.karaf:org.apache.karaf.exception:2.2.11-SNAPSHOT'
[JENKINS] Archiving <https://builds.apache.org/job/Karaf-2.2.x/ws/karaf/exception/pom.xml>
to /home/hudson/hudson/jobs/Karaf-2.2.x/modules/org.apache.karaf$org.apache.karaf.exception/builds/2013-03-10_00-32-26/archive/org.apache.karaf/org.apache.karaf.exception/2.2.11-SNAPSHOT/org.apache.karaf.exception-2.2.11-SNAPSHOT.pom
[JENKINS] Archiving <https://builds.apache.org/job/Karaf-2.2.x/ws/karaf/exception/target/org.apache.karaf.exception-2.2.11-SNAPSHOT.jar>
to /home/hudson/hudson/jobs/Karaf-2.2.x/modules/org.apache.karaf$org.apache.karaf.exception/builds/2013-03-10_00-32-26/archive/org.apache.karaf/org.apache.karaf.exception/2.2.11-20130310.003325-78/org.apache.karaf.exception-2.2.11-20130310.003325-78.jar
[INFO] ------------------------------------------------------------------------
[INFO] Building Apache Karaf :: Assemblies
[INFO]    task-segment: [clean, install, deploy]
[INFO] ------------------------------------------------------------------------
[INFO] [clean:clean {execution: default-clean}]
[INFO] [bundle:cleanVersions {execution: cleanVersions}]
[WARNING] The parameter expression: 'project.build.resources' used in mojo: 'process' has
been deprecated. Use 'project.resources' instead.
[INFO] [remote-resources:process {execution: default}]
[INFO] [antrun:run {execution: copy-notice}]
[INFO] Executing tasks

main:
     [copy] Warning: Could not find file <https://builds.apache.org/job/Karaf-2.2.x/ws/karaf/assemblies/NOTICE>
to copy.
[INFO] Executed tasks
[INFO] [site:attach-descriptor {execution: default-attach-descriptor}]
[INFO] [install:install {execution: default-install}]
[INFO] Installing <https://builds.apache.org/job/Karaf-2.2.x/ws/karaf/assemblies/pom.xml>
to <https://builds.apache.org/job/Karaf-2.2.x/ws/.repository/org/apache/karaf/assemblies/assemblies/2.2.11-SNAPSHOT/assemblies-2.2.11-SNAPSHOT.pom>
[INFO] [bundle:cleanVersions {execution: cleanVersions}]
[WARNING] The parameter expression: 'project.build.resources' used in mojo: 'process' has
been deprecated. Use 'project.resources' instead.
[INFO] [remote-resources:process {execution: default}]
[INFO] [antrun:run {execution: copy-notice}]
[INFO] Executing tasks

main:
     [copy] Warning: Could not find file <https://builds.apache.org/job/Karaf-2.2.x/ws/karaf/assemblies/NOTICE>
to copy.
[INFO] Executed tasks
[INFO] [site:attach-descriptor {execution: default-attach-descriptor}]
[INFO] [install:install {execution: default-install}]
[INFO] Installing <https://builds.apache.org/job/Karaf-2.2.x/ws/karaf/assemblies/pom.xml>
to <https://builds.apache.org/job/Karaf-2.2.x/ws/.repository/org/apache/karaf/assemblies/assemblies/2.2.11-SNAPSHOT/assemblies-2.2.11-SNAPSHOT.pom>
[INFO] [deploy:deploy {execution: default-deploy}]
[INFO] Retrieving previous build number from apache.snapshots.https
[WARNING] *** CHECKSUM FAILED - Checksum failed on download: local = '5ce58f2172083c6e50bd119c6ec2aee686171501';
remote = 'ab0ca27eb032834358c25ceb598cc9308310aa11' - RETRYING
[WARNING] *** CHECKSUM FAILED - Checksum failed on download: local = '5ce58f2172083c6e50bd119c6ec2aee686171501';
remote = 'ab0ca27eb032834358c25ceb598cc9308310aa11' - IGNORING
Uploading: https://repository.apache.org/content/repositories/snapshots/org/apache/karaf/assemblies/assemblies/2.2.11-SNAPSHOT/assemblies-2.2.11-20130310.003325-77.pom
1K uploaded  (assemblies-2.2.11-20130310.003325-77.pom)
[INFO] Retrieving previous metadata from apache.snapshots.https
[WARNING] *** CHECKSUM FAILED - Checksum failed on download: local = '5ce58f2172083c6e50bd119c6ec2aee686171501';
remote = 'ab0ca27eb032834358c25ceb598cc9308310aa11' - RETRYING
[WARNING] *** CHECKSUM FAILED - Checksum failed on download: local = '5ce58f2172083c6e50bd119c6ec2aee686171501';
remote = 'ab0ca27eb032834358c25ceb598cc9308310aa11' - IGNORING
[INFO] Uploading repository metadata for: 'snapshot org.apache.karaf.assemblies:assemblies:2.2.11-SNAPSHOT'
[INFO] Retrieving previous metadata from apache.snapshots.https
[INFO] Uploading repository metadata for: 'artifact org.apache.karaf.assemblies:assemblies'
[JENKINS] Archiving <https://builds.apache.org/job/Karaf-2.2.x/ws/karaf/assemblies/pom.xml>
to /home/hudson/hudson/jobs/Karaf-2.2.x/modules/org.apache.karaf.assemblies$assemblies/builds/2013-03-10_00-32-26/archive/org.apache.karaf.assemblies/assemblies/2.2.11-SNAPSHOT/assemblies-2.2.11-SNAPSHOT.pom
[JENKINS] Archiving <https://builds.apache.org/job/Karaf-2.2.x/ws/.repository/org/apache/karaf/assemblies/assemblies/2.2.11-SNAPSHOT/assemblies-2.2.11-SNAPSHOT.pom>
to /home/hudson/hudson/jobs/Karaf-2.2.x/modules/org.apache.karaf.assemblies$assemblies/builds/2013-03-10_00-32-26/archive/org.apache.karaf.assemblies/assemblies/2.2.11-20130310.003325-77/assemblies-2.2.11-20130310.003325-77.pom
[INFO] ------------------------------------------------------------------------
[INFO] Building Apache Karaf :: Assemblies :: Features
[INFO]    task-segment: [clean, install, deploy]
[INFO] ------------------------------------------------------------------------
[INFO] [clean:clean {execution: default-clean}]
[INFO] [bundle:cleanVersions {execution: cleanVersions}]
[WARNING] The parameter expression: 'project.build.resources' used in mojo: 'process' has
been deprecated. Use 'project.resources' instead.
[INFO] [remote-resources:process {execution: default}]
[INFO] [antrun:run {execution: copy-notice}]
[INFO] Executing tasks

main:
     [copy] Warning: Could not find file <https://builds.apache.org/job/Karaf-2.2.x/ws/karaf/assemblies/features/NOTICE>
to copy.
[INFO] Executed tasks
[INFO] [site:attach-descriptor {execution: default-attach-descriptor}]
[INFO] [install:install {execution: default-install}]
[INFO] Installing <https://builds.apache.org/job/Karaf-2.2.x/ws/karaf/assemblies/features/pom.xml>
to <https://builds.apache.org/job/Karaf-2.2.x/ws/.repository/org/apache/karaf/assemblies/features/features/2.2.11-SNAPSHOT/features-2.2.11-SNAPSHOT.pom>
[INFO] [bundle:cleanVersions {execution: cleanVersions}]
[WARNING] The parameter expression: 'project.build.resources' used in mojo: 'process' has
been deprecated. Use 'project.resources' instead.
[INFO] [remote-resources:process {execution: default}]
[INFO] [antrun:run {execution: copy-notice}]
[INFO] Executing tasks

main:
     [copy] Warning: Could not find file <https://builds.apache.org/job/Karaf-2.2.x/ws/karaf/assemblies/features/NOTICE>
to copy.
[INFO] Executed tasks
[INFO] [site:attach-descriptor {execution: default-attach-descriptor}]
[INFO] [install:install {execution: default-install}]
[INFO] Installing <https://builds.apache.org/job/Karaf-2.2.x/ws/karaf/assemblies/features/pom.xml>
to <https://builds.apache.org/job/Karaf-2.2.x/ws/.repository/org/apache/karaf/assemblies/features/features/2.2.11-SNAPSHOT/features-2.2.11-SNAPSHOT.pom>
[INFO] [deploy:deploy {execution: default-deploy}]
[INFO] Retrieving previous build number from apache.snapshots.https
[WARNING] *** CHECKSUM FAILED - Checksum failed on download: local = 'ce6d7934b12a945b33b49a55383439bc0484cde7';
remote = '6866aad0241b3bdc9a4b289490a4b57c350f4a2f' - RETRYING
[WARNING] *** CHECKSUM FAILED - Checksum failed on download: local = 'ce6d7934b12a945b33b49a55383439bc0484cde7';
remote = '6866aad0241b3bdc9a4b289490a4b57c350f4a2f' - IGNORING
Uploading: https://repository.apache.org/content/repositories/snapshots/org/apache/karaf/assemblies/features/features/2.2.11-SNAPSHOT/features-2.2.11-20130310.003325-77.pom
1K uploaded  (features-2.2.11-20130310.003325-77.pom)
[INFO] Retrieving previous metadata from apache.snapshots.https
[INFO] Uploading repository metadata for: 'artifact org.apache.karaf.assemblies.features:features'
[INFO] Retrieving previous metadata from apache.snapshots.https
[WARNING] *** CHECKSUM FAILED - Checksum failed on download: local = 'ce6d7934b12a945b33b49a55383439bc0484cde7';
remote = '6866aad0241b3bdc9a4b289490a4b57c350f4a2f' - RETRYING
[WARNING] *** CHECKSUM FAILED - Checksum failed on download: local = 'ce6d7934b12a945b33b49a55383439bc0484cde7';
remote = '6866aad0241b3bdc9a4b289490a4b57c350f4a2f' - IGNORING
[INFO] Uploading repository metadata for: 'snapshot org.apache.karaf.assemblies.features:features:2.2.11-SNAPSHOT'
[JENKINS] Archiving <https://builds.apache.org/job/Karaf-2.2.x/ws/karaf/assemblies/features/pom.xml>
to /home/hudson/hudson/jobs/Karaf-2.2.x/modules/org.apache.karaf.assemblies.features$features/builds/2013-03-10_00-32-27/archive/org.apache.karaf.assemblies.features/features/2.2.11-SNAPSHOT/features-2.2.11-SNAPSHOT.pom
[JENKINS] Archiving <https://builds.apache.org/job/Karaf-2.2.x/ws/.repository/org/apache/karaf/assemblies/features/features/2.2.11-SNAPSHOT/features-2.2.11-SNAPSHOT.pom>
to /home/hudson/hudson/jobs/Karaf-2.2.x/modules/org.apache.karaf.assemblies.features$features/builds/2013-03-10_00-32-27/archive/org.apache.karaf.assemblies.features/features/2.2.11-20130310.003325-77/features-2.2.11-20130310.003325-77.pom
[INFO] ------------------------------------------------------------------------
[INFO] Building Apache Karaf :: Assemblies :: Features :: Standard
[INFO]    task-segment: [clean, install, deploy]
[INFO] ------------------------------------------------------------------------
[INFO] [clean:clean {execution: default-clean}]
[INFO] [bundle:cleanVersions {execution: cleanVersions}]
[WARNING] The parameter expression: 'project.build.resources' used in mojo: 'process' has
been deprecated. Use 'project.resources' instead.
[INFO] [remote-resources:process {execution: default}]
[INFO] [antrun:run {execution: copy-notice}]
[INFO] Executing tasks

main:
     [copy] Warning: Could not find file <https://builds.apache.org/job/Karaf-2.2.x/ws/karaf/assemblies/features/standard/NOTICE>
to copy.
[INFO] Executed tasks
[debug] execute contextualize
[INFO] [resources:resources {execution: filter}]
[INFO] Using 'UTF-8' encoding to copy filtered resources.
[INFO] Copying 1 resource
[INFO] Copying 3 resources
[debug] execute contextualize
[INFO] [resources:resources {execution: default-resources}]
[INFO] Using 'UTF-8' encoding to copy filtered resources.
[INFO] Copying 1 resource
[INFO] Copying 3 resources
[INFO] [compiler:compile {execution: default-compile}]
[INFO] No sources to compile
[debug] execute contextualize
[INFO] [resources:testResources {execution: default-testResources}]
[INFO] Using 'UTF-8' encoding to copy filtered resources.
[INFO] skip non existing resourceDirectory <https://builds.apache.org/job/Karaf-2.2.x/ws/karaf/assemblies/features/standard/src/test/resources>
[INFO] Copying 3 resources
[INFO] [compiler:testCompile {execution: default-testCompile}]
[INFO] No sources to compile
[INFO] [surefire:test {execution: default-test}]
[INFO] Surefire report directory: <https://builds.apache.org/job/Karaf-2.2.x/ws/karaf/assemblies/features/standard/target/surefire-reports>

-------------------------------------------------------
 T E S T S
-------------------------------------------------------

Results :

Tests run: 0, Failures: 0, Errors: 0, Skipped: 0
[JENKINS] Recording test results

[INFO] [jar:jar {execution: default-jar}]
[INFO] Building jar: <https://builds.apache.org/job/Karaf-2.2.x/ws/karaf/assemblies/features/standard/target/standard-2.2.11-SNAPSHOT.jar>
[INFO] [build-helper:attach-artifact {execution: attach-artifacts}]
[INFO] [install:install {execution: default-install}]
[INFO] Installing <https://builds.apache.org/job/Karaf-2.2.x/ws/karaf/assemblies/features/standard/target/standard-2.2.11-SNAPSHOT.jar>
to <https://builds.apache.org/job/Karaf-2.2.x/ws/.repository/org/apache/karaf/assemblies/features/standard/2.2.11-SNAPSHOT/standard-2.2.11-SNAPSHOT.jar>
[INFO] Installing <https://builds.apache.org/job/Karaf-2.2.x/ws/karaf/assemblies/features/standard/target/classes/features.xml>
to <https://builds.apache.org/job/Karaf-2.2.x/ws/.repository/org/apache/karaf/assemblies/features/standard/2.2.11-SNAPSHOT/standard-2.2.11-SNAPSHOT-features.xml>
[INFO] [bundle:cleanVersions {execution: cleanVersions}]
[WARNING] The parameter expression: 'project.build.resources' used in mojo: 'process' has
been deprecated. Use 'project.resources' instead.
[INFO] [remote-resources:process {execution: default}]
[INFO] [antrun:run {execution: copy-notice}]
[INFO] Executing tasks

main:
     [copy] Warning: Could not find file <https://builds.apache.org/job/Karaf-2.2.x/ws/karaf/assemblies/features/standard/NOTICE>
to copy.
[INFO] Executed tasks
[debug] execute contextualize
[INFO] [resources:resources {execution: filter}]
[INFO] Using 'UTF-8' encoding to copy filtered resources.
[INFO] Copying 1 resource
[INFO] Copying 3 resources
[INFO] Copying 3 resources
[debug] execute contextualize
[INFO] [resources:resources {execution: default-resources}]
[INFO] Using 'UTF-8' encoding to copy filtered resources.
[INFO] Copying 1 resource
[INFO] Copying 3 resources
[INFO] Copying 3 resources
[INFO] [compiler:compile {execution: default-compile}]
[INFO] No sources to compile
[debug] execute contextualize
[INFO] [resources:testResources {execution: default-testResources}]
[INFO] Using 'UTF-8' encoding to copy filtered resources.
[INFO] skip non existing resourceDirectory <https://builds.apache.org/job/Karaf-2.2.x/ws/karaf/assemblies/features/standard/src/test/resources>
[INFO] Copying 3 resources
[INFO] Copying 3 resources
[INFO] [compiler:testCompile {execution: default-testCompile}]
[INFO] No sources to compile
[INFO] [surefire:test {execution: default-test}]
[INFO] Skipping execution of surefire because it has already been run for this configuration
[JENKINS] Recording test results
[INFO] [jar:jar {execution: default-jar}]
[INFO] [build-helper:attach-artifact {execution: attach-artifacts}]
[INFO] [install:install {execution: default-install}]
[INFO] Installing <https://builds.apache.org/job/Karaf-2.2.x/ws/karaf/assemblies/features/standard/target/standard-2.2.11-SNAPSHOT.jar>
to <https://builds.apache.org/job/Karaf-2.2.x/ws/.repository/org/apache/karaf/assemblies/features/standard/2.2.11-SNAPSHOT/standard-2.2.11-SNAPSHOT.jar>
[INFO] Installing <https://builds.apache.org/job/Karaf-2.2.x/ws/karaf/assemblies/features/standard/target/classes/features.xml>
to <https://builds.apache.org/job/Karaf-2.2.x/ws/.repository/org/apache/karaf/assemblies/features/standard/2.2.11-SNAPSHOT/standard-2.2.11-SNAPSHOT-features.xml>
[INFO] Installing <https://builds.apache.org/job/Karaf-2.2.x/ws/karaf/assemblies/features/standard/target/classes/features.xml>
to <https://builds.apache.org/job/Karaf-2.2.x/ws/.repository/org/apache/karaf/assemblies/features/standard/2.2.11-SNAPSHOT/standard-2.2.11-SNAPSHOT-features.xml>
[INFO] [deploy:deploy {execution: default-deploy}]
[INFO] Retrieving previous build number from apache.snapshots.https
[WARNING] *** CHECKSUM FAILED - Checksum failed on download: local = '4ddde86e245d3e3d640a5cbde4dd69f298ac7737';
remote = '47f949a52397cd147c32921e956acabdd9246a5b' - RETRYING
[WARNING] *** CHECKSUM FAILED - Checksum failed on download: local = '4ddde86e245d3e3d640a5cbde4dd69f298ac7737';
remote = '47f949a52397cd147c32921e956acabdd9246a5b' - IGNORING
Uploading: https://repository.apache.org/content/repositories/snapshots/org/apache/karaf/assemblies/features/standard/2.2.11-SNAPSHOT/standard-2.2.11-20130310.003325-77.jar
10K uploaded  (standard-2.2.11-20130310.003325-77.jar)
[INFO] Retrieving previous metadata from apache.snapshots.https
[WARNING] *** CHECKSUM FAILED - Checksum failed on download: local = '4ddde86e245d3e3d640a5cbde4dd69f298ac7737';
remote = '47f949a52397cd147c32921e956acabdd9246a5b' - RETRYING
[WARNING] *** CHECKSUM FAILED - Checksum failed on download: local = '4ddde86e245d3e3d640a5cbde4dd69f298ac7737';
remote = '47f949a52397cd147c32921e956acabdd9246a5b' - IGNORING
[INFO] Uploading repository metadata for: 'snapshot org.apache.karaf.assemblies.features:standard:2.2.11-SNAPSHOT'
[INFO] Retrieving previous metadata from apache.snapshots.https
[INFO] Uploading repository metadata for: 'artifact org.apache.karaf.assemblies.features:standard'
[INFO] Uploading project information for standard 2.2.11-20130310.003325-77
[INFO] Retrieving previous build number from apache.snapshots.https
Uploading: https://repository.apache.org/content/repositories/snapshots/org/apache/karaf/assemblies/features/standard/2.2.11-SNAPSHOT/standard-2.2.11-20130310.003325-77-features.xml
20K uploaded  (standard-2.2.11-20130310.003325-77-features.xml)
[INFO] Retrieving previous build number from apache.snapshots.https
Uploading: https://repository.apache.org/content/repositories/snapshots/org/apache/karaf/assemblies/features/standard/2.2.11-SNAPSHOT/standard-2.2.11-20130310.003325-77-features.xml
20K uploaded  (standard-2.2.11-20130310.003325-77-features.xml)
ERROR: Maven JVM terminated unexpectedly with exit code 143


Mime
View raw message