karaf-commits mailing list archives

Site index · List index
Message view « Date » · « Thread »
Top « Date » · « Thread »
From Apache Jenkins Server <jenk...@builds.apache.org>
Subject Build failed in Jenkins: Karaf #1926
Date Wed, 20 Mar 2013 13:21:44 GMT
See <https://builds.apache.org/job/Karaf/1926/changes>

Changes:

[gnodet] [KARAF-2244] BundleWatcher should wait for refresh to be finished before updating another bundle

------------------------------------------
[...truncated 20666 lines...]
2013-03-20 13:21:36,062 | INFO  | 1)-67.195.138.60 | ContainerTestRunner              | 74 - org.ops4j.pax.exam.invoker.junit - 2.6.0 | running realmListCommand in reactor
2013-03-20 13:21:36,288 | INFO  | Thread-3         | core                             | 80 - org.apache.aries.jmx.core - 1.1.1 | Starting JMX OSGi agent
2013-03-20 13:21:36,306 | INFO  | Thread-3         | core                             | 80 - org.apache.aries.jmx.core - 1.1.1 | Registering MBean with ObjectName [osgi.compendium:service=cm,version=1.3,framework=org.apache.felix.framework,uuid=df3dc919-890a-43ad-8944-38ed54a31472] for service with service.id [11]
2013-03-20 13:21:36,325 | INFO  | JMX OSGi Agent   | core                             | 80 - org.apache.aries.jmx.core - 1.1.1 | Registering org.osgi.jmx.service.cm.ConfigurationAdminMBean to MBeanServer com.sun.jmx.mbeanserver.JmxMBeanServer@1df9c23 with name osgi.compendium:service=cm,version=1.3,framework=org.apache.felix.framework,uuid=df3dc919-890a-43ad-8944-38ed54a31472
2013-03-20 13:21:36,326 | INFO  | JMX OSGi Agent   | core                             | 80 - org.apache.aries.jmx.core - 1.1.1 | Registering org.osgi.jmx.framework.FrameworkMBean to MBeanServer com.sun.jmx.mbeanserver.JmxMBeanServer@1df9c23 with name osgi.core:type=framework,version=1.7,framework=org.apache.felix.framework,uuid=df3dc919-890a-43ad-8944-38ed54a31472
2013-03-20 13:21:36,326 | INFO  | JMX OSGi Agent   | core                             | 80 - org.apache.aries.jmx.core - 1.1.1 | Registering org.osgi.jmx.framework.ServiceStateMBean to MBeanServer com.sun.jmx.mbeanserver.JmxMBeanServer@1df9c23 with name osgi.core:type=serviceState,version=1.7,framework=org.apache.felix.framework,uuid=df3dc919-890a-43ad-8944-38ed54a31472
2013-03-20 13:21:36,336 | INFO  | JMX OSGi Agent   | core                             | 80 - org.apache.aries.jmx.core - 1.1.1 | Registering org.osgi.jmx.framework.BundleStateMBean to MBeanServer com.sun.jmx.mbeanserver.JmxMBeanServer@1df9c23 with name osgi.core:type=bundleState,version=1.7,framework=org.apache.felix.framework,uuid=df3dc919-890a-43ad-8944-38ed54a31472
2013-03-20 13:21:36,337 | INFO  | JMX OSGi Agent   | core                             | 80 - org.apache.aries.jmx.core - 1.1.1 | Registering org.osgi.jmx.framework.PackageStateMBean to MBeanServer com.sun.jmx.mbeanserver.JmxMBeanServer@1df9c23 with name osgi.core:type=packageState,version=1.5,framework=org.apache.felix.framework,uuid=df3dc919-890a-43ad-8944-38ed54a31472
2013-03-20 13:21:36,338 | INFO  | JMX OSGi Agent   | core                             | 80 - org.apache.aries.jmx.core - 1.1.1 | Registering org.osgi.jmx.framework.wiring.BundleWiringStateMBean to MBeanServer com.sun.jmx.mbeanserver.JmxMBeanServer@1df9c23 with name osgi.core:type=wiringState,version=1.1,framework=org.apache.felix.framework,uuid=df3dc919-890a-43ad-8944-38ed54a31472
2013-03-20 13:21:36,610 | INFO  | Thread-3         | RegionsPersistenceImpl           | 90 - org.apache.karaf.region.persist - 3.0.0.SNAPSHOT | Loading region digraph persistence
2013-03-20 13:21:36,636 | INFO  | Thread-3         | RegionsPersistenceImpl           | 90 - org.apache.karaf.region.persist - 3.0.0.SNAPSHOT | initializing region digraph from etc/regions-config.xml
jaas:realm-list
[org.apache.karaf.tooling.exam.container.internal.KarafTestContainer] : Shutting down the test container (Pax Runner)
2013-03-20 13:21:36,734 | INFO  | 1)-67.195.138.60 | TestBundleObserver               | 71 - org.ops4j.pax.exam.extender.service - 2.6.0 | Unregistered testcase [org.ops4j.pax.exam.raw.extender.intern.Probe@eb1ba3.]
Tests run: 1, Failures: 0, Errors: 0, Skipped: 0, Time elapsed: 8.009 sec
Running org.apache.karaf.itests.WebTest
[org.ops4j.pax.exam.spi.DefaultExamSystem] : Pax Exam System (Version: 2.6.0) created.
[org.ops4j.store.intern.TemporaryStore] : Storage Area is /tmp/1363785696738-0
[org.apache.karaf.tooling.exam.container.internal.RMIRegistry] : Created Registry on 21453
[org.apache.karaf.tooling.exam.container.internal.RMIRegistry] : Currently 41 out of 98 ports are in use. Port range is from 21413 up to 21511
[org.apache.karaf.tooling.exam.container.internal.RMIRegistry] : Created Registry on 21454
[org.apache.karaf.tooling.exam.container.internal.RMIRegistry] : Currently 42 out of 98 ports are in use. Port range is from 21413 up to 21511
[org.ops4j.pax.exam.spi.PaxExamRuntime] : Found TestContainerFactory: org.apache.karaf.tooling.exam.container.internal.KarafTestContainerFactory
[org.ops4j.pax.exam.junit.JUnit4TestRunner] : User defined probe hook found: probeConfiguration
[org.ops4j.pax.exam.spi.intern.DefaultTestAddress] : NEW ADDRESS= PaxExam-941d54d6-711f-4393-8d8b-0db5d9025169 parent=null root=[TestAddress:PaxExam-941d54d6-711f-4393-8d8b-0db5d9025169 root:PaxExam-941d54d6-711f-4393-8d8b-0db5d9025169] args=[Ljava.lang.Object;@1ae1a3d
[org.ops4j.pax.exam.spi.intern.DefaultTestAddress] : NEW ADDRESS= PaxExam-eaf32bf0-df3a-4cf4-ad2a-945fb0c0c12d parent=null root=[TestAddress:PaxExam-eaf32bf0-df3a-4cf4-ad2a-945fb0c0c12d root:PaxExam-eaf32bf0-df3a-4cf4-ad2a-945fb0c0c12d] args=[Ljava.lang.Object;@13cb75a
[org.ops4j.pax.tinybundles.core.intern.RawBuilder] : make()
[org.ops4j.store.intern.TemporaryStore] : Enter store()
[org.ops4j.pax.tinybundles.core.intern.RawBuilder] : Creating manifest from added headers.
[org.ops4j.pax.tinybundles.core.intern.RawBuilder] : DynamicImport-Package = *,org.apache.felix.service.*;status=provisional
[org.ops4j.pax.tinybundles.core.intern.RawBuilder] : Ignore-Package = 
[org.ops4j.pax.tinybundles.core.intern.RawBuilder] : PaxExam-941d54d6-711f-4393-8d8b-0db5d9025169 = org.apache.karaf.itests.WebTest;listCommand
[org.ops4j.pax.tinybundles.core.intern.RawBuilder] : PaxExam-Executable = PaxExam-941d54d6-711f-4393-8d8b-0db5d9025169,PaxExam-eaf32bf0-df3a-4cf4-ad2a-945fb0c0c12d,
[org.ops4j.pax.tinybundles.core.intern.RawBuilder] : Bundle-SymbolicName = PAXEXAM-PROBE-f4d792ef-8a01-42d2-a8a2-6aba4bfb7275
[org.ops4j.pax.tinybundles.core.intern.RawBuilder] : PaxExam-eaf32bf0-df3a-4cf4-ad2a-945fb0c0c12d = org.apache.karaf.itests.WebTest;listViaMBean
[org.ops4j.pax.tinybundles.core.intern.RawBuilder] : Bundle-ManifestVersion = 2
[org.ops4j.pax.tinybundles.core.intern.RawBuilder] : Copying resource org/apache/karaf/itests/ConditionalFeaturesTest.class
[org.ops4j.pax.tinybundles.core.intern.RawBuilder] : Copying resource org/apache/karaf/itests/WebTest.class
[org.ops4j.pax.tinybundles.core.intern.RawBuilder] : Copying resource org/apache/karaf/itests/SystemTest.class
[org.ops4j.pax.tinybundles.core.intern.RawBuilder] : Copying resource org/apache/karaf/itests/KarafTestSupport$1.class
[org.ops4j.pax.tinybundles.core.intern.RawBuilder] : Copying resource META-INF/DEPENDENCIES
[org.ops4j.pax.tinybundles.core.intern.RawBuilder] : Copying resource org/apache/karaf/itests/ObrTest.class
[org.ops4j.pax.tinybundles.core.intern.RawBuilder] : Copying resource org/apache/karaf/itests/RegionTest.class
[org.ops4j.pax.tinybundles.core.intern.RawBuilder] : Copying resource org/apache/karaf/itests/features/SpringFeaturesTest.class
[org.ops4j.pax.tinybundles.core.intern.RawBuilder] : Copying resource META-INF/LICENSE
[org.ops4j.pax.tinybundles.core.intern.RawBuilder] : Copying resource org/apache/karaf/itests/features/EnterpriseFeaturesTest.class
[org.ops4j.pax.tinybundles.core.intern.RawBuilder] : Copying resource org/apache/karaf/itests/SystemShutdownTest.class
[org.ops4j.pax.tinybundles.core.intern.RawBuilder] : Copying resource org/apache/karaf/itests/FeatureTest.class
[org.ops4j.pax.tinybundles.core.intern.RawBuilder] : Copying resource org/apache/karaf/itests/InstanceTest.class
[org.ops4j.pax.tinybundles.core.intern.RawBuilder] : Copying resource org/apache/karaf/itests/PackageTest.class
[org.ops4j.pax.tinybundles.core.intern.RawBuilder] : Copying resource org/apache/karaf/itests/features/StandardFeaturesTest.class
[org.ops4j.pax.tinybundles.core.intern.RawBuilder] : Copying resource org/apache/karaf/itests/WrapperTest.class
[org.ops4j.pax.tinybundles.core.intern.RawBuilder] : Copying resource org/apache/karaf/itests/JaasTest.class
[org.ops4j.pax.tinybundles.core.intern.RawBuilder] : Copying resource org/apache/karaf/itests/KarTest.class
[org.ops4j.pax.tinybundles.core.intern.RawBuilder] : Copying resource META-INF/NOTICE
[org.ops4j.pax.tinybundles.core.intern.RawBuilder] : Copying resource org/apache/karaf/itests/HttpTest.class
[org.ops4j.pax.tinybundles.core.intern.RawBuilder] : Copying resource org/apache/karaf/itests/KarafTestSupport.class
[org.ops4j.pax.tinybundles.core.intern.RawBuilder] : Copying resource org/apache/karaf/itests/LogTest.class
[org.ops4j.pax.tinybundles.core.intern.RawBuilder] : Copying resource org/apache/karaf/itests/DiagnosticTest.class
[org.ops4j.pax.tinybundles.core.intern.RawBuilder] : Copying resource org/apache/karaf/itests/BundleTests.class
[org.ops4j.pax.tinybundles.core.intern.RawBuilder] : Copying resource org/apache/karaf/itests/ServiceTest.class
[org.ops4j.pax.tinybundles.core.intern.RawBuilder] : Copying resource org/apache/karaf/itests/ConfigTest.class
[org.ops4j.pax.tinybundles.core.intern.RawBuilder] : Copying resource org/apache/karaf/itests/features/BootFeaturesTest.class
[org.ops4j.store.intern.TemporaryStore] : Exit store(): a6780994ef9192944151bae9cd26b7489e4a7770
[org.ops4j.pax.exam.spi.DefaultExamReactor] : Staging reactor with probes: 1 using strategy: org.ops4j.pax.exam.spi.reactors.EagerSingleStagedReactorFactory@11bd3ad
[org.ops4j.store.intern.TemporaryStore] : Storage Area is /tmp/1363785696847-0
[org.ops4j.store.intern.TemporaryStore] : Storage Area is /tmp/1363785696847-1
[org.ops4j.pax.url.mvn.internal.Connection] : Resolving [mvn:org.apache.karaf/apache-karaf/3.0.0-SNAPSHOT/tar.gz]
[org.ops4j.pax.url.mvn.internal.LogAdapter] : Using manager SimpleLocalRepositoryManager with priority 0 for <https://builds.apache.org/job/Karaf/ws/.repository>
[org.ops4j.pax.url.mvn.internal.LogAdapter] : Skipped remote update check for org.apache.karaf:apache-karaf:3.0.0-SNAPSHOT/maven-metadata.xml, locally installed metadata up-to-date.
[org.ops4j.pax.url.mvn.internal.AetherBasedResolver] : Resolved (org.apache.karaf:apache-karaf:tar.gz:3.0.0-SNAPSHOT) as <https://builds.apache.org/job/Karaf/ws/.repository/org/apache/karaf/apache-karaf/3.0.0-SNAPSHOT/apache-karaf-3.0.0-SNAPSHOT.tar.gz>
[org.apache.karaf.tooling.exam.container.internal.KarafTestContainer] : Test Container started in 0 millis
[org.apache.karaf.tooling.exam.container.internal.KarafTestContainer] : Wait for test container to finish its initialization [ RelativeTimeout value = 180000 ]
[org.ops4j.pax.exam.rbc.client.RemoteBundleContextClient] : Waiting for remote bundle context.. on 21454 name: c0b18c8e-c122-49e4-a3d1-2b24bd7f5790 timout: [ RelativeTimeout value = 180000 ]
2013-03-20 13:21:38,351 | INFO  | FelixStartLevel  | fileinstall                      | 20 - org.apache.felix.fileinstall - 3.2.6 | Installed <https://builds.apache.org/job/Karaf/ws/karaf/itests/target/exam/aa2cd64f-b8d5-43f5-bca6-d46e97a37379/etc/org.ops4j.pax.url.mvn.cfg>
2013-03-20 13:21:38,532 | INFO  | FelixStartLevel  | fileinstall                      | 20 - org.apache.felix.fileinstall - 3.2.6 | Installed <https://builds.apache.org/job/Karaf/ws/karaf/itests/target/exam/aa2cd64f-b8d5-43f5-bca6-d46e97a37379/etc/org.ops4j.pax.web.cfg>
2013-03-20 13:21:38,541 | INFO  | FelixStartLevel  | fileinstall                      | 20 - org.apache.felix.fileinstall - 3.2.6 | Installed <https://builds.apache.org/job/Karaf/ws/karaf/itests/target/exam/aa2cd64f-b8d5-43f5-bca6-d46e97a37379/etc/org.apache.felix.fileinstall-deploy.cfg>
2013-03-20 13:21:38,543 | INFO  | FelixStartLevel  | fileinstall                      | 20 - org.apache.felix.fileinstall - 3.2.6 | Installed <https://builds.apache.org/job/Karaf/ws/karaf/itests/target/exam/aa2cd64f-b8d5-43f5-bca6-d46e97a37379/etc/org.apache.karaf.jaas.cfg>
2013-03-20 13:21:38,546 | INFO  | FelixStartLevel  | fileinstall                      | 20 - org.apache.felix.fileinstall - 3.2.6 | Installed <https://builds.apache.org/job/Karaf/ws/karaf/itests/target/exam/aa2cd64f-b8d5-43f5-bca6-d46e97a37379/etc/org.apache.karaf.features.repos.cfg>
2013-03-20 13:21:38,548 | INFO  | FelixStartLevel  | fileinstall                      | 20 - org.apache.felix.fileinstall - 3.2.6 | Installed <https://builds.apache.org/job/Karaf/ws/karaf/itests/target/exam/aa2cd64f-b8d5-43f5-bca6-d46e97a37379/etc/org.apache.karaf.management.cfg>
2013-03-20 13:21:39,029 | WARN  | FelixStartLevel  | FeatureValidationUtil            | 10 - org.apache.karaf.features.core - 3.0.0.SNAPSHOT | Old style feature file without namespace found (URI: <https://builds.apache.org/job/Karaf/ws/karaf/itests/target/exam/aa2cd64f-b8d5-43f5-bca6-d46e97a37379/examfeatures.xml).> This format is deprecated and support for it will soon be removed
2013-03-20 13:21:39,462 | INFO  | Thread-3         | FeaturesServiceImpl              | 10 - org.apache.karaf.features.core - 3.0.0.SNAPSHOT | Installing feature standard 3.0.0-SNAPSHOT
2013-03-20 13:21:39,615 | INFO  | Thread-3         | FeaturesServiceImpl              | 10 - org.apache.karaf.features.core - 3.0.0.SNAPSHOT | Installing feature config 3.0.0-SNAPSHOT
2013-03-20 13:21:39,640 | INFO  | Thread-3         | FeaturesServiceImpl              | 10 - org.apache.karaf.features.core - 3.0.0.SNAPSHOT | Installing feature exam 2.6.0
2013-03-20 13:21:39,662 | INFO  | FelixStartLevel  | BlueprintContainerImpl           | 19 - org.apache.aries.blueprint.core - 1.1.0 | Bundle org.apache.karaf.shell.commands is waiting for namespace handlers [http://karaf.apache.org/xmlns/shell/v1.1.0]
2013-03-20 13:21:39,719 | INFO  | FelixStartLevel  | BlueprintContainerImpl           | 19 - org.apache.aries.blueprint.core - 1.1.0 | Bundle org.apache.karaf.bundle.command is waiting for namespace handlers [http://karaf.apache.org/xmlns/shell/v1.1.0]
2013-03-20 13:21:39,726 | INFO  | FelixStartLevel  | BlueprintContainerImpl           | 19 - org.apache.aries.blueprint.core - 1.1.0 | Bundle org.apache.karaf.features.command is waiting for namespace handlers [http://karaf.apache.org/xmlns/shell/v1.1.0]
        __ __                  ____      
       / //_/____ __________ _/ __/      
      / ,<  / __ `/ ___/ __ `/ /_        
     / /| |/ /_/ / /  / /_/ / __/        
    /_/ |_|\__,_/_/   \__,_/_/         

  Apache Karaf (3.0.0-SNAPSHOT)

Hit '<tab>' for a list of available commands
and '[cmd] --help' for help on a specific command.
Hit '<ctrl-d>' or type 'system:shutdown' or 'logout' to shutdown Karaf.

karaf@root()> 2013-03-20 13:21:40,306 | INFO  | Thread-3         | FeaturesServiceImpl              | 10 - org.apache.karaf.features.core - 3.0.0.SNAPSHOT | Installing feature management 3.0.0-SNAPSHOT
2013-03-20 13:21:40,335 | INFO  | Thread-3         | FeaturesServiceImpl              | 10 - org.apache.karaf.features.core - 3.0.0.SNAPSHOT | Installing feature package 3.0.0-SNAPSHOT
2013-03-20 13:21:40,350 | INFO  | Thread-3         | FeaturesServiceImpl              | 10 - org.apache.karaf.features.core - 3.0.0.SNAPSHOT | Installing feature kar 3.0.0-SNAPSHOT
2013-03-20 13:21:40,370 | INFO  | Thread-3         | FeaturesServiceImpl              | 10 - org.apache.karaf.features.core - 3.0.0.SNAPSHOT | Installing feature region 3.0.0-SNAPSHOT
[org.ops4j.pax.exam.rbc.client.RemoteBundleContextClient] : Remote bundle context found after 3265 millis
[org.ops4j.pax.exam.spi.reactors.EagerSingleStagedReactor] : installing probe 
--
[Probe ID: a6780994ef9192944151bae9cd26b7489e4a7770]
[Probe Location: file:/tmp/1363785696738-0/tinybundles_a6780994ef9192944151bae9cd26b7489e4a7770.bin]
[Tests: 
    SIG=[TestAddress:PaxExam-941d54d6-711f-4393-8d8b-0db5d9025169 root:PaxExam-941d54d6-711f-4393-8d8b-0db5d9025169]
    SIG=[TestAddress:PaxExam-eaf32bf0-df3a-4cf4-ad2a-945fb0c0c12d root:PaxExam-eaf32bf0-df3a-4cf4-ad2a-945fb0c0c12d]
]
[Headers: 
    DynamicImport-Package=*,org.apache.felix.service.*;status=provisional
    Ignore-Package=
    PaxExam-eaf32bf0-df3a-4cf4-ad2a-945fb0c0c12d=org.apache.karaf.itests.WebTest;listViaMBean
    PaxExam-Executable=PaxExam-941d54d6-711f-4393-8d8b-0db5d9025169,PaxExam-eaf32bf0-df3a-4cf4-ad2a-945fb0c0c12d,
    PaxExam-941d54d6-711f-4393-8d8b-0db5d9025169=org.apache.karaf.itests.WebTest;listCommand
    Built-By=jenkins
    TinybundlesVersion=pax-tinybundles-1.0.0
    Manifest-Version=1.0
    Tool=pax-tinybundles-1.0.0
    Created-By=pax-tinybundles-1.0.0
    Bundle-ManifestVersion=2
    Bundle-SymbolicName=PAXEXAM-PROBE-f4d792ef-8a01-42d2-a8a2-6aba4bfb7275
]
--

[org.ops4j.pax.exam.container.remote.RBCRemoteTarget] : Preparing and Installing bundle (from stream )..
[org.ops4j.pax.exam.rbc.client.RemoteBundleContextClient] : Packing probe into memory for true RMI. Hopefully things will fill in..
[org.ops4j.pax.exam.container.remote.RBCRemoteTarget] : Installed bundle (from stream) as ID: 92
[org.ops4j.pax.exam.spi.intern.DefaultTestAddress] : NEW ADDRESS= PaxExam-9e5ea63d-018a-459a-938a-f6932912c688 parent=[TestAddress:PaxExam-941d54d6-711f-4393-8d8b-0db5d9025169 root:PaxExam-941d54d6-711f-4393-8d8b-0db5d9025169] root=[TestAddress:PaxExam-941d54d6-711f-4393-8d8b-0db5d9025169 root:PaxExam-941d54d6-711f-4393-8d8b-0db5d9025169] args=[Ljava.lang.Object;@1bdd0df
[org.ops4j.pax.exam.spi.intern.DefaultTestAddress] : NEW ADDRESS= PaxExam-0b99d899-c902-4aaa-bbb9-b4b77ac97a37 parent=[TestAddress:PaxExam-eaf32bf0-df3a-4cf4-ad2a-945fb0c0c12d root:PaxExam-eaf32bf0-df3a-4cf4-ad2a-945fb0c0c12d] root=[TestAddress:PaxExam-eaf32bf0-df3a-4cf4-ad2a-945fb0c0c12d root:PaxExam-eaf32bf0-df3a-4cf4-ad2a-945fb0c0c12d] args=[Ljava.lang.Object;@dc0a66
[org.ops4j.pax.exam.junit.JUnit4TestRunner] : Invoke listCommand:org.apache.karaf.itests.WebTest.listCommand:KarafTestContainer{mvn:org.apache.karaf/apache-karaf/3.0.0-SNAPSHOT/tar.gz} @ [TestAddress:PaxExam-9e5ea63d-018a-459a-938a-f6932912c688 root:PaxExam-941d54d6-711f-4393-8d8b-0db5d9025169] Arguments: [Ljava.lang.Object;@1ae1a3d
[org.ops4j.pax.exam.container.remote.RBCRemoteTarget] : call [[TestAddress:PaxExam-9e5ea63d-018a-459a-938a-f6932912c688 root:PaxExam-941d54d6-711f-4393-8d8b-0db5d9025169]]
2013-03-20 13:21:40,860 | INFO  | 1)-67.195.138.60 | ContainerTestRunner              | 74 - org.ops4j.pax.exam.invoker.junit - 2.6.0 | running listCommand in reactor
2013-03-20 13:21:41,173 | INFO  | Thread-3         | core                             | 80 - org.apache.aries.jmx.core - 1.1.1 | Starting JMX OSGi agent
2013-03-20 13:21:41,190 | INFO  | Thread-3         | core                             | 80 - org.apache.aries.jmx.core - 1.1.1 | Registering MBean with ObjectName [osgi.compendium:service=cm,version=1.3,framework=org.apache.felix.framework,uuid=dbb04718-7938-4dbe-b629-ed83c07538fd] for service with service.id [11]
2013-03-20 13:21:41,213 | INFO  | JMX OSGi Agent   | core                             | 80 - org.apache.aries.jmx.core - 1.1.1 | Registering org.osgi.jmx.service.cm.ConfigurationAdminMBean to MBeanServer com.sun.jmx.mbeanserver.JmxMBeanServer@140727a with name osgi.compendium:service=cm,version=1.3,framework=org.apache.felix.framework,uuid=dbb04718-7938-4dbe-b629-ed83c07538fd
2013-03-20 13:21:41,214 | INFO  | JMX OSGi Agent   | core                             | 80 - org.apache.aries.jmx.core - 1.1.1 | Registering org.osgi.jmx.framework.PackageStateMBean to MBeanServer com.sun.jmx.mbeanserver.JmxMBeanServer@140727a with name osgi.core:type=packageState,version=1.5,framework=org.apache.felix.framework,uuid=dbb04718-7938-4dbe-b629-ed83c07538fd
2013-03-20 13:21:41,214 | INFO  | JMX OSGi Agent   | core                             | 80 - org.apache.aries.jmx.core - 1.1.1 | Registering org.osgi.jmx.framework.ServiceStateMBean to MBeanServer com.sun.jmx.mbeanserver.JmxMBeanServer@140727a with name osgi.core:type=serviceState,version=1.7,framework=org.apache.felix.framework,uuid=dbb04718-7938-4dbe-b629-ed83c07538fd
2013-03-20 13:21:41,216 | INFO  | JMX OSGi Agent   | core                             | 80 - org.apache.aries.jmx.core - 1.1.1 | Registering org.osgi.jmx.framework.BundleStateMBean to MBeanServer com.sun.jmx.mbeanserver.JmxMBeanServer@140727a with name osgi.core:type=bundleState,version=1.7,framework=org.apache.felix.framework,uuid=dbb04718-7938-4dbe-b629-ed83c07538fd
2013-03-20 13:21:41,216 | INFO  | JMX OSGi Agent   | core                             | 80 - org.apache.aries.jmx.core - 1.1.1 | Registering org.osgi.jmx.framework.wiring.BundleWiringStateMBean to MBeanServer com.sun.jmx.mbeanserver.JmxMBeanServer@140727a with name osgi.core:type=wiringState,version=1.1,framework=org.apache.felix.framework,uuid=dbb04718-7938-4dbe-b629-ed83c07538fd
2013-03-20 13:21:41,217 | INFO  | JMX OSGi Agent   | core                             | 80 - org.apache.aries.jmx.core - 1.1.1 | Registering org.osgi.jmx.framework.FrameworkMBean to MBeanServer com.sun.jmx.mbeanserver.JmxMBeanServer@140727a with name osgi.core:type=framework,version=1.7,framework=org.apache.felix.framework,uuid=dbb04718-7938-4dbe-b629-ed83c07538fd
2013-03-20 13:21:41,576 | INFO  | Thread-3         | RegionsPersistenceImpl           | 90 - org.apache.karaf.region.persist - 3.0.0.SNAPSHOT | Loading region digraph persistence
2013-03-20 13:21:41,602 | INFO  | Thread-3         | RegionsPersistenceImpl           | 90 - org.apache.karaf.region.persist - 3.0.0.SNAPSHOT | initializing region digraph from etc/regions-config.xml
feature:install war
2013-03-20 13:21:41,707 | INFO  | pool-5-thread-1  | FeaturesServiceImpl              | 10 - org.apache.karaf.features.core - 3.0.0.SNAPSHOT | Installing feature war 3.0.0-SNAPSHOT
2013-03-20 13:21:41,707 | INFO  | pool-5-thread-1  | FeaturesServiceImpl              | 10 - org.apache.karaf.features.core - 3.0.0.SNAPSHOT | Installing feature pax-war 3.0.0.M3
2013-03-20 13:21:41,708 | INFO  | pool-5-thread-1  | FeaturesServiceImpl              | 10 - org.apache.karaf.features.core - 3.0.0.SNAPSHOT | Installing feature pax-http-whiteboard 3.0.0.M3
2013-03-20 13:21:41,708 | INFO  | pool-5-thread-1  | FeaturesServiceImpl              | 10 - org.apache.karaf.features.core - 3.0.0.SNAPSHOT | Installing feature pax-http 3.0.0.M3
2013-03-20 13:21:41,708 | INFO  | pool-5-thread-1  | FeaturesServiceImpl              | 10 - org.apache.karaf.features.core - 3.0.0.SNAPSHOT | Installing feature pax-jetty 8.1.9.v20130131
2013-03-20 13:21:42,074 | INFO  | pool-5-thread-1  | Activator                        | 108 - org.ops4j.pax.web.pax-web-runtime - 3.0.0.M3 | EventAdmin support is not available, no servlet events will be postet!
2013-03-20 13:21:42,082 | INFO  | pool-5-thread-1  | Activator                        | 108 - org.ops4j.pax.web.pax-web-runtime - 3.0.0.M3 | LogService support enabled, log events will be created.
2013-03-20 13:21:42,087 | INFO  | pool-5-thread-1  | Activator                        | 108 - org.ops4j.pax.web.pax-web-runtime - 3.0.0.M3 | Pax Web started
2013-03-20 13:21:42,165 | INFO  | pool-10-thread-1 | Server                           | 99 - org.eclipse.jetty.aggregate.jetty-all-server - 8.1.9.v20130131 | jetty-8.1.9.v20130131
2013-03-20 13:21:42,187 | INFO  | pool-10-thread-1 | JettyServerImpl                  | 109 - org.ops4j.pax.web.pax-web-jetty - 3.0.0.M3 | Pax Web available at [0.0.0.0]:[9081]
2013-03-20 13:21:42,206 | INFO  | pool-10-thread-1 | AbstractConnector                | 99 - org.eclipse.jetty.aggregate.jetty-all-server - 8.1.9.v20130131 | Started NIOSocketConnectorWrapper@0.0.0.0:9081
2013-03-20 13:21:42,212 | INFO  | pool-10-thread-1 | HttpServiceFactoryImpl           | 108 - org.ops4j.pax.web.pax-web-runtime - 3.0.0.M3 | Binding bundle: [org.apache.karaf.deployer.features [4]] to http service
2013-03-20 13:21:42,283 | INFO  | pool-5-thread-1  | HttpServiceFactoryImpl           | 108 - org.ops4j.pax.web.pax-web-runtime - 3.0.0.M3 | Binding bundle: [org.ops4j.pax.web.pax-web-extender-war [112]] to http service

web:list
ID | State | Web-State | Level | Web-ContextPath | Name
-------------------------------------------------------

[org.ops4j.pax.exam.junit.JUnit4TestRunner] : Invoke listViaMBean:org.apache.karaf.itests.WebTest.listViaMBean:KarafTestContainer{mvn:org.apache.karaf/apache-karaf/3.0.0-SNAPSHOT/tar.gz} @ [TestAddress:PaxExam-0b99d899-c902-4aaa-bbb9-b4b77ac97a37 root:PaxExam-eaf32bf0-df3a-4cf4-ad2a-945fb0c0c12d] Arguments: [Ljava.lang.Object;@13cb75a
[org.ops4j.pax.exam.container.remote.RBCRemoteTarget] : call [[TestAddress:PaxExam-0b99d899-c902-4aaa-bbb9-b4b77ac97a37 root:PaxExam-eaf32bf0-df3a-4cf4-ad2a-945fb0c0c12d]]
2013-03-20 13:21:42,476 | INFO  | 1)-67.195.138.60 | ContainerTestRunner              | 74 - org.ops4j.pax.exam.invoker.junit - 2.6.0 | running listViaMBean in reactor
feature:install war
2013-03-20 13:21:42,479 | INFO  | pool-11-thread-1 | FeaturesServiceImpl              | 10 - org.apache.karaf.features.core - 3.0.0.SNAPSHOT | Installing feature war 3.0.0-SNAPSHOT
2013-03-20 13:21:42,480 | INFO  | pool-11-thread-1 | FeaturesServiceImpl              | 10 - org.apache.karaf.features.core - 3.0.0.SNAPSHOT | Installing feature pax-war 3.0.0.M3
2013-03-20 13:21:42,480 | INFO  | pool-11-thread-1 | FeaturesServiceImpl              | 10 - org.apache.karaf.features.core - 3.0.0.SNAPSHOT | Installing feature pax-http-whiteboard 3.0.0.M3
2013-03-20 13:21:42,480 | INFO  | pool-11-thread-1 | FeaturesServiceImpl              | 10 - org.apache.karaf.features.core - 3.0.0.SNAPSHOT | Installing feature pax-http 3.0.0.M3
2013-03-20 13:21:42,480 | INFO  | pool-11-thread-1 | FeaturesServiceImpl              | 10 - org.apache.karaf.features.core - 3.0.0.SNAPSHOT | Installing feature pax-jetty 8.1.9.v20130131

[org.apache.karaf.tooling.exam.container.internal.KarafTestContainer] : Shutting down the test container (Pax Runner)
2013-03-20 13:21:42,666 | INFO  | 1)-67.195.138.60 | TestBundleObserver               | 71 - org.ops4j.pax.exam.extender.service - 2.6.0 | Unregistered testcase [org.ops4j.pax.exam.raw.extender.intern.Probe@9e40d2.]
Tests run: 2, Failures: 0, Errors: 0, Skipped: 0, Time elapsed: 5.933 sec

Results :

Failed tests:   installCommand:org.apache.karaf.itests.WrapperTest.installCommand:KarafTestContainer{mvn:org.apache.karaf\/apache-karaf\/3.0.0-SNAPSHOT\/tar.gz}(org.apache.karaf.itests.WrapperTest)

Tests in error: 
  installViaMBean:org.apache.karaf.itests.WrapperTest.installViaMBean:KarafTestContainer{mvn:org.apache.karaf\/apache-karaf\/3.0.0-SNAPSHOT\/tar.gz}(org.apache.karaf.itests.WrapperTest): org.apache.karaf:type=wrapper,name=root
  installWrapperFeature:org.apache.karaf.itests.features.StandardFeaturesTest.installWrapperFeature:KarafTestContainer{mvn:org.apache.karaf\/apache-karaf\/3.0.0-SNAPSHOT\/tar.gz}(org.apache.karaf.itests.features.StandardFeaturesTest): Unresolved constraint in bundle org.apache.karaf.wrapper.core [93]: Unable to resolve 93.0: missing requirement [93.0] osgi.wiring.package; (osgi.wiring.package=org.apache.felix.utils.properties)

Tests run: 81, Failures: 1, Errors: 2, Skipped: 2

[ERROR] There are test failures.

Please refer to <https://builds.apache.org/job/Karaf/ws/karaf/itests/target/surefire-reports> for the individual test results.
Sending e-mails to: commits@karaf.apache.org
Sending e-mails to: commits@karaf.apache.org
ERROR: Processing failed due to a bug in the code. Please report this to jenkinsci-users@googlegroups.com
hudson.remoting.RequestAbortedException: hudson.remoting.RequestAbortedException: java.io.StreamCorruptedException: invalid type code: B6
	at hudson.remoting.Request.call(Request.java:174)
	at hudson.remoting.Channel.call(Channel.java:672)
	at hudson.maven.ProcessCache$MavenProcess.call(ProcessCache.java:156)
	at hudson.maven.MavenModuleSetBuild$MavenModuleSetBuildExecution.doRun(MavenModuleSetBuild.java:755)
	at hudson.model.AbstractBuild$AbstractBuildExecution.run(AbstractBuild.java:592)
	at hudson.model.Run.execute(Run.java:1568)
	at hudson.maven.MavenModuleSetBuild.run(MavenModuleSetBuild.java:477)
	at hudson.model.ResourceController.execute(ResourceController.java:88)
	at hudson.model.Executor.run(Executor.java:236)
Caused by: hudson.remoting.RequestAbortedException: java.io.StreamCorruptedException: invalid type code: B6
	at hudson.remoting.Request.abort(Request.java:299)
	at hudson.remoting.Channel.terminate(Channel.java:732)
	at hudson.slaves.Channels$1.terminate(Channels.java:77)
	at hudson.remoting.SynchronousCommandTransport$ReaderThread.run(SynchronousCommandTransport.java:69)
Caused by: java.io.StreamCorruptedException: invalid type code: B6
	at java.io.ObjectInputStream.readObject0(ObjectInputStream.java:1374)
	at java.io.ObjectInputStream.defaultReadFields(ObjectInputStream.java:1970)
	at java.io.ObjectInputStream.readSerialData(ObjectInputStream.java:1894)
	at java.io.ObjectInputStream.readOrdinaryObject(ObjectInputStream.java:1777)
	at java.io.ObjectInputStream.readObject0(ObjectInputStream.java:1347)
	at java.io.ObjectInputStream.readObject(ObjectInputStream.java:369)
	at hudson.remoting.Command.readFrom(Command.java:92)
	at hudson.remoting.ClassicCommandTransport.read(ClassicCommandTransport.java:59)
	at hudson.remoting.SynchronousCommandTransport$ReaderThread.run(SynchronousCommandTransport.java:48)
project=hudson.maven.MavenModuleSet@5cec25ad[Karaf]
project.getModules()=[hudson.maven.MavenModule@7ef37171[Karaf/org.apache.karaf:apache-karaf][Karaf/org.apache.karaf:apache-karaf][relativePath:assemblies/apache-karaf], hudson.maven.MavenModule@209cf2d4[Karaf/org.apache.karaf:apache-karaf-minimal][Karaf/org.apache.karaf:apache-karaf-minimal][relativePath:assemblies/apache-karaf-minimal], hudson.maven.MavenModule@200a4d06[Karaf/org.apache.karaf:archetypes][Karaf/org.apache.karaf:archetypes][relativePath:archetypes], hudson.maven.MavenModule@446d559[Karaf/org.apache.karaf:demos][Karaf/org.apache.karaf:demos][relativePath:assemblies/demos], hudson.maven.MavenModule@2c79e2b[Karaf/org.apache.karaf:itests][Karaf/org.apache.karaf:itests][relativePath:itests], hudson.maven.MavenModule@4660c840[Karaf/org.apache.karaf:karaf][Karaf/org.apache.karaf:karaf][relativePath:], hudson.maven.MavenModule@7f611a79[Karaf/org.apache.karaf:manual][Karaf/org.apache.karaf:manual][relativePath:manual], hudson.maven.MavenModule@7bfb05d8[Karaf/org.apache.karaf:org.apache.karaf.client][Karaf/org.apache.karaf:org.apache.karaf.client][relativePath:client], hudson.maven.MavenModule@40113f44[Karaf/org.apache.karaf:org.apache.karaf.doc][Karaf/org.apache.karaf:org.apache.karaf.doc][relativePath:documentation], hudson.maven.MavenModule@1d3ce77f[Karaf/org.apache.karaf:org.apache.karaf.exception][Karaf/org.apache.karaf:org.apache.karaf.exception][relativePath:exception], hudson.maven.MavenModule@98251d8[Karaf/org.apache.karaf:org.apache.karaf.main][Karaf/org.apache.karaf:org.apache.karaf.main][relativePath:main], hudson.maven.MavenModule@2c50aa38[Karaf/org.apache.karaf:org.apache.karaf.management][Karaf/org.apache.karaf:org.apache.karaf.management][relativePath:management], hudson.maven.MavenModule@4acb40c8[Karaf/org.apache.karaf:org.apache.karaf.util][Karaf/org.apache.karaf:org.apache.karaf.util][relativePath:util], hudson.maven.MavenModule@63d75942[Karaf/org.apache.karaf:org.osgi.compendium][Karaf/org.apache.karaf:org.osgi.compendium][relativePath:osgicompendium], hudson.maven.MavenModule@4f252f43[Karaf/org.apache.karaf:org.osgi.core][Karaf/org.apache.karaf:org.osgi.core][relativePath:osgicore], hudson.maven.MavenModule@660a30d4[Karaf/org.apache.karaf:scheduler][Karaf/org.apache.karaf:scheduler][relativePath:scheduler], hudson.maven.MavenModule@1242004d[Karaf/org.apache.karaf:tests][Karaf/org.apache.karaf:tests][relativePath:itests/tests], hudson.maven.MavenModule@2b21c898[Karaf/org.apache.karaf.admin:admin][Karaf/org.apache.karaf.admin:admin][relativePath:admin], hudson.maven.MavenModule@36f88947[Karaf/org.apache.karaf.admin:org.apache.karaf.admin.command][Karaf/org.apache.karaf.admin:org.apache.karaf.admin.command][relativePath:admin/command], hudson.maven.MavenModule@76fcb082[Karaf/org.apache.karaf.admin:org.apache.karaf.admin.core][Karaf/org.apache.karaf.admin:org.apache.karaf.admin.core][relativePath:admin/core], hudson.maven.MavenModule@47a863d5[Karaf/org.apache.karaf.admin:org.apache.karaf.admin.management][Karaf/org.apache.karaf.admin:org.apache.karaf.admin.management][relativePath:admin/management], hudson.maven.MavenModule@3259b4[Karaf/org.apache.karaf.archetypes:archetypes-command][Karaf/org.apache.karaf.archetypes:archetypes-command][relativePath:archetypes/command], hudson.maven.MavenModule@699f3885[Karaf/org.apache.karaf.archetypes:archetypes-itests][Karaf/org.apache.karaf.archetypes:archetypes-itests][relativePath:archetypes/itests], hudson.maven.MavenModule@270be2a2[Karaf/org.apache.karaf.archetypes:karaf-assembly-archetype][Karaf/org.apache.karaf.archetypes:karaf-assembly-archetype][relativePath:archetypes/assembly], hudson.maven.MavenModule@7d4c0db4[Karaf/org.apache.karaf.archetypes:karaf-blueprint-archetype][Karaf/org.apache.karaf.archetypes:karaf-blueprint-archetype][relativePath:archetypes/blueprint], hudson.maven.MavenModule@c17e4b0[Karaf/org.apache.karaf.archetypes:karaf-bundle-archetype][Karaf/org.apache.karaf.archetypes:karaf-bundle-archetype][relativePath:archetypes/bundle], hudson.maven.MavenModule@74a6e503[Karaf/org.apache.karaf.archetypes:karaf-command-archetype][Karaf/org.apache.karaf.archetypes:karaf-command-archetype][relativePath:archetypes/command], hudson.maven.MavenModule@790563c9[Karaf/org.apache.karaf.archetypes:karaf-feature-archetype][Karaf/org.apache.karaf.archetypes:karaf-feature-archetype][relativePath:archetypes/feature], hudson.maven.MavenModule@50da5f31[Karaf/org.apache.karaf.archetypes:karaf-kar-archetype][Karaf/org.apache.karaf.archetypes:karaf-kar-archetype][relativePath:archetypes/kar], hudson.maven.MavenModule@5437d9ef[Karaf/org.apache.karaf.assemblies:apache-karaf][Karaf/org.apache.karaf.assemblies:apache-karaf][relativePath:assemblies/apache-karaf], hudson.maven.MavenModule@1ec5051b[Karaf/org.apache.karaf.assemblies:apache-karaf-full][Karaf/org.apache.karaf.assemblies:apache-karaf-full][relativePath:assemblies/apache-karaf-full], hudson.maven.MavenModule@18d23f65[Karaf/org.apache.karaf.assemblies:apache-karaf-minimal][Karaf/org.apache.karaf.assemblies:apache-karaf-minimal][relativePath:assemblies/apache-karaf-minimal], hudson.maven.MavenModule@309fb36f[Karaf/org.apache.karaf.assemblies:assemblies][Karaf/org.apache.karaf.assemblies:assemblies][relativePath:assemblies], hudson.maven.MavenModule@13400c9e[Karaf/org.apache.karaf.assemblies.features:enterprise][Karaf/org.apache.karaf.assemblies.features:enterprise][relativePath:assemblies/features/enterprise], hudson.maven.MavenModule@44bd5559[Karaf/org.apache.karaf.assemblies.features:features][Karaf/org.apache.karaf.assemblies.features:features][relativePath:assemblies/features], hudson.maven.MavenModule@51fc62f1[Karaf/org.apache.karaf.assemblies.features:karaf-framework][Karaf/org.apache.karaf.assemblies.features:karaf-framework][relativePath:assemblies/features/framework], hudson.maven.MavenModule@10c3e644[Karaf/org.apache.karaf.assemblies.features:karaf-full][Karaf/org.apache.karaf.assemblies.features:karaf-full][relativePath:assemblies/features/full], hudson.maven.MavenModule@2d4282f5[Karaf/org.apache.karaf.assemblies.features:org.apache.karaf.feature.enterprise][Karaf/org.apache.karaf.assemblies.features:org.apache.karaf.feature.enterprise][relativePath:assemblies/features/enterprise], hudson.maven.MavenModule@69a3ba09[Karaf/org.apache.karaf.assemblies.features:org.apache.karaf.feature.framework][Karaf/org.apache.karaf.assemblies.features:org.apache.karaf.feature.framework][relativePath:assemblies/features/framework], hudson.maven.MavenModule@7c0adb0d[Karaf/org.apache.karaf.assemblies.features:org.apache.karaf.feature.full][Karaf/org.apache.karaf.assemblies.features:org.apache.karaf.feature.full][relativePath:assemblies/features/full], hudson.maven.MavenModule@2cb3721a[Karaf/org.apache.karaf.assemblies.features:org.apache.karaf.feature.karaf-framework][Karaf/org.apache.karaf.assemblies.features:org.apache.karaf.feature.karaf-framework][relativePath:assemblies/features/framework], hudson.maven.MavenModule@39081fe3[Karaf/org.apache.karaf.assemblies.features:org.apache.karaf.feature.karaf-full][Karaf/org.apache.karaf.assemblies.features:org.apache.karaf.feature.karaf-full][relativePath:assemblies/features/full], hudson.maven.MavenModule@44658d55[Karaf/org.apache.karaf.assemblies.features:org.apache.karaf.feature.standard][Karaf/org.apache.karaf.assemblies.features:org.apache.karaf.feature.standard][relativePath:assemblies/features/standard], hudson.maven.MavenModule@6721ea87[Karaf/org.apache.karaf.assemblies.features:org.apache.karaf.features.enterprise][Karaf/org.apache.karaf.assemblies.features:org.apache.karaf.features.enterprise][relativePath:assemblies/features/enterprise], hudson.maven.MavenModule@63ac79f6[Karaf/org.apache.karaf.assemblies.features:org.apache.karaf.features.framework][Karaf/org.apache.karaf.assemblies.features:org.apache.karaf.features.framework][relativePath:assemblies/features/framework], hudson.maven.MavenModule@507b3899[Karaf/org.apache.karaf.assemblies.features:org.apache.karaf.features.standard][Karaf/org.apache.karaf.assemblies.features:org.apache.karaf.features.standard][relativePath:assemblies/features/standard], hudson.maven.MavenModule@49c0ee16[Karaf/org.apache.karaf.assemblies.features:standard][Karaf/org.apache.karaf.assemblies.features:standard][relativePath:assemblies/features/standard], hudson.maven.MavenModule@6a2e6950[Karaf/org.apache.karaf.bundle:bundle][Karaf/org.apache.karaf.bundle:bundle][relativePath:bundle], hudson.maven.MavenModule@d0439a6[Karaf/org.apache.karaf.bundle:org.apache.karaf.bundle.command][Karaf/org.apache.karaf.bundle:org.apache.karaf.bundle.command][relativePath:bundle/command], hudson.maven.MavenModule@1064c7f7[Karaf/org.apache.karaf.bundle:org.apache.karaf.bundle.core][Karaf/org.apache.karaf.bundle:org.apache.karaf.bundle.core][relativePath:bundle/core], hudson.maven.MavenModule@194f0c2e[Karaf/org.apache.karaf.bundle:org.apache.karaf.bundle.management][Karaf/org.apache.karaf.bundle:org.apache.karaf.bundle.management][relativePath:bundle/management], hudson.maven.MavenModule@48843189[Karaf/org.apache.karaf.bundle:org.apache.karaf.bundle.springstate][Karaf/org.apache.karaf.bundle:org.apache.karaf.bundle.springstate][relativePath:bundle/springstate], hudson.maven.MavenModule@5ed03e90[Karaf/org.apache.karaf.config:config][Karaf/org.apache.karaf.config:config][relativePath:config], hudson.maven.MavenModule@39bb9091[Karaf/org.apache.karaf.config:org.apache.karaf.config.command][Karaf/org.apache.karaf.config:org.apache.karaf.config.command][relativePath:config/command], hudson.maven.MavenModule@49103d33[Karaf/org.apache.karaf.config:org.apache.karaf.config.core][Karaf/org.apache.karaf.config:org.apache.karaf.config.core][relativePath:config/core], hudson.maven.MavenModule@14a8acfd[Karaf/org.apache.karaf.config:org.apache.karaf.config.management][Karaf/org.apache.karaf.config:org.apache.karaf.config.management][relativePath:config/management], hudson.maven.MavenModule@492204be[Karaf/org.apache.karaf.demos:demos][Karaf/org.apache.karaf.demos:demos][relativePath:demos], hudson.maven.MavenModule@58657b74[Karaf/org.apache.karaf.demos:dump][Karaf/org.apache.karaf.demos:dump][relativePath:demos/dump], hudson.maven.MavenModule@6e8c2a02[Karaf/org.apache.karaf.demos:my-kar][Karaf/org.apache.karaf.demos:my-kar][relativePath:demos/deployer/kar], hudson.maven.MavenModule@4df520a3[Karaf/org.apache.karaf.demos:org.apache.karaf.demos.branding][Karaf/org.apache.karaf.demos:org.apache.karaf.demos.branding][relativePath:demos/branding], hudson.maven.MavenModule@341a2201[Karaf/org.apache.karaf.demos:org.apache.karaf.demos.branding.shell][Karaf/org.apache.karaf.demos:org.apache.karaf.demos.branding.shell][relativePath:demos/branding], hudson.maven.MavenModule@1fae8a60[Karaf/org.apache.karaf.demos:org.apache.karaf.demos.command][Karaf/org.apache.karaf.demos:org.apache.karaf.demos.command][relativePath:demos/command], hudson.maven.MavenModule@1831d551[Karaf/org.apache.karaf.demos:org.apache.karaf.demos.command.custom][Karaf/org.apache.karaf.demos:org.apache.karaf.demos.command.custom][relativePath:demos/command], hudson.maven.MavenModule@7bfeb4df[Karaf/org.apache.karaf.demos:org.apache.karaf.demos.deployer][Karaf/org.apache.karaf.demos:org.apache.karaf.demos.deployer][relativePath:demos/deployer], hudson.maven.MavenModule@6fabc53f[Karaf/org.apache.karaf.demos:org.apache.karaf.demos.dump][Karaf/org.apache.karaf.demos:org.apache.karaf.demos.dump][relativePath:demos/dump], hudson.maven.MavenModule@7622e45f[Karaf/org.apache.karaf.demos:org.apache.karaf.demos.web][Karaf/org.apache.karaf.demos:org.apache.karaf.demos.web][relativePath:demos/web], hudson.maven.MavenModule@f14dc12[Karaf/org.apache.karaf.demos:web][Karaf/org.apache.karaf.demos:web][relativePath:demos/web], hudson.maven.MavenModule@227c297a[Karaf/org.apache.karaf.demos.deployer.bundle:my-bundle][Karaf/org.apache.karaf.demos.deployer.bundle:my-bundle][relativePath:demos/deployer/bundle], hudson.maven.MavenModule@5871a46[Karaf/org.apache.karaf.deployer:deployer][Karaf/org.apache.karaf.deployer:deployer][relativePath:deployer], hudson.maven.MavenModule@68cdec7f[Karaf/org.apache.karaf.deployer:org.apache.karaf.deployer.blueprint][Karaf/org.apache.karaf.deployer:org.apache.karaf.deployer.blueprint][relativePath:deployer/blueprint], hudson.maven.MavenModule@2761bb9a[Karaf/org.apache.karaf.deployer:org.apache.karaf.deployer.features][Karaf/org.apache.karaf.deployer:org.apache.karaf.deployer.features][relativePath:deployer/features], hudson.maven.MavenModule@1638fa9[Karaf/org.apache.karaf.deployer:org.apache.karaf.deployer.kar][Karaf/org.apache.karaf.deployer:org.apache.karaf.deployer.kar][relativePath:deployer/kar], hudson.maven.MavenModule@2f6ca0f5[Karaf/org.apache.karaf.deployer:org.apache.karaf.deployer.spring][Karaf/org.apache.karaf.deployer:org.apache.karaf.deployer.spring][relativePath:deployer/spring], hudson.maven.MavenModule@6cbf5590[Karaf/org.apache.karaf.deployer:org.apache.karaf.deployer.war][Karaf/org.apache.karaf.deployer:org.apache.karaf.deployer.war][relativePath:deployer/war], hudson.maven.MavenModule@4bb4d26[Karaf/org.apache.karaf.deployer:org.apache.karaf.deployer.wrap][Karaf/org.apache.karaf.deployer:org.apache.karaf.deployer.wrap][relativePath:deployer/wrap], hudson.maven.MavenModule@58a98b7[Karaf/org.apache.karaf.dev:dev][Karaf/org.apache.karaf.dev:dev][relativePath:dev], hudson.maven.MavenModule@4e301938[Karaf/org.apache.karaf.dev:org.apache.karaf.dev.command][Karaf/org.apache.karaf.dev:org.apache.karaf.dev.command][relativePath:dev/command], hudson.maven.MavenModule@37c7d3a2[Karaf/org.apache.karaf.dev:org.apache.karaf.dev.core][Karaf/org.apache.karaf.dev:org.apache.karaf.dev.core][relativePath:dev/core], hudson.maven.MavenModule@24c5fc37[Karaf/org.apache.karaf.diagnostic:diagnostic][Karaf/org.apache.karaf.diagnostic:diagnostic][relativePath:diagnostic], hudson.maven.MavenModule@423191bd[Karaf/org.apache.karaf.diagnostic:org.apache.karaf.diagnostic.command][Karaf/org.apache.karaf.diagnostic:org.apache.karaf.diagnostic.command][relativePath:diagnostic/command], hudson.maven.MavenModule@20174d4a[Karaf/org.apache.karaf.diagnostic:org.apache.karaf.diagnostic.common][Karaf/org.apache.karaf.diagnostic:org.apache.karaf.diagnostic.common][relativePath:diagnostic/common], hudson.maven.MavenModule@4457313e[Karaf/org.apache.karaf.diagnostic:org.apache.karaf.diagnostic.core][Karaf/org.apache.karaf.diagnostic:org.apache.karaf.diagnostic.core][relativePath:diagnostic/core], hudson.maven.MavenModule@59d345bb[Karaf/org.apache.karaf.diagnostic:org.apache.karaf.diagnostic.management][Karaf/org.apache.karaf.diagnostic:org.apache.karaf.diagnostic.management][relativePath:diagnostic/management], hudson.maven.MavenModule@3862007f[Karaf/org.apache.karaf.features:enterprise][Karaf/org.apache.karaf.features:enterprise][relativePath:assemblies/features/enterprise], hudson.maven.MavenModule@2a0eaec4[Karaf/org.apache.karaf.features:features][Karaf/org.apache.karaf.features:features][relativePath:features], hudson.maven.MavenModule@29f3db6e[Karaf/org.apache.karaf.features:framework][Karaf/org.apache.karaf.features:framework][relativePath:assemblies/features/framework], hudson.maven.MavenModule@48cb2846[Karaf/org.apache.karaf.features:org.apache.karaf.features.command][Karaf/org.apache.karaf.features:org.apache.karaf.features.command][relativePath:features/command], hudson.maven.MavenModule@11c13100[Karaf/org.apache.karaf.features:org.apache.karaf.features.core][Karaf/org.apache.karaf.features:org.apache.karaf.features.core][relativePath:features/core], hudson.maven.MavenModule@3d87260f[Karaf/org.apache.karaf.features:org.apache.karaf.features.encryption][Karaf/org.apache.karaf.features:org.apache.karaf.features.encryption][relativePath:features/encryption], hudson.maven.MavenModule@73d3c257[Karaf/org.apache.karaf.features:org.apache.karaf.features.management][Karaf/org.apache.karaf.features:org.apache.karaf.features.management][relativePath:features/management], hudson.maven.MavenModule@2278001b[Karaf/org.apache.karaf.features:org.apache.karaf.features.obr][Karaf/org.apache.karaf.features:org.apache.karaf.features.obr][relativePath:features/obr], hudson.maven.MavenModule@744efe4a[Karaf/org.apache.karaf.features:spring][Karaf/org.apache.karaf.features:spring][relativePath:assemblies/features/spring], hudson.maven.MavenModule@6e18e7ed[Karaf/org.apache.karaf.features:standard][Karaf/org.apache.karaf.features:standard][relativePath:assemblies/features/standard], hudson.maven.MavenModule@537c1929[Karaf/org.apache.karaf.features.assembly:assembly][Karaf/org.apache.karaf.features.assembly:assembly][relativePath:features/assembly], hudson.maven.MavenModule@7857fd90[Karaf/org.apache.karaf.features.assembly:enterprise][Karaf/org.apache.karaf.features.assembly:enterprise][relativePath:features/assembly/enterprise], hudson.maven.MavenModule@58c836a9[Karaf/org.apache.karaf.features.assembly:karaf-framework][Karaf/org.apache.karaf.features.assembly:karaf-framework][relativePath:features/assembly/framework], hudson.maven.MavenModule@407cbec8[Karaf/org.apache.karaf.features.assembly:standard][Karaf/org.apache.karaf.features.assembly:standard][relativePath:features/assembly/standard], hudson.maven.MavenModule@2522b113[Karaf/org.apache.karaf.http:http][Karaf/org.apache.karaf.http:http][relativePath:http], hudson.maven.MavenModule@8976971[Karaf/org.apache.karaf.http:org.apache.karaf.http.command][Karaf/org.apache.karaf.http:org.apache.karaf.http.command][relativePath:http/command], hudson.maven.MavenModule@c8b7e1f[Karaf/org.apache.karaf.http:org.apache.karaf.http.core][Karaf/org.apache.karaf.http:org.apache.karaf.http.core][relativePath:http/core], hudson.maven.MavenModule@1a052ba8[Karaf/org.apache.karaf.instance:instance][Karaf/org.apache.karaf.instance:instance][relativePath:instance], hudson.maven.MavenModule@49752ff0[Karaf/org.apache.karaf.instance:org.apache.karaf.instance.command][Karaf/org.apache.karaf.instance:org.apache.karaf.instance.command][relativePath:instance/command], hudson.maven.MavenModule@2c9e5b3d[Karaf/org.apache.karaf.instance:org.apache.karaf.instance.core][Karaf/org.apache.karaf.instance:org.apache.karaf.instance.core][relativePath:instance/core], hudson.maven.MavenModule@3dd15d8b[Karaf/org.apache.karaf.instance:org.apache.karaf.instance.management][Karaf/org.apache.karaf.instance:org.apache.karaf.instance.management][relativePath:instance/management], hudson.maven.MavenModule@7c547061[Karaf/org.apache.karaf.itests:dependencies][Karaf/org.apache.karaf.itests:dependencies][relativePath:itests/dependencies], hudson.maven.MavenModule@507818ad[Karaf/org.apache.karaf.itests:itests][Karaf/org.apache.karaf.itests:itests][relativePath:itests], hudson.maven.MavenModule@b9e300c[Karaf/org.apache.karaf.itests:kittests][Karaf/org.apache.karaf.itests:kittests][relativePath:itests/kittests], hudson.maven.MavenModule@3e6469c9[Karaf/org.apache.karaf.itests:tests][Karaf/org.apache.karaf.itests:tests][relativePath:itests/tests], hudson.maven.MavenModule@7c9c2f20[Karaf/org.apache.karaf.jaas:jaas][Karaf/org.apache.karaf.jaas:jaas][relativePath:jaas], hudson.maven.MavenModule@71da1dc9[Karaf/org.apache.karaf.jaas:org.apache.karaf.jaas.boot][Karaf/org.apache.karaf.jaas:org.apache.karaf.jaas.boot][relativePath:jaas/boot], hudson.maven.MavenModule@26d9b184[Karaf/org.apache.karaf.jaas:org.apache.karaf.jaas.command][Karaf/org.apache.karaf.jaas:org.apache.karaf.jaas.command][relativePath:jaas/command], hudson.maven.MavenModule@1e156509[Karaf/org.apache.karaf.jaas:org.apache.karaf.jaas.config][Karaf/org.apache.karaf.jaas:org.apache.karaf.jaas.config][relativePath:jaas/config], hudson.maven.MavenModule@e9c414d[Karaf/org.apache.karaf.jaas:org.apache.karaf.jaas.jasypt][Karaf/org.apache.karaf.jaas:org.apache.karaf.jaas.jasypt][relativePath:jaas/jasypt], hudson.maven.MavenModule@325d2b1f[Karaf/org.apache.karaf.jaas:org.apache.karaf.jaas.karafrealm][Karaf/org.apache.karaf.jaas:org.apache.karaf.jaas.karafrealm][relativePath:jaas/karafrealm], hudson.maven.MavenModule@34832db9[Karaf/org.apache.karaf.jaas:org.apache.karaf.jaas.modules][Karaf/org.apache.karaf.jaas:org.apache.karaf.jaas.modules][relativePath:jaas/modules], hudson.maven.MavenModule@102ee79e[Karaf/org.apache.karaf.kar:kar][Karaf/org.apache.karaf.kar:kar][relativePath:kar], hudson.maven.MavenModule@77683e5e[Karaf/org.apache.karaf.kar:org.apache.karaf.kar.command][Karaf/org.apache.karaf.kar:org.apache.karaf.kar.command][relativePath:kar/command], hudson.maven.MavenModule@5cd6ca90[Karaf/org.apache.karaf.kar:org.apache.karaf.kar.core][Karaf/org.apache.karaf.kar:org.apache.karaf.kar.core][relativePath:kar/core], hudson.maven.MavenModule@2ba1a0e[Karaf/org.apache.karaf.kar:org.apache.karaf.kar.management][Karaf/org.apache.karaf.kar:org.apache.karaf.kar.management][relativePath:kar/management], hudson.maven.MavenModule@198ce38e[Karaf/org.apache.karaf.log:log][Karaf/org.apache.karaf.log:log][relativePath:log], hudson.maven.MavenModule@70af8cbc[Karaf/org.apache.karaf.log:org.apache.karaf.log.command][Karaf/org.apache.karaf.log:org.apache.karaf.log.command][relativePath:log/command], hudson.maven.MavenModule@1540c470[Karaf/org.apache.karaf.log:org.apache.karaf.log.core][Karaf/org.apache.karaf.log:org.apache.karaf.log.core][relativePath:log/core], hudson.maven.MavenModule@4f209ff6[Karaf/org.apache.karaf.management:management][Karaf/org.apache.karaf.management:management][relativePath:management], hudson.maven.MavenModule@66e5f80f[Karaf/org.apache.karaf.management:org.apache.karaf.management.server][Karaf/org.apache.karaf.management:org.apache.karaf.management.server][relativePath:management/server], hudson.maven.MavenModule@8048e88[Karaf/org.apache.karaf.management.mbeans:mbeans][Karaf/org.apache.karaf.management.mbeans:mbeans][relativePath:management/mbeans], hudson.maven.MavenModule@632986d4[Karaf/org.apache.karaf.management.mbeans:org.apache.karaf.management.mbeans.bundles][Karaf/org.apache.karaf.management.mbeans:org.apache.karaf.management.mbeans.bundles][relativePath:management/mbeans/bundles], hudson.maven.MavenModule@3b52fb28[Karaf/org.apache.karaf.management.mbeans:org.apache.karaf.management.mbeans.config][Karaf/org.apache.karaf.management.mbeans:org.apache.karaf.management.mbeans.config][relativePath:management/mbeans/config], hudson.maven.MavenModule@44e71d85[Karaf/org.apache.karaf.management.mbeans:org.apache.karaf.management.mbeans.dev][Karaf/org.apache.karaf.management.mbeans:org.apache.karaf.management.mbeans.dev][relativePath:management/mbeans/dev], hudson.maven.MavenModule@21432a1a[Karaf/org.apache.karaf.management.mbeans:org.apache.karaf.management.mbeans.http][Karaf/org.apache.karaf.management.mbeans:org.apache.karaf.management.mbeans.http][relativePath:management/mbeans/http], hudson.maven.MavenModule@40812205[Karaf/org.apache.karaf.management.mbeans:org.apache.karaf.management.mbeans.log][Karaf/org.apache.karaf.management.mbeans:org.apache.karaf.management.mbeans.log][relativePath:management/mbeans/log], hudson.maven.MavenModule@5de09758[Karaf/org.apache.karaf.management.mbeans:org.apache.karaf.management.mbeans.obr][Karaf/org.apache.karaf.management.mbeans:org.apache.karaf.management.mbeans.obr][relativePath:management/mbeans/obr], hudson.maven.MavenModule@43f0428e[Karaf/org.apache.karaf.management.mbeans:org.apache.karaf.management.mbeans.packages][Karaf/org.apache.karaf.management.mbeans:org.apache.karaf.management.mbeans.packages][relativePath:management/mbeans/packages], hudson.maven.MavenModule@52a19b7a[Karaf/org.apache.karaf.management.mbeans:org.apache.karaf.management.mbeans.services][Karaf/org.apache.karaf.management.mbeans:org.apache.karaf.management.mbeans.services][relativePath:management/mbeans/services], hudson.maven.MavenModule@6fe690f7[Karaf/org.apache.karaf.management.mbeans:org.apache.karaf.management.mbeans.system][Karaf/org.apache.karaf.management.mbeans:org.apache.karaf.management.mbeans.system][relativePath:management/mbeans/system], hudson.maven.MavenModule@a378186[Karaf/org.apache.karaf.management.mbeans:org.apache.karaf.management.mbeans.web][Karaf/org.apache.karaf.management.mbeans:org.apache.karaf.management.mbeans.web][relativePath:management/mbeans/web], hudson.maven.MavenModule@400d590[Karaf/org.apache.karaf.obr:obr][Karaf/org.apache.karaf.obr:obr][relativePath:obr], hudson.maven.MavenModule@52c4e2fd[Karaf/org.apache.karaf.obr:org.apache.karaf.obr.command][Karaf/org.apache.karaf.obr:org.apache.karaf.obr.command][relativePath:obr/command], hudson.maven.MavenModule@7c127a7e[Karaf/org.apache.karaf.obr:org.apache.karaf.obr.core][Karaf/org.apache.karaf.obr:org.apache.karaf.obr.core][relativePath:obr/core], hudson.maven.MavenModule@421889a7[Karaf/org.apache.karaf.osgi:org.osgi.compendium][Karaf/org.apache.karaf.osgi:org.osgi.compendium][relativePath:osgi/compendium], hudson.maven.MavenModule@58f554d7[Karaf/org.apache.karaf.osgi:org.osgi.core][Karaf/org.apache.karaf.osgi:org.osgi.core][relativePath:osgi/core], hudson.maven.MavenModule@52951ce1[Karaf/org.apache.karaf.osgi:osgi][Karaf/org.apache.karaf.osgi:osgi][relativePath:osgi], hudson.maven.MavenModule@212825d5[Karaf/org.apache.karaf.package:org.apache.karaf.package.command][Karaf/org.apache.karaf.package:org.apache.karaf.package.command][relativePath:package/command], hudson.maven.MavenModule@52cbd3f4[Karaf/org.apache.karaf.package:org.apache.karaf.package.core][Karaf/org.apache.karaf.package:org.apache.karaf.package.core][relativePath:package/core], hudson.maven.MavenModule@3b9b2222[Karaf/org.apache.karaf.package:org.apache.karaf.package.management][Karaf/org.apache.karaf.package:org.apache.karaf.package.management][relativePath:package/management], hudson.maven.MavenModule@43c862a3[Karaf/org.apache.karaf.package:package][Karaf/org.apache.karaf.package:package][relativePath:package], hudson.maven.MavenModule@18c3de19[Karaf/org.apache.karaf.region:org.apache.karaf.region.command][Karaf/org.apache.karaf.region:org.apache.karaf.region.command][relativePath:region/command], hudson.maven.MavenModule@45de04c0[Karaf/org.apache.karaf.region:org.apache.karaf.region.commands][Karaf/org.apache.karaf.region:org.apache.karaf.region.commands][relativePath:region/commands], hudson.maven.MavenModule@632a4802[Karaf/org.apache.karaf.region:org.apache.karaf.region.core][Karaf/org.apache.karaf.region:org.apache.karaf.region.core][relativePath:region/core], hudson.maven.MavenModule@6cddae2a[Karaf/org.apache.karaf.region:org.apache.karaf.region.persist][Karaf/org.apache.karaf.region:org.apache.karaf.region.persist][relativePath:region/persist], hudson.maven.MavenModule@4dd57f3c[Karaf/org.apache.karaf.region:region][Karaf/org.apache.karaf.region:region][relativePath:region], hudson.maven.MavenModule@7b94640f[Karaf/org.apache.karaf.scheduler:org.apache.karaf.scheduler.core][Karaf/org.apache.karaf.scheduler:org.apache.karaf.scheduler.core][relativePath:scheduler/core], hudson.maven.MavenModule@4b35542b[Karaf/org.apache.karaf.scr:org.apache.karaf.scr.command][Karaf/org.apache.karaf.scr:org.apache.karaf.scr.command][relativePath:scr/command], hudson.maven.MavenModule@1a28f9a0[Karaf/org.apache.karaf.scr:org.apache.karaf.scr.examples][Karaf/org.apache.karaf.scr:org.apache.karaf.scr.examples][relativePath:scr/examples], hudson.maven.MavenModule@7309fd15[Karaf/org.apache.karaf.scr:org.apache.karaf.scr.feature][Karaf/org.apache.karaf.scr:org.apache.karaf.scr.feature][relativePath:scr/feature], hudson.maven.MavenModule@781c84ca[Karaf/org.apache.karaf.scr:org.apache.karaf.scr.management][Karaf/org.apache.karaf.scr:org.apache.karaf.scr.management][relativePath:scr/management], hudson.maven.MavenModule@18522761[Karaf/org.apache.karaf.scr:scr][Karaf/org.apache.karaf.scr:scr][relativePath:scr], hudson.maven.MavenModule@39975dc0[Karaf/org.apache.karaf.service:org.apache.karaf.service.command][Karaf/org.apache.karaf.service:org.apache.karaf.service.command][relativePath:service/command], hudson.maven.MavenModule@8c05ca[Karaf/org.apache.karaf.service:org.apache.karaf.service.core][Karaf/org.apache.karaf.service:org.apache.karaf.service.core][relativePath:service/core], hudson.maven.MavenModule@68d0110d[Karaf/org.apache.karaf.service:service][Karaf/org.apache.karaf.service:service][relativePath:service], hudson.maven.MavenModule@14c6a8b4[Karaf/org.apache.karaf.shell:org.apache.karaf.shell.bundles][Karaf/org.apache.karaf.shell:org.apache.karaf.shell.bundles][relativePath:shell/bundles], hudson.maven.MavenModule@340fa23d[Karaf/org.apache.karaf.shell:org.apache.karaf.shell.commands][Karaf/org.apache.karaf.shell:org.apache.karaf.shell.commands][relativePath:shell/commands], hudson.maven.MavenModule@7e6dcc13[Karaf/org.apache.karaf.shell:org.apache.karaf.shell.config][Karaf/org.apache.karaf.shell:org.apache.karaf.shell.config][relativePath:shell/config], hudson.maven.MavenModule@6e646d7e[Karaf/org.apache.karaf.shell:org.apache.karaf.shell.console][Karaf/org.apache.karaf.shell:org.apache.karaf.shell.console][relativePath:shell/console], hudson.maven.MavenModule@5a71343d[Karaf/org.apache.karaf.shell:org.apache.karaf.shell.dev][Karaf/org.apache.karaf.shell:org.apache.karaf.shell.dev][relativePath:shell/dev], hudson.maven.MavenModule@350a3d1[Karaf/org.apache.karaf.shell:org.apache.karaf.shell.help][Karaf/org.apache.karaf.shell:org.apache.karaf.shell.help][relativePath:shell/help], hudson.maven.MavenModule@3e1cbf2e[Karaf/org.apache.karaf.shell:org.apache.karaf.shell.http][Karaf/org.apache.karaf.shell:org.apache.karaf.shell.http][relativePath:shell/http], hudson.maven.MavenModule@514b84dd[Karaf/org.apache.karaf.shell:org.apache.karaf.shell.log][Karaf/org.apache.karaf.shell:org.apache.karaf.shell.log][relativePath:shell/log], hudson.maven.MavenModule@34fff2dd[Karaf/org.apache.karaf.shell:org.apache.karaf.shell.obr][Karaf/org.apache.karaf.shell:org.apache.karaf.shell.obr][relativePath:shell/obr], hudson.maven.MavenModule@fa1a65a[Karaf/org.apache.karaf.shell:org.apache.karaf.shell.osgi][Karaf/org.apache.karaf.shell:org.apache.karaf.shell.osgi][relativePath:shell/osgi], hudson.maven.MavenModule@3db066ba[Karaf/org.apache.karaf.shell:org.apache.karaf.shell.packages][Karaf/org.apache.karaf.shell:org.apache.karaf.shell.packages][relativePath:shell/packages], hudson.maven.MavenModule@8285cfa[Karaf/org.apache.karaf.shell:org.apache.karaf.shell.services][Karaf/org.apache.karaf.shell:org.apache.karaf.shell.services][relativePath:shell/services], hudson.maven.MavenModule@2332f00a[Karaf/org.apache.karaf.shell:org.apache.karaf.shell.ssh][Karaf/org.apache.karaf.shell:org.apache.karaf.shell.ssh][relativePath:shell/ssh], hudson.maven.MavenModule@11f02545[Karaf/org.apache.karaf.shell:org.apache.karaf.shell.system][Karaf/org.apache.karaf.shell:org.apache.karaf.shell.system][relativePath:shell/system], hudson.maven.MavenModule@652d3293[Karaf/org.apache.karaf.shell:org.apache.karaf.shell.table][Karaf/org.apache.karaf.shell:org.apache.karaf.shell.table][relativePath:shell/table], hudson.maven.MavenModule@2d1ede36[Karaf/org.apache.karaf.shell:org.apache.karaf.shell.web][Karaf/org.apache.karaf.shell:org.apache.karaf.shell.web][relativePath:shell/web], hudson.maven.MavenModule@458ec25e[Karaf/org.apache.karaf.shell:org.apache.karaf.shell.wrapper][Karaf/org.apache.karaf.shell:org.apache.karaf.shell.wrapper][relativePath:shell/wrapper], hudson.maven.MavenModule@7a5384c9[Karaf/org.apache.karaf.shell:shell][Karaf/org.apache.karaf.shell:shell][relativePath:shell], hudson.maven.MavenModule@132e6dd[Karaf/org.apache.karaf.system:org.apache.karaf.system.command][Karaf/org.apache.karaf.system:org.apache.karaf.system.command][relativePath:system/command], hudson.maven.MavenModule@1f7accff[Karaf/org.apache.karaf.system:org.apache.karaf.system.commands][Karaf/org.apache.karaf.system:org.apache.karaf.system.commands][relativePath:system/commands], hudson.maven.MavenModule@34d2b7c8[Karaf/org.apache.karaf.system:org.apache.karaf.system.core][Karaf/org.apache.karaf.system:org.apache.karaf.system.core][relativePath:system/core], hudson.maven.MavenModule@3728897e[Karaf/org.apache.karaf.system:org.apache.karaf.system.management][Karaf/org.apache.karaf.system:org.apache.karaf.system.management][relativePath:system/management], hudson.maven.MavenModule@761fc68f[Karaf/org.apache.karaf.system:system][Karaf/org.apache.karaf.system:system][relativePath:system], hudson.maven.MavenModule@465acb7c[Karaf/org.apache.karaf.tooling:cmdhelp-maven-plugin][Karaf/org.apache.karaf.tooling:cmdhelp-maven-plugin][relativePath:tooling/cmdhelp-maven-plugin], hudson.maven.MavenModule@72e55df9[Karaf/org.apache.karaf.tooling:features-maven-plugin][Karaf/org.apache.karaf.tooling:features-maven-plugin][relativePath:tooling/features-maven-plugin], hudson.maven.MavenModule@202512df[Karaf/org.apache.karaf.tooling:karaf-maven-plugin][Karaf/org.apache.karaf.tooling:karaf-maven-plugin][relativePath:tooling/karaf-maven-plugin], hudson.maven.MavenModule@307cc15d[Karaf/org.apache.karaf.tooling:org.apache.karaf.tooling.testing][Karaf/org.apache.karaf.tooling:org.apache.karaf.tooling.testing][relativePath:tooling/testing], hudson.maven.MavenModule@61f9fef5[Karaf/org.apache.karaf.tooling:tooling][Karaf/org.apache.karaf.tooling:tooling][relativePath:tooling], hudson.maven.MavenModule@63d1b913[Karaf/org.apache.karaf.tooling.exam:exam][Karaf/org.apache.karaf.tooling.exam:exam][relativePath:tooling/exam], hudson.maven.MavenModule@5dcdc197[Karaf/org.apache.karaf.tooling.exam:org.apache.karaf.tooling.exam.container][Karaf/org.apache.karaf.tooling.exam:org.apache.karaf.tooling.exam.container][relativePath:tooling/exam/container], hudson.maven.MavenModule@6f60d09d[Karaf/org.apache.karaf.tooling.exam:org.apache.karaf.tooling.exam.options][Karaf/org.apache.karaf.tooling.exam:org.apache.karaf.tooling.exam.options][relativePath:tooling/exam/options], hudson.maven.MavenModule@3d202c8b[Karaf/org.apache.karaf.tooling.exam:regression][Karaf/org.apache.karaf.tooling.exam:regression][relativePath:tooling/exam/regression], hudson.maven.MavenModule@b4c7907[Karaf/org.apache.karaf.web:org.apache.karaf.web.command][Karaf/org.apache.karaf.web:org.apache.karaf.web.command][relativePath:web/command], hudson.maven.MavenModule@4e7ad989[Karaf/org.apache.karaf.web:org.apache.karaf.web.commands][Karaf/org.apache.karaf.web:org.apache.karaf.web.commands][relativePath:web/commands], hudson.maven.MavenModule@499dc05c[Karaf/org.apache.karaf.web:org.apache.karaf.web.core][Karaf/org.apache.karaf.web:org.apache.karaf.web.core][relativePath:web/core], hudson.maven.MavenModule@635fd99f[Karaf/org.apache.karaf.web:org.apache.karaf.web.management][Karaf/org.apache.karaf.web:org.apache.karaf.web.management][relativePath:web/management], hudson.maven.MavenModule@13bffdc6[Karaf/org.apache.karaf.web:web][Karaf/org.apache.karaf.web:web][relativePath:web], hudson.maven.MavenModule@29c888b1[Karaf/org.apache.karaf.webconsole:org.apache.karaf.webconsole.admin][Karaf/org.apache.karaf.webconsole:org.apache.karaf.webconsole.admin][relativePath:webconsole/admin], hudson.maven.MavenModule@21addc4b[Karaf/org.apache.karaf.webconsole:org.apache.karaf.webconsole.branding][Karaf/org.apache.karaf.webconsole:org.apache.karaf.webconsole.branding][relativePath:webconsole/branding], hudson.maven.MavenModule@1d59d133[Karaf/org.apache.karaf.webconsole:org.apache.karaf.webconsole.console][Karaf/org.apache.karaf.webconsole:org.apache.karaf.webconsole.console][relativePath:webconsole/console], hudson.maven.MavenModule@73b57a52[Karaf/org.apache.karaf.webconsole:org.apache.karaf.webconsole.features][Karaf/org.apache.karaf.webconsole:org.apache.karaf.webconsole.features][relativePath:webconsole/features], hudson.maven.MavenModule@f71d8d7[Karaf/org.apache.karaf.webconsole:org.apache.karaf.webconsole.gogo][Karaf/org.apache.karaf.webconsole:org.apache.karaf.webconsole.gogo][relativePath:webconsole/gogo], hudson.maven.MavenModule@7b53132c[Karaf/org.apache.karaf.webconsole:org.apache.karaf.webconsole.http][Karaf/org.apache.karaf.webconsole:org.apache.karaf.webconsole.http][relativePath:webconsole/http], hudson.maven.MavenModule@b0fecf5[Karaf/org.apache.karaf.webconsole:org.apache.karaf.webconsole.instance][Karaf/org.apache.karaf.webconsole:org.apache.karaf.webconsole.instance][relativePath:webconsole/instance], hudson.maven.MavenModule@428dce7f[Karaf/org.apache.karaf.webconsole:webconsole][Karaf/org.apache.karaf.webconsole:webconsole][relativePath:webconsole], hudson.maven.MavenModule@6bf015fb[Karaf/org.apache.karaf.wrapper:org.apache.karaf.wrapper.command][Karaf/org.apache.karaf.wrapper:org.apache.karaf.wrapper.command][relativePath:wrapper/command], hudson.maven.MavenModule@2c8631e5[Karaf/org.apache.karaf.wrapper:org.apache.karaf.wrapper.commands][Karaf/org.apache.karaf.wrapper:org.apache.karaf.wrapper.commands][relativePath:wrapper/commands], hudson.maven.MavenModule@5f334919[Karaf/org.apache.karaf.wrapper:org.apache.karaf.wrapper.core][Karaf/org.apache.karaf.wrapper:org.apache.karaf.wrapper.core][relativePath:wrapper/core], hudson.maven.MavenModule@1e35c839[Karaf/org.apache.karaf.wrapper:org.apache.karaf.wrapper.management][Karaf/org.apache.karaf.wrapper:org.apache.karaf.wrapper.management][relativePath:wrapper/management], hudson.maven.MavenModule@20043923[Karaf/org.apache.karaf.wrapper:wrapper][Karaf/org.apache.karaf.wrapper:wrapper][relativePath:wrapper]]
project.getRootModule()=hudson.maven.MavenModule@4660c840[Karaf/org.apache.karaf:karaf][Karaf/org.apache.karaf:karaf][relativePath:]
FATAL: hudson.remoting.RequestAbortedException: java.io.StreamCorruptedException: invalid type code: B6
hudson.remoting.RequestAbortedException: hudson.remoting.RequestAbortedException: java.io.StreamCorruptedException: invalid type code: B6
	at hudson.remoting.Request.call(Request.java:174)
	at hudson.remoting.Channel.call(Channel.java:672)
	at hudson.maven.ProcessCache$MavenProcess.call(ProcessCache.java:156)
	at hudson.maven.MavenModuleSetBuild$MavenModuleSetBuildExecution.doRun(MavenModuleSetBuild.java:755)
	at hudson.model.AbstractBuild$AbstractBuildExecution.run(AbstractBuild.java:592)
	at hudson.model.Run.execute(Run.java:1568)
	at hudson.maven.MavenModuleSetBuild.run(MavenModuleSetBuild.java:477)
	at hudson.model.ResourceController.execute(ResourceController.java:88)
	at hudson.model.Executor.run(Executor.java:236)
Caused by: hudson.remoting.RequestAbortedException: java.io.StreamCorruptedException: invalid type code: B6
	at hudson.remoting.Request.abort(Request.java:299)
	at hudson.remoting.Channel.terminate(Channel.java:732)
	at hudson.slaves.Channels$1.terminate(Channels.java:77)
	at hudson.remoting.SynchronousCommandTransport$ReaderThread.run(SynchronousCommandTransport.java:69)
Caused by: java.io.StreamCorruptedException: invalid type code: B6
	at java.io.ObjectInputStream.readObject0(ObjectInputStream.java:1374)
	at java.io.ObjectInputStream.defaultReadFields(ObjectInputStream.java:1970)
	at java.io.ObjectInputStream.readSerialData(ObjectInputStream.java:1894)
	at java.io.ObjectInputStream.readOrdinaryObject(ObjectInputStream.java:1777)
	at java.io.ObjectInputStream.readObject0(ObjectInputStream.java:1347)
	at java.io.ObjectInputStream.readObject(ObjectInputStream.java:369)
	at hudson.remoting.Command.readFrom(Command.java:92)
	at hudson.remoting.ClassicCommandTransport.read(ClassicCommandTransport.java:59)
	at hudson.remoting.SynchronousCommandTransport$ReaderThread.run(SynchronousCommandTransport.java:48)

Mime
View raw message