karaf-commits mailing list archives

Site index · List index
Message view « Date » · « Thread »
Top « Date » · « Thread »
From Apache Jenkins Server <jenk...@builds.apache.org>
Subject Build failed in Jenkins: Karaf » Apache Karaf :: Archetypes :: Assembly Archetype #1855
Date Thu, 07 Feb 2013 16:12:09 GMT
See <https://builds.apache.org/job/Karaf/org.apache.karaf.archetypes$karaf-assembly-archetype/1855/>

------------------------------------------
projectStarted org.apache.karaf.archetypes:karaf-assembly-archetype:3.0.0-SNAPSHOT
[INFO]                                                                         
[INFO] ------------------------------------------------------------------------
[INFO] Building Apache Karaf :: Archetypes :: Assembly Archetype 3.0.0-SNAPSHOT
[INFO] ------------------------------------------------------------------------
mojoStarted org.apache.maven.plugins:maven-clean-plugin:2.5(default-clean)
[INFO] 
[INFO] --- maven-clean-plugin:2.5:clean (default-clean) @ karaf-assembly-archetype ---
mojoSucceeded org.apache.maven.plugins:maven-clean-plugin:2.5(default-clean)
mojoStarted org.apache.maven.plugins:maven-enforcer-plugin:1.1(enforce-maven)
[INFO] 
[INFO] --- maven-enforcer-plugin:1.1:enforce (enforce-maven) @ karaf-assembly-archetype ---
mojoSucceeded org.apache.maven.plugins:maven-enforcer-plugin:1.1(enforce-maven)
mojoStarted org.apache.felix:maven-bundle-plugin:2.3.7(cleanVersions)
[INFO] 
[INFO] --- maven-bundle-plugin:2.3.7:cleanVersions (cleanVersions) @ karaf-assembly-archetype
---
mojoSucceeded org.apache.felix:maven-bundle-plugin:2.3.7(cleanVersions)
mojoStarted org.apache.maven.plugins:maven-remote-resources-plugin:1.3(default)
[INFO] 
[INFO] --- maven-remote-resources-plugin:1.3:process (default) @ karaf-assembly-archetype
---
mojoSucceeded org.apache.maven.plugins:maven-remote-resources-plugin:1.3(default)
mojoStarted org.apache.maven.plugins:maven-resources-plugin:2.5(default-resources)[debug]
execute contextualize
[INFO] Using 'UTF-8' encoding to copy filtered resources.

[INFO] 
[INFO] --- maven-resources-plugin:2.5:resources (default-resources) @ karaf-assembly-archetype
---
[INFO] Copying 2 resources
[INFO] Copying 3 resources
mojoSucceeded org.apache.maven.plugins:maven-resources-plugin:2.5(default-resources)
mojoStarted org.apache.maven.plugins:maven-resources-plugin:2.5(default-testResources)[debug]
execute contextualize
[INFO] Using 'UTF-8' encoding to copy filtered resources.
[INFO] Copying 2 resources
[INFO] Copying 3 resources

[INFO] 
[INFO] --- maven-resources-plugin:2.5:testResources (default-testResources) @ karaf-assembly-archetype
---
mojoSucceeded org.apache.maven.plugins:maven-resources-plugin:2.5(default-testResources)
mojoStarted org.apache.maven.plugins:maven-archetype-plugin:2.2(default-jar)
[INFO] 
[INFO] --- maven-archetype-plugin:2.2:jar (default-jar) @ karaf-assembly-archetype ---
[INFO] Building archetype jar: <https://builds.apache.org/job/Karaf/org.apache.karaf.archetypes$karaf-assembly-archetype/ws/target/karaf-assembly-archetype-3.0.0-SNAPSHOT>
mojoSucceeded org.apache.maven.plugins:maven-archetype-plugin:2.2(default-jar)
mojoStarted org.apache.maven.plugins:maven-site-plugin:3.1(attach-descriptor)
[INFO] 
[INFO] --- maven-site-plugin:3.1:attach-descriptor (attach-descriptor) @ karaf-assembly-archetype
---
mojoSucceeded org.apache.maven.plugins:maven-site-plugin:3.1(attach-descriptor)
mojoStarted org.apache.maven.plugins:maven-archetype-plugin:2.2(default-integration-test)
[INFO] [INFO] Processing Archetype IT project: assembly

[INFO] --- maven-archetype-plugin:2.2:integration-test (default-integration-test) @ karaf-assembly-archetype
---
[INFO] ----------------------------------------------------------------------------
[INFO] Using following parameters for creating project from Archetype: karaf-assembly-archetype:3.0.0-SNAPSHOT
[INFO] ----------------------------------------------------------------------------
[INFO] Parameter: groupId, Value: archetype.it
[INFO] Parameter: artifactId, Value: assembly
[INFO] Parameter: version, Value: 0.1-SNAPSHOT
[INFO] Parameter: package, Value: null
[INFO] Parameter: packageInPathFormat, Value: null
[INFO] Parameter: version, Value: 0.1-SNAPSHOT
[INFO] Parameter: groupId, Value: archetype.it
[INFO] Parameter: artifactId, Value: assembly
[INFO] project created from Archetype in dir: <https://builds.apache.org/job/Karaf/org.apache.karaf.archetypes$karaf-assembly-archetype/ws/target/test-classes/projects/assembly/project/assembly>
[INFO] Invoking post-archetype-generation goals: clean install verify
[INFO] [INFO] Error stacktraces are turned on.
[INFO] [INFO] Scanning for projects...
[INFO] [INFO]                                                                         
[INFO] [INFO] ------------------------------------------------------------------------
[INFO] [INFO] Building assembly-feature 0.1-SNAPSHOT
[INFO] [INFO] ------------------------------------------------------------------------
[INFO] [INFO] 
[INFO] [INFO] --- maven-clean-plugin:2.4.1:clean (default-clean) @ assembly ---
[INFO] [INFO] 
[INFO] [INFO] --- maven-resources-plugin:2.6:resources (default-resources) @ assembly ---
[INFO] [WARNING] Using platform encoding (ANSI_X3.4-1968 actually) to copy filtered resources,
i.e. build is platform dependent!
[INFO] [INFO] skip non existing resourceDirectory <https://builds.apache.org/job/Karaf/org.apache.karaf.archetypes$karaf-assembly-archetype/ws/target/test-classes/projects/assembly/project/assembly/src/main/resources>
[INFO] [INFO] 
[INFO] [INFO] --- karaf-maven-plugin:3.0.0-SNAPSHOT:install-kars (default-install-kars) @
assembly ---
[INFO] [INFO] Installing feature <https://builds.apache.org/job/Karaf/org.apache.karaf.archetypes$karaf-assembly-archetype/ws/target/test-classes/projects/assembly/project/assembly/target/assembly/system/org/apache/karaf/features/framework/3.0.0-SNAPSHOT/framework-3.0.0-SNAPSHOT-features.xml>
to system and startup.properties
[INFO] [INFO] Adding feature repository to system: mvn:org.apache.karaf.features/standard/3.0.0-SNAPSHOT/xml/features
[INFO] [WARNING] could not resolve org.apache.aries.jmx:org.apache.aries.jmx.api:1.1.1-SNAPSHOT
[INFO] org.sonatype.aether.resolution.ArtifactResolutionException: Could not find artifact
org.apache.aries.jmx:org.apache.aries.jmx.api:jar:1.1.1-SNAPSHOT
[INFO] 	at org.sonatype.aether.impl.internal.DefaultArtifactResolver.resolve(DefaultArtifactResolver.java:538)
[INFO] 	at org.sonatype.aether.impl.internal.DefaultArtifactResolver.resolveArtifacts(DefaultArtifactResolver.java:216)
[INFO] 	at org.sonatype.aether.impl.internal.DefaultArtifactResolver.resolveArtifact(DefaultArtifactResolver.java:193)
[INFO] 	at org.sonatype.aether.impl.internal.DefaultRepositorySystem.resolveArtifact(DefaultRepositorySystem.java:286)
[INFO] 	at org.apache.karaf.tooling.features.InstallKarsMojo.resolve(InstallKarsMojo.java:376)
[INFO] 	at org.apache.karaf.tooling.features.InstallKarsMojo.install(InstallKarsMojo.java:341)
[INFO] 	at org.apache.karaf.tooling.features.InstallKarsMojo.execute(InstallKarsMojo.java:299)
[INFO] 	at org.apache.maven.plugin.DefaultBuildPluginManager.executeMojo(DefaultBuildPluginManager.java:101)
[INFO] 	at org.apache.maven.lifecycle.internal.MojoExecutor.execute(MojoExecutor.java:209)
[INFO] 	at org.apache.maven.lifecycle.internal.MojoExecutor.execute(MojoExecutor.java:153)
[INFO] 	at org.apache.maven.lifecycle.internal.MojoExecutor.execute(MojoExecutor.java:145)
[INFO] 	at org.apache.maven.lifecycle.internal.LifecycleModuleBuilder.buildProject(LifecycleModuleBuilder.java:84)
[INFO] 	at org.apache.maven.lifecycle.internal.LifecycleModuleBuilder.buildProject(LifecycleModuleBuilder.java:59)
[INFO] 	at org.apache.maven.lifecycle.internal.LifecycleStarter.singleThreadedBuild(LifecycleStarter.java:183)
[INFO] 	at org.apache.maven.lifecycle.internal.LifecycleStarter.execute(LifecycleStarter.java:161)
[INFO] 	at org.apache.maven.DefaultMaven.doExecute(DefaultMaven.java:320)
[INFO] 	at org.apache.maven.DefaultMaven.execute(DefaultMaven.java:156)
[INFO] 	at org.apache.maven.cli.MavenCli.execute(MavenCli.java:537)
[INFO] 	at org.apache.maven.cli.MavenCli.doMain(MavenCli.java:196)
[INFO] 	at org.apache.maven.cli.MavenCli.main(MavenCli.java:141)
[INFO] 	at sun.reflect.NativeMethodAccessorImpl.invoke0(Native Method)
[INFO] 	at sun.reflect.NativeMethodAccessorImpl.invoke(NativeMethodAccessorImpl.java:39)
[INFO] 	at sun.reflect.DelegatingMethodAccessorImpl.invoke(DelegatingMethodAccessorImpl.java:25)
[INFO] 	at java.lang.reflect.Method.invoke(Method.java:597)
[INFO] 	at org.codehaus.plexus.classworlds.launcher.Launcher.launchEnhanced(Launcher.java:290)
[INFO] 	at org.codehaus.plexus.classworlds.launcher.Launcher.launch(Launcher.java:230)
[INFO] 	at org.codehaus.plexus.classworlds.launcher.Launcher.mainWithExitCode(Launcher.java:409)
[INFO] 	at org.codehaus.plexus.classworlds.launcher.Launcher.main(Launcher.java:352)
[INFO] Caused by: org.sonatype.aether.transfer.ArtifactNotFoundException: Could not find artifact
org.apache.aries.jmx:org.apache.aries.jmx.api:jar:1.1.1-SNAPSHOT
[INFO] 	at org.sonatype.aether.impl.internal.DefaultArtifactResolver.resolve(DefaultArtifactResolver.java:528)
[INFO] 	... 27 more
[INFO] [INFO] ------------------------------------------------------------------------
[INFO] [INFO] BUILD FAILURE
[INFO] [INFO] ------------------------------------------------------------------------
[INFO] [INFO] Total time: 7.216s
[INFO] [INFO] Finished at: Thu Feb 07 16:01:03 UTC 2013
[INFO] [INFO] Final Memory: 12M/149M
[INFO] [INFO] ------------------------------------------------------------------------
mojoFailed org.apache.maven.plugins:maven-archetype-plugin:2.2(default-integration-test)[INFO]
[ERROR] Failed to execute goal org.apache.karaf.tooling:karaf-maven-plugin:3.0.0-SNAPSHOT:install-kars
(default-install-kars) on project assembly: Couldn't resolve artifact org.apache.aries.jmx:org.apache.aries.jmx.api:1.1.1-SNAPSHOT:
Could not find artifact org.apache.aries.jmx:org.apache.aries.jmx.api:jar:1.1.1-SNAPSHOT ->
[Help 1]
[INFO] org.apache.maven.lifecycle.LifecycleExecutionException: Failed to execute goal org.apache.karaf.tooling:karaf-maven-plugin:3.0.0-SNAPSHOT:install-kars
(default-install-kars) on project assembly: Couldn't resolve artifact org.apache.aries.jmx:org.apache.aries.jmx.api:1.1.1-SNAPSHOT
[INFO] 	at org.apache.maven.lifecycle.internal.MojoExecutor.execute(MojoExecutor.java:213)
[INFO] 	at org.apache.maven.lifecycle.internal.MojoExecutor.execute(MojoExecutor.java:153)
[INFO] 	at org.apache.maven.lifecycle.internal.MojoExecutor.execute(MojoExecutor.java:145)
[INFO] 	at org.apache.maven.lifecycle.internal.LifecycleModuleBuilder.buildProject(LifecycleModuleBuilder.java:84)
[INFO] 	at org.apache.maven.lifecycle.internal.LifecycleModuleBuilder.buildProject(LifecycleModuleBuilder.java:59)
[INFO] 	at org.apache.maven.lifecycle.internal.LifecycleStarter.singleThreadedBuild(LifecycleStarter.java:183)
[INFO] 	at org.apache.maven.lifecycle.internal.LifecycleStarter.execute(LifecycleStarter.java:161)
[INFO] 	at org.apache.maven.DefaultMaven.doExecute(DefaultMaven.java:320)
[INFO] 	at org.apache.maven.DefaultMaven.execute(DefaultMaven.java:156)
[INFO] 	at org.apache.maven.cli.MavenCli.execute(MavenCli.java:537)
[INFO] 	at org.apache.maven.cli.MavenCli.doMain(MavenCli.java:196)
[INFO] 	at org.apache.maven.cli.MavenCli.main(MavenCli.java:141)
[INFO] 	at sun.reflect.NativeMethodAccessorImpl.invoke0(Native Method)
[INFO] 	at sun.reflect.NativeMethodAccessorImpl.invoke(NativeMethodAccessorImpl.java:39)
[INFO] 	at sun.reflect.DelegatingMethodAccessorImpl.invoke(DelegatingMethodAccessorImpl.java:25)
[INFO] 	at java.lang.reflect.Method.invoke(Method.java:597)
[INFO] 	at org.codehaus.plexus.classworlds.launcher.Launcher.launchEnhanced(Launcher.java:290)
[INFO] 	at org.codehaus.plexus.classworlds.launcher.Launcher.launch(Launcher.java:230)
[INFO] 	at org.codehaus.plexus.classworlds.launcher.Launcher.mainWithExitCode(Launcher.java:409)
[INFO] 	at org.codehaus.plexus.classworlds.launcher.Launcher.main(Launcher.java:352)
[INFO] Caused by: org.apache.maven.plugin.MojoFailureException: Couldn't resolve artifact
org.apache.aries.jmx:org.apache.aries.jmx.api:1.1.1-SNAPSHOT
[INFO] 	at org.apache.karaf.tooling.features.InstallKarsMojo.resolve(InstallKarsMojo.java:379)
[INFO] 	at org.apache.karaf.tooling.features.InstallKarsMojo.install(InstallKarsMojo.java:341)
[INFO] 	at org.apache.karaf.tooling.features.InstallKarsMojo.execute(InstallKarsMojo.java:299)
[INFO] 	at org.apache.maven.plugin.DefaultBuildPluginManager.executeMojo(DefaultBuildPluginManager.java:101)
[INFO] 	at org.apache.maven.lifecycle.internal.MojoExecutor.execute(MojoExecutor.java:209)
[INFO] 	... 19 more
[INFO] Caused by: org.sonatype.aether.resolution.ArtifactResolutionException: Could not find
artifact org.apache.aries.jmx:org.apache.aries.jmx.api:jar:1.1.1-SNAPSHOT
[INFO] 	at org.sonatype.aether.impl.internal.DefaultArtifactResolver.resolve(DefaultArtifactResolver.java:538)
[INFO] 	at org.sonatype.aether.impl.internal.DefaultArtifactResolver.resolveArtifacts(DefaultArtifactResolver.java:216)
[INFO] 	at org.sonatype.aether.impl.internal.DefaultArtifactResolver.resolveArtifact(DefaultArtifactResolver.java:193)
[INFO] 	at org.sonatype.aether.impl.internal.DefaultRepositorySystem.resolveArtifact(DefaultRepositorySystem.java:286)
[INFO] 	at org.apache.karaf.tooling.features.InstallKarsMojo.resolve(InstallKarsMojo.java:376)
[INFO] 	... 23 more
[INFO] Caused by: org.sonatype.aether.transfer.ArtifactNotFoundException: Could not find artifact
org.apache.aries.jmx:org.apache.aries.jmx.api:jar:1.1.1-SNAPSHOT
[INFO] 	at org.sonatype.aether.impl.internal.DefaultArtifactResolver.resolve(DefaultArtifactResolver.java:528)
[INFO] 	... 27 more
[INFO] [ERROR] 
[INFO] [ERROR] Re-run Maven using the -X switch to enable full debug logging.
[INFO] [ERROR] 
[INFO] [ERROR] For more information about the errors and possible solutions, please read the
following articles:
[INFO] [ERROR] [Help 1] http://cwiki.apache.org/confluence/display/MAVEN/MojoFailureException
[INFO] Post-archetype-generation invoker exit code: 1

projectFailed org.apache.karaf.archetypes:karaf-assembly-archetype:3.0.0-SNAPSHOT

Mime
View raw message