karaf-commits mailing list archives

Site index · List index
Message view « Date » · « Thread »
Top « Date » · « Thread »
From Apache Jenkins Server <jenk...@builds.apache.org>
Subject Build failed in Jenkins: Karaf » Apache Karaf :: Archetypes :: Assembly Archetype #1867
Date Tue, 12 Feb 2013 21:03:39 GMT
See <https://builds.apache.org/job/Karaf/org.apache.karaf.archetypes$karaf-assembly-archetype/1867/>

------------------------------------------
[...truncated 83 lines...]
[INFO] Downloading: http://repo.maven.apache.org/maven2/org/apache/maven/plugins/maven-resources-plugin/2.6/maven-resources-plugin-2.6.jar
[INFO] Downloaded: http://repo.maven.apache.org/maven2/org/apache/maven/plugins/maven-resources-plugin/2.6/maven-resources-plugin-2.6.jar
(29 KB at 1310.3 KB/sec)
[INFO] Downloading: http://repo.maven.apache.org/maven2/org/apache/maven/plugins/maven-deploy-plugin/maven-metadata.xml
[INFO] Downloaded: http://repo.maven.apache.org/maven2/org/apache/maven/plugins/maven-deploy-plugin/maven-metadata.xml
(614 B at 60.0 KB/sec)
[INFO] Downloading: http://repo.maven.apache.org/maven2/org/apache/maven/plugins/maven-clean-plugin/2.4.1/maven-clean-plugin-2.4.1.pom
[INFO] Downloaded: http://repo.maven.apache.org/maven2/org/apache/maven/plugins/maven-clean-plugin/2.4.1/maven-clean-plugin-2.4.1.pom
(5 KB at 369.1 KB/sec)
[INFO] Downloading: http://repo.maven.apache.org/maven2/org/apache/maven/plugins/maven-clean-plugin/2.4.1/maven-clean-plugin-2.4.1.jar
[INFO] Downloaded: http://repo.maven.apache.org/maven2/org/apache/maven/plugins/maven-clean-plugin/2.4.1/maven-clean-plugin-2.4.1.jar
(23 KB at 1210.4 KB/sec)
[INFO] Downloading: http://repo.maven.apache.org/maven2/org/apache/mina/mina-core/2.0.5/mina-core-2.0.5.pom
[INFO] Downloaded: http://repo.maven.apache.org/maven2/org/apache/mina/mina-core/2.0.5/mina-core-2.0.5.pom
(2 KB at 42.9 KB/sec)
[INFO] Downloading: http://repo.maven.apache.org/maven2/org/apache/mina/mina-parent/2.0.5/mina-parent-2.0.5.pom
[INFO] Downloaded: http://repo.maven.apache.org/maven2/org/apache/mina/mina-parent/2.0.5/mina-parent-2.0.5.pom
(30 KB at 511.4 KB/sec)
[INFO] Downloading: http://repo.maven.apache.org/maven2/org/slf4j/slf4j-api/1.6.6/slf4j-api-1.6.6.pom
[INFO] Downloaded: http://repo.maven.apache.org/maven2/org/slf4j/slf4j-api/1.6.6/slf4j-api-1.6.6.pom
(3 KB at 262.6 KB/sec)
[INFO] Downloading: http://repo.maven.apache.org/maven2/org/slf4j/slf4j-parent/1.6.6/slf4j-parent-1.6.6.pom
[INFO] Downloaded: http://repo.maven.apache.org/maven2/org/slf4j/slf4j-parent/1.6.6/slf4j-parent-1.6.6.pom
(13 KB at 1159.8 KB/sec)
[INFO] Downloading: http://repo.maven.apache.org/maven2/jline/jline/2.7/jline-2.7.pom
[INFO] Downloaded: http://repo.maven.apache.org/maven2/jline/jline/2.7/jline-2.7.pom (11 KB
at 40.9 KB/sec)
[INFO] Downloading: http://repo.maven.apache.org/maven2/org/ops4j/base/ops4j-base-lang/1.3.0/ops4j-base-lang-1.3.0.pom
[INFO] Downloaded: http://repo.maven.apache.org/maven2/org/ops4j/base/ops4j-base-lang/1.3.0/ops4j-base-lang-1.3.0.pom
(988 B at 12.4 KB/sec)
[INFO] Downloading: http://repo.maven.apache.org/maven2/org/ops4j/pax/swissbox/pax-swissbox-property/1.5.0/pax-swissbox-property-1.5.0.pom
[INFO] Downloaded: http://repo.maven.apache.org/maven2/org/ops4j/pax/swissbox/pax-swissbox-property/1.5.0/pax-swissbox-property-1.5.0.pom
(2 KB at 20.7 KB/sec)
[INFO] Downloading: http://repo.maven.apache.org/maven2/org/sonatype/aether/aether-api/1.13.1/aether-api-1.13.1.pom
[INFO] Downloaded: http://repo.maven.apache.org/maven2/org/sonatype/aether/aether-api/1.13.1/aether-api-1.13.1.pom
(2 KB at 126.5 KB/sec)
[INFO] Downloading: http://repo.maven.apache.org/maven2/org/sonatype/aether/aether/1.13.1/aether-1.13.1.pom
[INFO] Downloaded: http://repo.maven.apache.org/maven2/org/sonatype/aether/aether/1.13.1/aether-1.13.1.pom
(10 KB at 549.8 KB/sec)
[INFO] Downloading: http://repo.maven.apache.org/maven2/org/sonatype/aether/aether-spi/1.13.1/aether-spi-1.13.1.pom
[INFO] Downloaded: http://repo.maven.apache.org/maven2/org/sonatype/aether/aether-spi/1.13.1/aether-spi-1.13.1.pom
(2 KB at 141.4 KB/sec)
[INFO] Downloading: http://repo.maven.apache.org/maven2/org/sonatype/aether/aether-util/1.13.1/aether-util-1.13.1.pom
[INFO] Downloaded: http://repo.maven.apache.org/maven2/org/sonatype/aether/aether-util/1.13.1/aether-util-1.13.1.pom
(2 KB at 168.4 KB/sec)
[INFO] Downloading: http://repo.maven.apache.org/maven2/org/sonatype/aether/aether-impl/1.13.1/aether-impl-1.13.1.pom
[INFO] Downloaded: http://repo.maven.apache.org/maven2/org/sonatype/aether/aether-impl/1.13.1/aether-impl-1.13.1.pom
(3 KB at 52.6 KB/sec)
[INFO] Downloading: http://repo.maven.apache.org/maven2/org/sonatype/aether/aether-connector-wagon/1.13.1/aether-connector-wagon-1.13.1.pom
[INFO] Downloaded: http://repo.maven.apache.org/maven2/org/sonatype/aether/aether-connector-wagon/1.13.1/aether-connector-wagon-1.13.1.pom
(4 KB at 140.4 KB/sec)
[INFO] Downloading: http://repo.maven.apache.org/maven2/org/apache/maven/wagon/wagon-provider-api/1.0-beta-6/wagon-provider-api-1.0-beta-6.pom
[INFO] Downloaded: http://repo.maven.apache.org/maven2/org/apache/maven/wagon/wagon-provider-api/1.0-beta-6/wagon-provider-api-1.0-beta-6.pom
(2 KB at 156.2 KB/sec)
[INFO] Downloading: http://repo.maven.apache.org/maven2/org/apache/maven/wagon/wagon/1.0-beta-6/wagon-1.0-beta-6.pom
[INFO] Downloaded: http://repo.maven.apache.org/maven2/org/apache/maven/wagon/wagon/1.0-beta-6/wagon-1.0-beta-6.pom
(13 KB at 1099.6 KB/sec)
[INFO] Downloading: http://repo.maven.apache.org/maven2/org/codehaus/plexus/plexus-utils/2.0.7/plexus-utils-2.0.7.pom
[INFO] Downloaded: http://repo.maven.apache.org/maven2/org/codehaus/plexus/plexus-utils/2.0.7/plexus-utils-2.0.7.pom
(3 KB at 101.7 KB/sec)
[INFO] Downloading: http://repo.maven.apache.org/maven2/org/sonatype/sisu/sisu-inject-plexus/2.2.3/sisu-inject-plexus-2.2.3.pom
[INFO] Downloaded: http://repo.maven.apache.org/maven2/org/sonatype/sisu/sisu-inject-plexus/2.2.3/sisu-inject-plexus-2.2.3.pom
(6 KB at 252.9 KB/sec)
[INFO] Downloading: http://repo.maven.apache.org/maven2/org/sonatype/sisu/inject/guice-plexus/2.2.3/guice-plexus-2.2.3.pom
[INFO] Downloaded: http://repo.maven.apache.org/maven2/org/sonatype/sisu/inject/guice-plexus/2.2.3/guice-plexus-2.2.3.pom
(4 KB at 176.9 KB/sec)
[INFO] Downloading: http://repo.maven.apache.org/maven2/org/sonatype/sisu/inject/guice-bean/2.2.3/guice-bean-2.2.3.pom
[INFO] Downloaded: http://repo.maven.apache.org/maven2/org/sonatype/sisu/inject/guice-bean/2.2.3/guice-bean-2.2.3.pom
(3 KB at 118.7 KB/sec)
[INFO] Downloading: http://repo.maven.apache.org/maven2/org/sonatype/sisu/inject/containers/2.2.3/containers-2.2.3.pom
[INFO] Downloaded: http://repo.maven.apache.org/maven2/org/sonatype/sisu/inject/containers/2.2.3/containers-2.2.3.pom
(2 KB at 46.8 KB/sec)
[INFO] Downloading: http://repo.maven.apache.org/maven2/org/sonatype/sisu/sisu-inject/2.2.3/sisu-inject-2.2.3.pom
[INFO] Downloaded: http://repo.maven.apache.org/maven2/org/sonatype/sisu/sisu-inject/2.2.3/sisu-inject-2.2.3.pom
(3 KB at 290.8 KB/sec)
[INFO] Downloading: http://repo.maven.apache.org/maven2/org/sonatype/sisu/sisu-parent/2.2.3/sisu-parent-2.2.3.pom
[INFO] Downloaded: http://repo.maven.apache.org/maven2/org/sonatype/sisu/sisu-parent/2.2.3/sisu-parent-2.2.3.pom
(10 KB at 935.2 KB/sec)
[INFO] Downloading: http://repo.maven.apache.org/maven2/org/sonatype/forge/forge-parent/9/forge-parent-9.pom
[INFO] Downloaded: http://repo.maven.apache.org/maven2/org/sonatype/forge/forge-parent/9/forge-parent-9.pom
(13 KB at 641.7 KB/sec)
[INFO] Downloading: http://repo.maven.apache.org/maven2/org/sonatype/sisu/sisu-inject-bean/2.2.3/sisu-inject-bean-2.2.3.pom
[INFO] Downloaded: http://repo.maven.apache.org/maven2/org/sonatype/sisu/sisu-inject-bean/2.2.3/sisu-inject-bean-2.2.3.pom
(7 KB at 35.3 KB/sec)
[INFO] Downloading: http://repo.maven.apache.org/maven2/org/sonatype/sisu/sisu-guice/3.0.3/sisu-guice-3.0.3.pom
[INFO] Downloaded: http://repo.maven.apache.org/maven2/org/sonatype/sisu/sisu-guice/3.0.3/sisu-guice-3.0.3.pom
(8 KB at 33.1 KB/sec)
[INFO] Downloading: http://repo.maven.apache.org/maven2/org/sonatype/sisu/inject/guice-parent/3.0.3/guice-parent-3.0.3.pom
[INFO] Downloaded: http://repo.maven.apache.org/maven2/org/sonatype/sisu/inject/guice-parent/3.0.3/guice-parent-3.0.3.pom
(14 KB at 42.7 KB/sec)
[INFO] Downloading: http://repo.maven.apache.org/maven2/org/apache/maven/maven-aether-provider/3.0.4/maven-aether-provider-3.0.4.pom
[INFO] Downloaded: http://repo.maven.apache.org/maven2/org/apache/maven/maven-aether-provider/3.0.4/maven-aether-provider-3.0.4.pom
(3 KB at 78.6 KB/sec)
[INFO] Downloading: http://repo.maven.apache.org/maven2/org/apache/maven/maven/3.0.4/maven-3.0.4.pom
[INFO] Downloaded: http://repo.maven.apache.org/maven2/org/apache/maven/maven/3.0.4/maven-3.0.4.pom
(22 KB at 1776.3 KB/sec)
[INFO] Downloading: http://repo.maven.apache.org/maven2/org/apache/maven/maven-model/3.0.4/maven-model-3.0.4.pom
[INFO] Downloaded: http://repo.maven.apache.org/maven2/org/apache/maven/maven-model/3.0.4/maven-model-3.0.4.pom
(4 KB at 337.6 KB/sec)
[INFO] Downloading: http://repo.maven.apache.org/maven2/org/apache/maven/maven-model-builder/3.0.4/maven-model-builder-3.0.4.pom
[INFO] Downloaded: http://repo.maven.apache.org/maven2/org/apache/maven/maven-model-builder/3.0.4/maven-model-builder-3.0.4.pom
(3 KB at 240.9 KB/sec)
[INFO] Downloading: http://repo.maven.apache.org/maven2/org/apache/maven/maven-repository-metadata/3.0.4/maven-repository-metadata-3.0.4.pom
[INFO] Downloaded: http://repo.maven.apache.org/maven2/org/apache/maven/maven-repository-metadata/3.0.4/maven-repository-metadata-3.0.4.pom
(2 KB at 23.1 KB/sec)
[INFO] Downloading: http://repo.maven.apache.org/maven2/org/apache/maven/wagon/wagon-file/1.0-beta-7/wagon-file-1.0-beta-7.pom
[INFO] Downloaded: http://repo.maven.apache.org/maven2/org/apache/maven/wagon/wagon-file/1.0-beta-7/wagon-file-1.0-beta-7.pom
(2 KB at 158.7 KB/sec)
[INFO] Downloading: http://repo.maven.apache.org/maven2/org/apache/maven/wagon/wagon-providers/1.0-beta-7/wagon-providers-1.0-beta-7.pom
[INFO] Downloaded: http://repo.maven.apache.org/maven2/org/apache/maven/wagon/wagon-providers/1.0-beta-7/wagon-providers-1.0-beta-7.pom
(3 KB at 176.5 KB/sec)
[INFO] Downloading: http://repo.maven.apache.org/maven2/org/apache/maven/wagon/wagon-http-lightweight/1.0-beta-7/wagon-http-lightweight-1.0-beta-7.pom
[INFO] Downloaded: http://repo.maven.apache.org/maven2/org/apache/maven/wagon/wagon-http-lightweight/1.0-beta-7/wagon-http-lightweight-1.0-beta-7.pom
(2 KB at 64.2 KB/sec)
[INFO] Downloading: http://repo.maven.apache.org/maven2/org/apache/maven/wagon/wagon-http-shared/1.0-beta-7/wagon-http-shared-1.0-beta-7.pom
[INFO] Downloaded: http://repo.maven.apache.org/maven2/org/apache/maven/wagon/wagon-http-shared/1.0-beta-7/wagon-http-shared-1.0-beta-7.pom
(3 KB at 56.0 KB/sec)
[INFO] Downloading: http://repo.maven.apache.org/maven2/org/codehaus/plexus/plexus-container-default/1.5.5/plexus-container-default-1.5.5.pom
[INFO] Downloaded: http://repo.maven.apache.org/maven2/org/codehaus/plexus/plexus-container-default/1.5.5/plexus-container-default-1.5.5.pom
(3 KB at 269.0 KB/sec)
[INFO] Downloading: http://repo.maven.apache.org/maven2/org/codehaus/plexus/plexus-classworlds/2.2.2/plexus-classworlds-2.2.2.pom
[INFO] Downloaded: http://repo.maven.apache.org/maven2/org/codehaus/plexus/plexus-classworlds/2.2.2/plexus-classworlds-2.2.2.pom
(4 KB at 358.0 KB/sec)
[INFO] Downloading: http://repo.maven.apache.org/maven2/org/apache/xbean/xbean-reflect/3.4/xbean-reflect-3.4.pom
[INFO] Downloaded: http://repo.maven.apache.org/maven2/org/apache/xbean/xbean-reflect/3.4/xbean-reflect-3.4.pom
(3 KB at 249.4 KB/sec)
[INFO] Downloading: http://repo.maven.apache.org/maven2/org/apache/xbean/xbean/3.4/xbean-3.4.pom
[INFO] Downloaded: http://repo.maven.apache.org/maven2/org/apache/xbean/xbean/3.4/xbean-3.4.pom
(19 KB at 952.5 KB/sec)
[INFO] Downloading: http://repo.maven.apache.org/maven2/com/google/collections/google-collections/1.0/google-collections-1.0.pom
[INFO] Downloaded: http://repo.maven.apache.org/maven2/com/google/collections/google-collections/1.0/google-collections-1.0.pom
(3 KB at 127.4 KB/sec)
[INFO] Downloading: http://repo.maven.apache.org/maven2/com/google/google/1/google-1.pom
[INFO] Downloaded: http://repo.maven.apache.org/maven2/com/google/google/1/google-1.pom (2
KB at 101.2 KB/sec)
[INFO] Downloading: http://repo.maven.apache.org/maven2/org/ops4j/base/ops4j-base-net/1.3.0/ops4j-base-net-1.3.0.pom
[INFO] Downloaded: http://repo.maven.apache.org/maven2/org/ops4j/base/ops4j-base-net/1.3.0/ops4j-base-net-1.3.0.pom
(2 KB at 5.0 KB/sec)
[INFO] Downloading: http://repo.maven.apache.org/maven2/org/ops4j/pax/swissbox/pax-swissbox-bnd/1.5.0/pax-swissbox-bnd-1.5.0.pom
[INFO] Downloaded: http://repo.maven.apache.org/maven2/org/ops4j/pax/swissbox/pax-swissbox-bnd/1.5.0/pax-swissbox-bnd-1.5.0.pom
(3 KB at 41.9 KB/sec)
[INFO] Downloading: http://repo.maven.apache.org/maven2/biz/aQute/bndlib/1.15.0/bndlib-1.15.0.pom
[INFO] Downloaded: http://repo.maven.apache.org/maven2/biz/aQute/bndlib/1.15.0/bndlib-1.15.0.pom
(2 KB at 17.3 KB/sec)
[INFO] Downloading: http://repo.maven.apache.org/maven2/org/apache/aries/blueprint/org.apache.aries.blueprint.core/1.0.0/org.apache.aries.blueprint.core-1.0.0.pom
[INFO] Downloaded: http://repo.maven.apache.org/maven2/org/apache/aries/blueprint/org.apache.aries.blueprint.core/1.0.0/org.apache.aries.blueprint.core-1.0.0.pom
(10 KB at 27.1 KB/sec)
[INFO] Downloading: http://repo.maven.apache.org/maven2/org/apache/aries/org.apache.aries.util/1.0.0/org.apache.aries.util-1.0.0.pom
[INFO] Downloaded: http://repo.maven.apache.org/maven2/org/apache/aries/org.apache.aries.util/1.0.0/org.apache.aries.util-1.0.0.pom
(6 KB at 64.3 KB/sec)
[INFO] Downloading: http://repo.maven.apache.org/maven2/org/apache/mina/mina-core/2.0.5/mina-core-2.0.5.jar
[INFO] Downloading: http://repo.maven.apache.org/maven2/org/ops4j/pax/swissbox/pax-swissbox-property/1.5.0/pax-swissbox-property-1.5.0.jar
[INFO] Downloading: http://repo.maven.apache.org/maven2/org/sonatype/aether/aether-api/1.13.1/aether-api-1.13.1.jar
[INFO] Downloading: http://repo.maven.apache.org/maven2/org/sonatype/aether/aether-spi/1.13.1/aether-spi-1.13.1.jar
[INFO] Downloading: http://repo.maven.apache.org/maven2/org/sonatype/aether/aether-util/1.13.1/aether-util-1.13.1.jar
[INFO] Downloaded: http://repo.maven.apache.org/maven2/org/sonatype/aether/aether-util/1.13.1/aether-util-1.13.1.jar
(127 KB at 3431.8 KB/sec)
[INFO] Downloading: http://repo.maven.apache.org/maven2/org/sonatype/aether/aether-impl/1.13.1/aether-impl-1.13.1.jar
[INFO] Downloaded: http://repo.maven.apache.org/maven2/org/sonatype/aether/aether-spi/1.13.1/aether-spi-1.13.1.jar
(16 KB at 327.6 KB/sec)
[INFO] Downloading: http://repo.maven.apache.org/maven2/org/sonatype/aether/aether-connector-wagon/1.13.1/aether-connector-wagon-1.13.1.jar
[INFO] Downloaded: http://repo.maven.apache.org/maven2/org/sonatype/aether/aether-api/1.13.1/aether-api-1.13.1.jar
(88 KB at 1199.5 KB/sec)
[INFO] Downloading: http://repo.maven.apache.org/maven2/org/sonatype/sisu/sisu-inject-plexus/2.2.3/sisu-inject-plexus-2.2.3.jar
[INFO] Downloaded: http://repo.maven.apache.org/maven2/org/apache/mina/mina-core/2.0.5/mina-core-2.0.5.jar
(631 KB at 8411.9 KB/sec)
[INFO] Downloading: http://repo.maven.apache.org/maven2/org/sonatype/sisu/sisu-inject-bean/2.2.3/sisu-inject-bean-2.2.3.jar
[INFO] Downloaded: http://repo.maven.apache.org/maven2/org/sonatype/aether/aether-impl/1.13.1/aether-impl-1.13.1.jar
(128 KB at 2704.2 KB/sec)
[INFO] Downloading: http://repo.maven.apache.org/maven2/org/sonatype/sisu/sisu-guice/3.0.3/sisu-guice-3.0.3-no_aop.jar
[INFO] Downloaded: http://repo.maven.apache.org/maven2/org/ops4j/pax/swissbox/pax-swissbox-property/1.5.0/pax-swissbox-property-1.5.0.jar
(4 KB at 36.8 KB/sec)
[INFO] Downloading: http://repo.maven.apache.org/maven2/org/apache/maven/maven-aether-provider/3.0.4/maven-aether-provider-3.0.4.jar
[INFO] Downloaded: http://repo.maven.apache.org/maven2/org/sonatype/aether/aether-connector-wagon/1.13.1/aether-connector-wagon-1.13.1.jar
(30 KB at 355.4 KB/sec)
[INFO] Downloading: http://repo.maven.apache.org/maven2/org/apache/maven/maven-model/3.0.4/maven-model-3.0.4.jar
[INFO] Downloaded: http://repo.maven.apache.org/maven2/org/apache/maven/maven-aether-provider/3.0.4/maven-aether-provider-3.0.4.jar
(56 KB at 904.5 KB/sec)
[INFO] Downloading: http://repo.maven.apache.org/maven2/org/apache/maven/maven-model-builder/3.0.4/maven-model-builder-3.0.4.jar
[INFO] Downloaded: http://repo.maven.apache.org/maven2/org/apache/maven/maven-model/3.0.4/maven-model-3.0.4.jar
(160 KB at 3472.2 KB/sec)
[INFO] Downloading: http://repo.maven.apache.org/maven2/org/apache/maven/maven-repository-metadata/3.0.4/maven-repository-metadata-3.0.4.jar
[INFO] Downloaded: http://repo.maven.apache.org/maven2/org/apache/maven/maven-repository-metadata/3.0.4/maven-repository-metadata-3.0.4.jar
(30 KB at 257.6 KB/sec)
[INFO] Downloading: http://repo.maven.apache.org/maven2/org/apache/maven/wagon/wagon-file/1.0-beta-7/wagon-file-1.0-beta-7.jar
[INFO] Downloaded: http://repo.maven.apache.org/maven2/org/apache/maven/wagon/wagon-file/1.0-beta-7/wagon-file-1.0-beta-7.jar
(11 KB at 317.8 KB/sec)
[INFO] Downloading: http://repo.maven.apache.org/maven2/org/apache/maven/wagon/wagon-http-lightweight/1.0-beta-7/wagon-http-lightweight-1.0-beta-7.jar
[INFO] Downloaded: http://repo.maven.apache.org/maven2/org/apache/maven/wagon/wagon-http-lightweight/1.0-beta-7/wagon-http-lightweight-1.0-beta-7.jar
(15 KB at 1626.6 KB/sec)
[INFO] Downloading: http://repo.maven.apache.org/maven2/org/apache/maven/wagon/wagon-http-shared/1.0-beta-7/wagon-http-shared-1.0-beta-7.jar
[INFO] Downloaded: http://repo.maven.apache.org/maven2/org/sonatype/sisu/sisu-guice/3.0.3/sisu-guice-3.0.3-no_aop.jar
(479 KB at 1874.5 KB/sec)
[INFO] Downloading: http://repo.maven.apache.org/maven2/org/codehaus/plexus/plexus-container-default/1.5.5/plexus-container-default-1.5.5.jar
[INFO] Downloaded: http://repo.maven.apache.org/maven2/org/sonatype/sisu/sisu-inject-plexus/2.2.3/sisu-inject-plexus-2.2.3.jar
(199 KB at 744.4 KB/sec)
[INFO] Downloading: http://repo.maven.apache.org/maven2/org/apache/xbean/xbean-reflect/3.4/xbean-reflect-3.4.jar
[INFO] Downloaded: http://repo.maven.apache.org/maven2/org/apache/maven/wagon/wagon-http-shared/1.0-beta-7/wagon-http-shared-1.0-beta-7.jar
(25 KB at 2076.5 KB/sec)
[INFO] Downloading: http://repo.maven.apache.org/maven2/com/google/collections/google-collections/1.0/google-collections-1.0.jar
[INFO] Downloaded: http://repo.maven.apache.org/maven2/org/codehaus/plexus/plexus-container-default/1.5.5/plexus-container-default-1.5.5.jar
(212 KB at 15111.6 KB/sec)
[INFO] Downloading: http://repo.maven.apache.org/maven2/commons-httpclient/commons-httpclient/3.1/commons-httpclient-3.1.jar
[INFO] Downloaded: http://repo.maven.apache.org/maven2/org/apache/xbean/xbean-reflect/3.4/xbean-reflect-3.4.jar
(131 KB at 4667.5 KB/sec)
[INFO] Downloading: http://repo.maven.apache.org/maven2/commons-codec/commons-codec/1.2/commons-codec-1.2.jar
[INFO] Downloaded: http://repo.maven.apache.org/maven2/commons-httpclient/commons-httpclient/3.1/commons-httpclient-3.1.jar
(298 KB at 17520.7 KB/sec)
[INFO] Downloading: http://repo.maven.apache.org/maven2/org/ops4j/base/ops4j-base-net/1.3.0/ops4j-base-net-1.3.0.jar
[INFO] Downloaded: http://repo.maven.apache.org/maven2/com/google/collections/google-collections/1.0/google-collections-1.0.jar
(625 KB at 19518.8 KB/sec)
[INFO] Downloading: http://repo.maven.apache.org/maven2/org/ops4j/base/ops4j-base-monitors/1.3.0/ops4j-base-monitors-1.3.0.jar
[INFO] Downloaded: http://repo.maven.apache.org/maven2/commons-codec/commons-codec/1.2/commons-codec-1.2.jar
(30 KB at 2938.0 KB/sec)
[INFO] Downloaded: http://repo.maven.apache.org/maven2/org/apache/maven/maven-model-builder/3.0.4/maven-model-builder-3.0.4.jar
(148 KB at 620.5 KB/sec)
[INFO] Downloaded: http://repo.maven.apache.org/maven2/org/sonatype/sisu/sisu-inject-bean/2.2.3/sisu-inject-bean-2.2.3.jar
(256 KB at 758.7 KB/sec)
[INFO] Downloaded: http://repo.maven.apache.org/maven2/org/ops4j/base/ops4j-base-monitors/1.3.0/ops4j-base-monitors-1.3.0.jar
(8 KB at 36.7 KB/sec)
[INFO] Downloaded: http://repo.maven.apache.org/maven2/org/ops4j/base/ops4j-base-net/1.3.0/ops4j-base-net-1.3.0.jar
(12 KB at 40.5 KB/sec)
[INFO] [INFO] 
[INFO] [INFO] --- maven-clean-plugin:2.4.1:clean (default-clean) @ assembly ---
[INFO] [INFO] 
[INFO] [INFO] --- maven-resources-plugin:2.6:resources (default-resources) @ assembly ---
[INFO] Downloading: http://repo.maven.apache.org/maven2/org/apache/maven/shared/maven-filtering/1.1/maven-filtering-1.1.pom
[INFO] Downloaded: http://repo.maven.apache.org/maven2/org/apache/maven/shared/maven-filtering/1.1/maven-filtering-1.1.pom
(6 KB at 513.9 KB/sec)
[INFO] Downloading: http://repo.maven.apache.org/maven2/org/apache/maven/shared/maven-filtering/1.1/maven-filtering-1.1.jar
[INFO] Downloaded: http://repo.maven.apache.org/maven2/org/apache/maven/shared/maven-filtering/1.1/maven-filtering-1.1.jar
(43 KB at 3006.8 KB/sec)
[INFO] [WARNING] Using platform encoding (ANSI_X3.4-1968 actually) to copy filtered resources,
i.e. build is platform dependent!
[INFO] [INFO] skip non existing resourceDirectory <https://builds.apache.org/job/Karaf/org.apache.karaf.archetypes$karaf-assembly-archetype/ws/target/test-classes/projects/assembly/project/assembly/src/main/resources>
[INFO] [INFO] 
[INFO] [INFO] --- karaf-maven-plugin:3.0.0-SNAPSHOT:install-kars (default-install-kars) @
assembly ---
[INFO] [INFO] Installing feature <https://builds.apache.org/job/Karaf/org.apache.karaf.archetypes$karaf-assembly-archetype/ws/target/test-classes/projects/assembly/project/assembly/target/assembly/system/org/apache/karaf/features/framework/3.0.0-SNAPSHOT/framework-3.0.0-SNAPSHOT-features.xml>
to system and startup.properties
[INFO] [INFO] Adding feature repository to system: mvn:org.apache.karaf.features/standard/3.0.0-SNAPSHOT/xml/features
[INFO] [WARNING] could not resolve org.apache.aries.jmx:org.apache.aries.jmx.api:1.1.1-SNAPSHOT
[INFO] org.sonatype.aether.resolution.ArtifactResolutionException: Could not find artifact
org.apache.aries.jmx:org.apache.aries.jmx.api:jar:1.1.1-SNAPSHOT
[INFO] 	at org.sonatype.aether.impl.internal.DefaultArtifactResolver.resolve(DefaultArtifactResolver.java:538)
[INFO] 	at org.sonatype.aether.impl.internal.DefaultArtifactResolver.resolveArtifacts(DefaultArtifactResolver.java:216)
[INFO] 	at org.sonatype.aether.impl.internal.DefaultArtifactResolver.resolveArtifact(DefaultArtifactResolver.java:193)
[INFO] 	at org.sonatype.aether.impl.internal.DefaultRepositorySystem.resolveArtifact(DefaultRepositorySystem.java:286)
[INFO] 	at org.apache.karaf.tooling.features.InstallKarsMojo.resolve(InstallKarsMojo.java:376)
[INFO] 	at org.apache.karaf.tooling.features.InstallKarsMojo.install(InstallKarsMojo.java:341)
[INFO] 	at org.apache.karaf.tooling.features.InstallKarsMojo.execute(InstallKarsMojo.java:299)
[INFO] 	at org.apache.maven.plugin.DefaultBuildPluginManager.executeMojo(DefaultBuildPluginManager.java:101)
[INFO] 	at org.apache.maven.lifecycle.internal.MojoExecutor.execute(MojoExecutor.java:209)
[INFO] 	at org.apache.maven.lifecycle.internal.MojoExecutor.execute(MojoExecutor.java:153)
[INFO] 	at org.apache.maven.lifecycle.internal.MojoExecutor.execute(MojoExecutor.java:145)
[INFO] 	at org.apache.maven.lifecycle.internal.LifecycleModuleBuilder.buildProject(LifecycleModuleBuilder.java:84)
[INFO] 	at org.apache.maven.lifecycle.internal.LifecycleModuleBuilder.buildProject(LifecycleModuleBuilder.java:59)
[INFO] 	at org.apache.maven.lifecycle.internal.LifecycleStarter.singleThreadedBuild(LifecycleStarter.java:183)
[INFO] 	at org.apache.maven.lifecycle.internal.LifecycleStarter.execute(LifecycleStarter.java:161)
[INFO] 	at org.apache.maven.DefaultMaven.doExecute(DefaultMaven.java:320)
[INFO] 	at org.apache.maven.DefaultMaven.execute(DefaultMaven.java:156)
[INFO] 	at org.apache.maven.cli.MavenCli.execute(MavenCli.java:537)
[INFO] 	at org.apache.maven.cli.MavenCli.doMain(MavenCli.java:196)
[INFO] 	at org.apache.maven.cli.MavenCli.main(MavenCli.java:141)
[INFO] 	at sun.reflect.NativeMethodAccessorImpl.invoke0(Native Method)
[INFO] 	at sun.reflect.NativeMethodAccessorImpl.invoke(NativeMethodAccessorImpl.java:39)
[INFO] 	at sun.reflect.DelegatingMethodAccessorImpl.invoke(DelegatingMethodAccessorImpl.java:25)
[INFO] 	at java.lang.reflect.Method.invoke(Method.java:597)
[INFO] 	at org.codehaus.plexus.classworlds.launcher.Launcher.launchEnhanced(Launcher.java:290)
[INFO] 	at org.codehaus.plexus.classworlds.launcher.Launcher.launch(Launcher.java:230)
[INFO] 	at org.codehaus.plexus.classworlds.launcher.Launcher.mainWithExitCode(Launcher.java:409)
[INFO] 	at org.codehaus.plexus.classworlds.launcher.Launcher.main(Launcher.java:352)
[INFO] Caused by: org.sonatype.aether.transfer.ArtifactNotFoundException: Could not find artifact
org.apache.aries.jmx:org.apache.aries.jmx.api:jar:1.1.1-SNAPSHOT
[INFO] 	at org.sonatype.aether.impl.internal.DefaultArtifactResolver.resolve(DefaultArtifactResolver.java:528)
[INFO] 	... 27 more
[INFO] [INFO] ------------------------------------------------------------------------
[INFO] [INFO] BUILD FAILURE
[INFO] [INFO] ------------------------------------------------------------------------
[INFO] [INFO] Total time: 7.832s
[INFO] [INFO] Finished at: Tue Feb 12 20:53:15 UTC 2013
[INFO] [INFO] Final Memory: 13M/252M
[INFO] [INFO] ------------------------------------------------------------------------
[INFO] [ERROR] Failed to execute goal org.apache.karaf.tooling:karaf-maven-plugin:3.0.0-SNAPSHOT:install-kars
(default-install-kars) on project assembly: Couldn't resolve artifact org.apache.aries.jmx:org.apache.aries.jmx.api:1.1.1-SNAPSHOT:
Could not find artifact org.apache.aries.jmx:org.apache.aries.jmx.api:jar:1.1.1-SNAPSHOT ->
[Help 1]
[INFO] org.apache.maven.lifecycle.LifecycleExecutionException: Failed to execute goal org.apache.karaf.tooling:karaf-maven-plugin:3.0.0-SNAPSHOT:install-kars
(default-install-kars) on project assembly: Couldn't resolve artifact org.apache.aries.jmx:org.apache.aries.jmx.api:1.1.1-SNAPSHOT
[INFO] 	at org.apache.maven.lifecycle.internal.MojoExecutor.execute(MojoExecutor.java:213)
[INFO] 	at org.apache.maven.lifecycle.internal.MojoExecutor.execute(MojoExecutor.java:153)
[INFO] 	at org.apache.maven.lifecycle.internal.MojoExecutor.execute(MojoExecutor.java:145)
[INFO] 	at org.apache.maven.lifecycle.internal.LifecycleModuleBuilder.buildProject(LifecycleModuleBuilder.java:84)
[INFO] 	at org.apache.maven.lifecycle.internal.LifecycleModuleBuilder.buildProject(LifecycleModuleBuilder.java:59)
[INFO] 	at org.apache.maven.lifecycle.internal.LifecycleStarter.singleThreadedBuild(LifecycleStarter.java:183)
[INFO] 	at org.apache.maven.lifecycle.internal.LifecycleStarter.execute(LifecycleStarter.java:161)
[INFO] 	at org.apache.maven.DefaultMaven.doExecute(DefaultMaven.java:320)
[INFO] 	at org.apache.maven.DefaultMaven.execute(DefaultMaven.java:156)
[INFO] 	at org.apache.maven.cli.MavenCli.execute(MavenCli.java:537)
[INFO] 	at org.apache.maven.cli.MavenCli.doMain(MavenCli.java:196)
[INFO] 	at org.apache.maven.cli.MavenCli.main(MavenCli.java:141)
[INFO] 	at sun.reflect.NativeMethodAccessorImpl.invoke0(Native Method)
[INFO] 	at sun.reflect.NativeMethodAccessorImpl.invoke(NativeMethodAccessorImpl.java:39)
[INFO] 	at sun.reflect.DelegatingMethodAccessorImpl.invoke(DelegatingMethodAccessorImpl.java:25)
[INFO] 	at java.lang.reflect.Method.invoke(Method.java:597)
[INFO] 	at org.codehaus.plexus.classworlds.launcher.Launcher.launchEnhanced(Launcher.java:290)
[INFO] 	at org.codehaus.plexus.classworlds.launcher.Launcher.launch(Launcher.java:230)
[INFO] 	at org.codehaus.plexus.classworlds.launcher.Launcher.mainWithExitCode(Launcher.java:409)
[INFO] 	at org.codehaus.plexus.classworlds.launcher.Launcher.main(Launcher.java:352)
[INFO] Caused by: org.apache.maven.plugin.MojoFailureException: Couldn't resolve artifact
org.apache.aries.jmx:org.apache.aries.jmx.api:1.1.1-SNAPSHOT
[INFO] 	at org.apache.karaf.tooling.features.InstallKarsMojo.resolve(InstallKarsMojo.java:379)
[INFO] 	at org.apache.karaf.tooling.features.InstallKarsMojo.install(InstallKarsMojo.java:341)
[INFO] 	at org.apache.karaf.tooling.features.InstallKarsMojo.execute(InstallKarsMojo.java:299)
[INFO] 	at org.apache.maven.plugin.DefaultBuildPluginManager.executeMojo(DefaultBuildPluginManager.java:101)
[INFO] 	at org.apache.maven.lifecycle.internal.MojoExecutor.execute(MojoExecutor.java:209)
[INFO] 	... 19 more
[INFO] Caused by: org.sonatype.aether.resolution.ArtifactResolutionException: Could not find
artifact org.apache.aries.jmx:org.apache.aries.jmx.api:jar:1.1.1-SNAPSHOT
[INFO] 	at org.sonatype.aether.impl.internal.DefaultArtifactResolver.resolve(DefaultArtifactResolver.java:538)
[INFO] 	at org.sonatype.aether.impl.internal.DefaultArtifactResolver.resolveArtifacts(DefaultArtifactResolver.java:216)
[INFO] 	at org.sonatype.aether.impl.internal.DefaultArtifactResolver.resolveArtifact(DefaultArtifactResolver.java:193)
[INFO] 	at org.sonatype.aether.impl.internal.DefaultRepositorySystem.resolveArtifact(DefaultRepositorySystem.java:286)
[INFO] 	at org.apache.karaf.tooling.features.InstallKarsMojo.resolve(InstallKarsMojo.java:376)
[INFO] 	... 23 more
[INFO] Caused by: org.sonatype.aether.transfer.ArtifactNotFoundException: Could not find artifact
org.apache.aries.jmx:org.apache.aries.jmx.api:jar:1.1.1-SNAPSHOT
[INFO] 	at org.sonatype.aether.impl.internal.DefaultArtifactResolver.resolve(DefaultArtifactResolver.java:528)
[INFO] 	... 27 more
[INFO] [ERROR] 
[INFO] [ERROR] Re-run Maven using the -X switch to enable full debug logging.
[INFO] [ERROR] 
[INFO] [ERROR] For more information about the errors and possible solutions, please read the
following articles:
[INFO] [ERROR] [Help 1] http://cwiki.apache.org/confluence/display/MAVEN/MojoFailureException
[INFO] Post-archetype-generation invoker exit code: 1
mojoFailed org.apache.maven.plugins:maven-archetype-plugin:2.2(default-integration-test)
projectFailed org.apache.karaf.archetypes:karaf-assembly-archetype:3.0.0-SNAPSHOT

Mime
View raw message