karaf-commits mailing list archives

Site index · List index
Message view « Date » · « Thread »
Top « Date » · « Thread »
From Apache Jenkins Server <jenk...@builds.apache.org>
Subject Build failed in Jenkins: Karaf #747
Date Tue, 29 Nov 2011 04:08:20 GMT
See <https://builds.apache.org/job/Karaf/747/changes>

Changes:

[gnodet] [KARAF-1055] New bundle:capabilities and bundle:requirements commands

[jgoodyear] [KARAF-1053] Removed unused folders/code from Assemblies/Assembly.

Removing unused folders under assemblies.

[gnodet] [KARAF-1040] Commands should not catch exceptions but should rethrow them

[gnodet] [KARAF-960] Add real scripting examples

[gnodet] [KARAF-960] Add information about available variables in the Karaf shell

[gnodet] [KARAF-1051] The addcommand / removecommand / eval commands should be in the shell
scope

[gnodet] [KARAF-960] Fix some docs related to the shell addcommand

[pieber] [KARAF-1007] Ported docs from labs-paxexam-karaf to karaf

Signed-off-by: Andreas Pieber <anpieber@gmail.com>

[djencks] KARAF-424 capitalize Karaf and Maven in recently modified pages according to Glenn
Mazza's suggestion

[pieber] [KARAF-1006] Reactivated kittests till I've found a better solution

Signed-off-by: Andreas Pieber <anpieber@gmail.com>

[pieber] [KARAF-1005] ported itests to the new karaf test framework

Signed-off-by: Andreas Pieber <anpieber@gmail.com>

[pieber] [KARAF-1004] Introduce paxexam-karaf into karaf tooling

Signed-off-by: Andreas Pieber <anpieber@gmail.com>

[djencks] KARAF-424 update documentation for kar and karaf-assembly packaging

[djencks] minor doc updates

[jbonofre] [KARAF-1028] Upgrade to Felix Framework 4.0.2

------------------------------------------
[...truncated 3570 lines...]
[INFO] --- maven-remote-resources-plugin:1.2.1:process (default) @ shell ---
[INFO] [INFO] Installing <https://builds.apache.org/job/Karaf/ws/karaf/shell/pom.xml>
to <https://builds.apache.org/job/Karaf/ws/.repository/org/apache/karaf/shell/shell/3.0.0-SNAPSHOT/shell-3.0.0-SNAPSHOT.pom>

[INFO] --- maven-install-plugin:2.3.1:install (default-install) @ shell ---
[JENKINS] Archiving <https://builds.apache.org/job/Karaf/ws/karaf/shell/pom.xml> to
/home/hudson/hudson/jobs/Karaf/modules/org.apache.karaf.shell$shell/builds/2011-11-29_04-04-15/archive/org.apache.karaf.shell/shell/3.0.0-SNAPSHOT/shell-3.0.0-SNAPSHOT.pom
[INFO] Downloading: http://svn.apache.org/repos/asf/servicemix/m2-repo/org/slf4j/slf4j-simple/1.6.1/slf4j-simple-1.6.1.pom
                                                                        
[INFO] ------------------------------------------------------------------------
[INFO] Building Apache Karaf :: Shell :: Console 3.0.0-SNAPSHOT
[INFO] ------------------------------------------------------------------------
Downloading: http://zodiac.springsource.com/maven/bundles/release/org/slf4j/slf4j-simple/1.6.1/slf4j-simple-1.6.1.pom
Downloading: http://repo1.maven.org/maven2/org/slf4j/slf4j-simple/1.6.1/slf4j-simple-1.6.1.pom
Downloaded: http://repo1.maven.org/maven2/org/slf4j/slf4j-simple/1.6.1/slf4j-simple-1.6.1.pom
(2 KB at 3.9 KB/sec)
Downloading: http://svn.apache.org/repos/asf/servicemix/m2-repo/org/fusesource/jansi/jansi/1.7/jansi-1.7.pom
Downloading: http://zodiac.springsource.com/maven/bundles/release/org/fusesource/jansi/jansi/1.7/jansi-1.7.pom
Downloading: http://repo1.maven.org/maven2/org/fusesource/jansi/jansi/1.7/jansi-1.7.pom
Downloaded: http://repo1.maven.org/maven2/org/fusesource/jansi/jansi/1.7/jansi-1.7.pom (4
KB at 9.9 KB/sec)
Downloading: http://svn.apache.org/repos/asf/servicemix/m2-repo/org/fusesource/jansi/jansi-project/1.7/jansi-project-1.7.pom
Downloading: http://zodiac.springsource.com/maven/bundles/release/org/fusesource/jansi/jansi-project/1.7/jansi-project-1.7.pom
Downloading: http://repo1.maven.org/maven2/org/fusesource/jansi/jansi-project/1.7/jansi-project-1.7.pom
Downloaded: http://repo1.maven.org/maven2/org/fusesource/jansi/jansi-project/1.7/jansi-project-1.7.pom
(12 KB at 32.0 KB/sec)
Downloading: http://svn.apache.org/repos/asf/servicemix/m2-repo/org/fusesource/fusesource-pom/1.8/fusesource-pom-1.8.pom
Downloading: http://zodiac.springsource.com/maven/bundles/release/org/fusesource/fusesource-pom/1.8/fusesource-pom-1.8.pom
Downloading: http://repo1.maven.org/maven2/org/fusesource/fusesource-pom/1.8/fusesource-pom-1.8.pom
Downloaded: http://repo1.maven.org/maven2/org/fusesource/fusesource-pom/1.8/fusesource-pom-1.8.pom
(15 KB at 40.2 KB/sec)
Downloading: http://repository.sonatype.org/content/groups/sonatype-public-grid/net/sf/jline/jline/2.6-SNAPSHOT/maven-metadata.xml
Downloading: http://repo.fusesource.com/nexus/content/repositories/snapshots/net/sf/jline/jline/2.6-SNAPSHOT/maven-metadata.xml
Downloading: http://repository.apache.org/content/groups/snapshots-group/net/sf/jline/jline/2.6-SNAPSHOT/maven-metadata.xml
Downloading: https://oss.sonatype.org/content/repositories/ops4j-snapshots/net/sf/jline/jline/2.6-SNAPSHOT/maven-metadata.xml
Downloading: https://oss.sonatype.org/content/groups/public/net/sf/jline/jline/2.6-SNAPSHOT/maven-metadata.xml
Downloading: http://repository.apache.org/snapshots/net/sf/jline/jline/2.6-SNAPSHOT/maven-metadata.xml
Downloaded: https://oss.sonatype.org/content/groups/public/net/sf/jline/jline/2.6-SNAPSHOT/maven-metadata.xml
(2 KB at 1.3 KB/sec)
Downloaded: http://repository.sonatype.org/content/groups/sonatype-public-grid/net/sf/jline/jline/2.6-SNAPSHOT/maven-metadata.xml
(2 KB at 0.7 KB/sec)
Downloading: http://repository.apache.org/content/groups/snapshots-group/net/sf/jline/jline/2.6-SNAPSHOT/jline-2.6-20111125.132117-2.pom
Downloading: http://repository.sonatype.org/content/groups/sonatype-public-grid/net/sf/jline/jline/2.6-SNAPSHOT/jline-2.6-20111125.132117-2.pom
Downloaded: http://repository.sonatype.org/content/groups/sonatype-public-grid/net/sf/jline/jline/2.6-SNAPSHOT/jline-2.6-20111125.132117-2.pom
(8 KB at 5.3 KB/sec)
Downloading: http://svn.apache.org/repos/asf/servicemix/m2-repo/org/sonatype/oss/oss-parent/7/oss-parent-7.pom
Downloading: http://zodiac.springsource.com/maven/bundles/release/org/sonatype/oss/oss-parent/7/oss-parent-7.pom
Downloading: http://repo1.maven.org/maven2/org/sonatype/oss/oss-parent/7/oss-parent-7.pom
Downloaded: http://repo1.maven.org/maven2/org/sonatype/oss/oss-parent/7/oss-parent-7.pom (5
KB at 15.3 KB/sec)
Downloading: http://svn.apache.org/repos/asf/servicemix/m2-repo/org/apache/felix/org.apache.felix.gogo.runtime/0.10.0/org.apache.felix.gogo.runtime-0.10.0.pom
Downloading: http://zodiac.springsource.com/maven/bundles/release/org/apache/felix/org.apache.felix.gogo.runtime/0.10.0/org.apache.felix.gogo.runtime-0.10.0.pom
Downloading: http://repo1.maven.org/maven2/org/apache/felix/org.apache.felix.gogo.runtime/0.10.0/org.apache.felix.gogo.runtime-0.10.0.pom
Downloaded: http://repo1.maven.org/maven2/org/apache/felix/org.apache.felix.gogo.runtime/0.10.0/org.apache.felix.gogo.runtime-0.10.0.pom
(5 KB at 13.0 KB/sec)
Downloading: http://svn.apache.org/repos/asf/servicemix/m2-repo/org/apache/felix/gogo-parent/0.6.0/gogo-parent-0.6.0.pom
Downloading: http://zodiac.springsource.com/maven/bundles/release/org/apache/felix/gogo-parent/0.6.0/gogo-parent-0.6.0.pom
Downloading: http://repo1.maven.org/maven2/org/apache/felix/gogo-parent/0.6.0/gogo-parent-0.6.0.pom
Downloaded: http://repo1.maven.org/maven2/org/apache/felix/gogo-parent/0.6.0/gogo-parent-0.6.0.pom
(4 KB at 10.1 KB/sec)
Downloading: http://svn.apache.org/repos/asf/servicemix/m2-repo/org/slf4j/slf4j-simple/1.6.1/slf4j-simple-1.6.1.jar
Downloading: http://svn.apache.org/repos/asf/servicemix/m2-repo/org/fusesource/jansi/jansi/1.7/jansi-1.7.jar
Downloading: http://svn.apache.org/repos/asf/servicemix/m2-repo/org/apache/felix/org.apache.felix.gogo.runtime/0.10.0/org.apache.felix.gogo.runtime-0.10.0.jar
Downloading: http://zodiac.springsource.com/maven/bundles/release/org/slf4j/slf4j-simple/1.6.1/slf4j-simple-1.6.1.jar
Downloading: http://zodiac.springsource.com/maven/bundles/release/org/fusesource/jansi/jansi/1.7/jansi-1.7.jar
Downloading: http://zodiac.springsource.com/maven/bundles/release/org/apache/felix/org.apache.felix.gogo.runtime/0.10.0/org.apache.felix.gogo.runtime-0.10.0.jar
Downloading: http://repo1.maven.org/maven2/org/slf4j/slf4j-simple/1.6.1/slf4j-simple-1.6.1.jar
Downloading: http://repo1.maven.org/maven2/org/fusesource/jansi/jansi/1.7/jansi-1.7.jar
Downloading: http://repo1.maven.org/maven2/org/apache/felix/org.apache.felix.gogo.runtime/0.10.0/org.apache.felix.gogo.runtime-0.10.0.jar
Downloaded: http://repo1.maven.org/maven2/org/slf4j/slf4j-simple/1.6.1/slf4j-simple-1.6.1.jar
(8 KB at 9.3 KB/sec)
Downloaded: http://repo1.maven.org/maven2/org/apache/felix/org.apache.felix.gogo.runtime/0.10.0/org.apache.felix.gogo.runtime-0.10.0.jar
(66 KB at 61.4 KB/sec)
Downloaded: http://repo1.maven.org/maven2/org/fusesource/jansi/jansi/1.7/jansi-1.7.jar (111
KB at 82.9 KB/sec)
Downloading: http://repository.sonatype.org/content/groups/sonatype-public-grid/net/sf/jline/jline/2.6-SNAPSHOT/jline-2.6-20111125.132117-2.jar
Downloaded: http://repository.sonatype.org/content/groups/sonatype-public-grid/net/sf/jline/jline/2.6-SNAPSHOT/jline-2.6-20111125.132117-2.jar
(182 KB at 118.9 KB/sec)
[INFO] 
[INFO] --- maven-clean-plugin:2.4.1:clean (default-clean) @ org.apache.karaf.shell.console
---
[INFO] 
[INFO] --- maven-enforcer-plugin:1.0.1:enforce (enforce-maven) @ org.apache.karaf.shell.console
---
[INFO] 
[INFO] --- maven-bundle-plugin:2.3.5:cleanVersions (cleanVersions) @ org.apache.karaf.shell.console
---
[INFO] 
[INFO] --- maven-remote-resources-plugin:1.2.1:process (default) @ org.apache.karaf.shell.console
---
[debug] execute contextualize
[INFO] [INFO] Using 'UTF-8' encoding to copy filtered resources.
[INFO] Copying 6 resources
[INFO] Copying 1 resource
[INFO] Copying 1 resource
[INFO] Copying 3 resources

[INFO] --- maven-resources-plugin:2.5:resources (default-resources) @ org.apache.karaf.shell.console
---
[INFO] 
[INFO] --- maven-compiler-plugin:2.3.2:compile (default-compile) @ org.apache.karaf.shell.console
---
[INFO] Compiling 52 source files to <https://builds.apache.org/job/Karaf/ws/karaf/shell/console/target/classes>
[INFO] -------------------------------------------------------------
[ERROR] COMPILATION ERROR : 
[INFO] -------------------------------------------------------------
[ERROR] <https://builds.apache.org/job/Karaf/ws/karaf/shell/console/src/main/java/org/apache/karaf/shell/console/OsgiCommandSupport.java>:[58,28]
incompatible types
found   : java.lang.Object
required: T
[INFO] 1 error
[INFO] -------------------------------------------------------------
[JENKINS] Archiving <https://builds.apache.org/job/Karaf/ws/karaf/shell/console/pom.xml>
to /home/hudson/hudson/jobs/Karaf/modules/org.apache.karaf.shell$org.apache.karaf.shell.console/builds/2011-11-29_04-04-15/archive/org.apache.karaf.shell/org.apache.karaf.shell.console/3.0.0-SNAPSHOT/org.apache.karaf.shell.console-3.0.0-SNAPSHOT.pom
[INFO] ------------------------------------------------------------------------
[INFO] Reactor Summary:
[INFO] 
[INFO] Apache Karaf ...................................... SUCCESS [1:26.103s]
[INFO] Apache Karaf :: JAAS .............................. SUCCESS [0.680s]
[INFO] Apache Karaf :: JAAS :: Boot ...................... SUCCESS [19.607s]
[INFO] Apache Karaf :: JAAS :: Config .................... SUCCESS [14.612s]
[INFO] Apache Karaf :: JAAS :: Modules ................... SUCCESS [33.926s]
[INFO] Apache Karaf :: Shell ............................. SUCCESS [0.658s]
[INFO] Apache Karaf :: Shell :: Console .................. FAILURE [17.478s]
[INFO] Apache Karaf :: Util .............................. SKIPPED
[INFO] Apache Karaf :: Main .............................. SKIPPED
[INFO] Apache Karaf :: Features .......................... SKIPPED
[INFO] Apache Karaf :: Features :: Core .................. SKIPPED
[INFO] Apache Karaf :: Features :: Command ............... SKIPPED
[INFO] Apache Karaf :: Features :: Management ............ SKIPPED
[INFO] Apache Karaf :: Features :: OBR Resolver .......... SKIPPED
[INFO] Apache Karaf :: Admin ............................. SKIPPED
[INFO] Apache Karaf :: Admin :: Core ..................... SKIPPED
[INFO] Apache Karaf :: Admin :: Command .................. SKIPPED
[INFO] Apache Karaf :: Admin :: Management ............... SKIPPED
[INFO] Apache Karaf :: Deployer .......................... SKIPPED
[INFO] Apache Karaf :: Deployer :: Spring ................ SKIPPED
[INFO] Apache Karaf :: Deployer :: Blueprint ............. SKIPPED
[INFO] Apache Karaf :: Deployer :: Features .............. SKIPPED
[INFO] Apache Karaf :: Deployer :: Karaf Archive (.kar) .. SKIPPED
[INFO] Apache Karaf :: Deployer :: Wrap Non OSGi Jar ..... SKIPPED
[INFO] Apache Karaf :: Shell :: Various Commands ......... SKIPPED
[INFO] Apache Karaf :: Shell :: Bundles Commands ......... SKIPPED
[INFO] Apache Karaf :: Shell :: ConfigAdmin Commands ..... SKIPPED
[INFO] Apache Karaf :: Shell :: Development Commands ..... SKIPPED
[INFO] Apache Karaf :: Shell :: Http Commands ............ SKIPPED
[INFO] Apache Karaf :: Shell :: Log Commands ............. SKIPPED
[INFO] Apache Karaf :: Shell :: OBR Commands ............. SKIPPED
[INFO] Apache Karaf :: Shell :: Services Commands ........ SKIPPED
[INFO] Apache Karaf :: Shell :: SSH ...................... SKIPPED
[INFO] Apache Karaf :: Shell :: System Commands .......... SKIPPED
[INFO] Apache Karaf :: Shell :: Web Commands ............. SKIPPED
[INFO] Apache Karaf :: Shell :: Service Wrapper .......... SKIPPED
[INFO] Apache Karaf :: JAAS :: Jasypt Encryption ......... SKIPPED
[INFO] Apache Karaf :: Jaas :: Command ................... SKIPPED
[INFO] Apache Karaf :: Client ............................ SKIPPED
[INFO] Apache Karaf :: Management ........................ SKIPPED
[INFO] Apache Karaf :: Management ........................ SKIPPED
[INFO] Apache Karaf :: Management :: MBeans .............. SKIPPED
[INFO] Apache Karaf :: Management :: MBeans :: Bundles ... SKIPPED
[INFO] Apache Karaf :: Management :: MBeans :: Services .. SKIPPED
[INFO] Apache Karaf :: Management :: MBeans :: System .... SKIPPED
[INFO] Apache Karaf :: Management :: MBeans :: Packages .. SKIPPED
[INFO] Apache Karaf :: Management :: MBeans :: Config .... SKIPPED
[INFO] Apache Karaf :: Management :: MBeans :: Dev ....... SKIPPED
[INFO] Apache Karaf :: Management :: MBeans :: HTTP ...... SKIPPED
[INFO] Apache Karaf :: Management :: MBeans :: Log ....... SKIPPED
[INFO] Apache Karaf :: Management :: MBeans :: OBR ....... SKIPPED
[INFO] Apache Karaf :: Management :: MBeans :: Web ....... SKIPPED
[INFO] Apache Karaf :: Web Console ....................... SKIPPED
[INFO] Apache Karaf :: Web Console :: Console ............ SKIPPED
[INFO] Apache Karaf :: Web Console :: Branding ........... SKIPPED
[INFO] Apache Karaf :: Web Console :: Features Plugin .... SKIPPED
[INFO] Apache Karaf :: Web Console :: Gogo Plugin ........ SKIPPED
[INFO] Apache Karaf :: Web Console :: HTTP Plugin ........ SKIPPED
[INFO] Apache Karaf :: Web Console :: Admin Plugin ....... SKIPPED
[INFO] Apache Karaf :: Exception ......................... SKIPPED
[INFO] Apache Karaf :: Scheduler ......................... SKIPPED
[INFO] Apache Karaf :: Scheduler :: Core ................. SKIPPED
[INFO] Apache Karaf :: Assemblies ........................ SKIPPED
[INFO] Apache Karaf :: Assemblies :: Features ............ SKIPPED
[INFO] Apache Karaf :: Tooling ........................... SKIPPED
[INFO] Apache Karaf :: Tooling :: Maven Karaf Plugin ..... SKIPPED
[INFO] Apache Karaf :: Assemblies :: Features :: Framework  SKIPPED
[INFO] Apache Karaf :: Diagnostic ........................ SKIPPED
[INFO] Apache Karaf :: Diagnostic :: Core ................ SKIPPED
[INFO] Apache Karaf :: Diagnostic :: Common .............. SKIPPED
[INFO] Apache Karaf :: Diagnostic :: Command ............. SKIPPED
[INFO] Apache Karaf :: Diagnostic :: Management .......... SKIPPED
[INFO] Apache Karaf :: Assemblies :: Features :: Standard  SKIPPED
[INFO] Apache Karaf :: Assemblies :: Features :: Enterprise  SKIPPED
[INFO] Apache Karaf :: Assemblies :: Minimal Distribution  SKIPPED
[INFO] Apache Karaf :: Assemblies :: Default Distribution  SKIPPED
[INFO] Apache Karaf :: Demos ............................. SKIPPED
[INFO] Apache Karaf :: Demos :: Web ...................... SKIPPED
[INFO] Apache Karaf :: Demos :: Branding ................. SKIPPED
[INFO] Apache Karaf :: Demos :: Branding :: Shell ........ SKIPPED
[INFO] Apache Karaf :: Demos :: Demo Dump provider ....... SKIPPED
[INFO] Apache Karaf :: Tooling :: Exam Testing Framework . SKIPPED
[INFO] Apache Karaf :: Tooling :: Exam Test Framework Options  SKIPPED
[INFO] Apache Karaf :: Tooling :: Exam Test Framework Container  SKIPPED
[INFO] Apache Karaf :: Integration Tests ................. SKIPPED
[INFO] Apache Karaf :: Integration Tests :: ITests ....... SKIPPED
[INFO] Apache Karaf :: Integration Tests :: Kit Tests .... SKIPPED
[INFO] Apache Karaf :: Tooling :: Exam Test Framework Regression Tests  SKIPPED
[INFO] Apache Karaf :: Archetypes ........................ SKIPPED
[INFO] Apache Karaf :: Archetypes :: Command Archetype ... SKIPPED
[INFO] Apache Karaf :: Archetypes :: Feature Archetype ... SKIPPED
[INFO] Apache Karaf :: Manual ............................ SKIPPED
[INFO] ------------------------------------------------------------------------
[INFO] BUILD FAILURE
[INFO] ------------------------------------------------------------------------
[INFO] Total time: 3:53.315s
[INFO] Finished at: Tue Nov 29 04:08:18 UTC 2011
[INFO] Final Memory: 49M/323M
[INFO] ------------------------------------------------------------------------
mavenExecutionResult exceptions not empty
message : Failed to execute goal org.apache.maven.plugins:maven-compiler-plugin:2.3.2:compile
(default-compile) on project org.apache.karaf.shell.console: Compilation failure
<https://builds.apache.org/job/Karaf/ws/karaf/shell/console/src/main/java/org/apache/karaf/shell/console/OsgiCommandSupport.java>:[58,28]
incompatible types
found   : java.lang.Object
required: T

cause : Compilation failure
<https://builds.apache.org/job/Karaf/ws/karaf/shell/console/src/main/java/org/apache/karaf/shell/console/OsgiCommandSupport.java>:[58,28]
incompatible types
found   : java.lang.Object
required: T

Stack trace : 
org.apache.maven.lifecycle.LifecycleExecutionException: Failed to execute goal org.apache.maven.plugins:maven-compiler-plugin:2.3.2:compile
(default-compile) on project org.apache.karaf.shell.console: Compilation failure
<https://builds.apache.org/job/Karaf/ws/karaf/shell/console/src/main/java/org/apache/karaf/shell/console/OsgiCommandSupport.java>:[58,28]
incompatible types
found   : java.lang.Object
required: T

	at org.apache.maven.lifecycle.internal.MojoExecutor.execute(MojoExecutor.java:213)
	at org.apache.maven.lifecycle.internal.MojoExecutor.execute(MojoExecutor.java:153)
	at org.apache.maven.lifecycle.internal.MojoExecutor.execute(MojoExecutor.java:145)
	at org.apache.maven.lifecycle.internal.LifecycleModuleBuilder.buildProject(LifecycleModuleBuilder.java:84)
	at org.apache.maven.lifecycle.internal.LifecycleModuleBuilder.buildProject(LifecycleModuleBuilder.java:59)
	at org.apache.maven.lifecycle.internal.LifecycleStarter.singleThreadedBuild(LifecycleStarter.java:183)
	at org.apache.maven.lifecycle.internal.LifecycleStarter.execute(LifecycleStarter.java:161)
	at org.apache.maven.DefaultMaven.doExecute(DefaultMaven.java:319)
	at org.apache.maven.DefaultMaven.execute(DefaultMaven.java:156)
	at org.jvnet.hudson.maven3.launcher.Maven3Launcher.main(Maven3Launcher.java:79)
	at sun.reflect.NativeMethodAccessorImpl.invoke0(Native Method)
	at sun.reflect.NativeMethodAccessorImpl.invoke(NativeMethodAccessorImpl.java:39)
	at sun.reflect.DelegatingMethodAccessorImpl.invoke(DelegatingMethodAccessorImpl.java:25)
	at java.lang.reflect.Method.invoke(Method.java:597)
	at org.codehaus.plexus.classworlds.launcher.Launcher.launchStandard(Launcher.java:329)
	at org.codehaus.plexus.classworlds.launcher.Launcher.launch(Launcher.java:239)
	at org.jvnet.hudson.maven3.agent.Maven3Main.launch(Maven3Main.java:158)
	at hudson.maven.Maven3Builder.call(Maven3Builder.java:122)
	at hudson.maven.Maven3Builder.call(Maven3Builder.java:74)
	at hudson.remoting.UserRequest.perform(UserRequest.java:118)
	at hudson.remoting.UserRequest.perform(UserRequest.java:48)
	at hudson.remoting.Request$2.run(Request.java:287)
	at java.util.concurrent.Executors$RunnableAdapter.call(Executors.java:441)
	at java.util.concurrent.FutureTask$Sync.innerRun(FutureTask.java:303)
	at java.util.concurrent.FutureTask.run(FutureTask.java:138)
	at java.util.concurrent.ThreadPoolExecutor$Worker.runTask(ThreadPoolExecutor.java:886)
	at java.util.concurrent.ThreadPoolExecutor$Worker.run(ThreadPoolExecutor.java:908)
	at java.lang.Thread.run(Thread.java:662)
Caused by: org.apache.maven.plugin.CompilationFailureException: Compilation failure
<https://builds.apache.org/job/Karaf/ws/karaf/shell/console/src/main/java/org/apache/karaf/shell/console/OsgiCommandSupport.java>:[58,28]
incompatible types
found   : java.lang.Object
required: T

	at org.apache.maven.plugin.AbstractCompilerMojo.execute(AbstractCompilerMojo.java:656)
	at org.apache.maven.plugin.CompilerMojo.execute(CompilerMojo.java:128)
	at org.apache.maven.plugin.DefaultBuildPluginManager.executeMojo(DefaultBuildPluginManager.java:101)
	at org.apache.maven.lifecycle.internal.MojoExecutor.execute(MojoExecutor.java:209)
	... 27 more
Sending e-mails to: commits@karaf.apache.org
channel stopped


Mime
View raw message