karaf-commits mailing list archives

Site index · List index
Message view « Date » · « Thread »
Top « Date » · « Thread »
From Apache Jenkins Server <jenk...@builds.apache.org>
Subject Build failed in Jenkins: Karaf #738
Date Thu, 24 Nov 2011 22:06:35 GMT
See <https://builds.apache.org/job/Karaf/738/changes>

Changes:

[iocanel] [KARAF-1035] Modified config commands to accept pid as an option, in order make
single command interactions possible.

------------------------------------------
[...truncated 5360 lines...]
Downloading: http://repo1.maven.org/maven2/org/springframework/spring-context/3.0.6.RELEASE/spring-context-3.0.6.RELEASE.jar
Downloading: http://repo1.maven.org/maven2/org/springframework/spring-aop/3.0.6.RELEASE/spring-aop-3.0.6.RELEASE.jar
Downloading: http://repo1.maven.org/maven2/aopalliance/aopalliance/1.0/aopalliance-1.0.jar
Downloading: http://repo1.maven.org/maven2/org/springframework/spring-beans/3.0.6.RELEASE/spring-beans-3.0.6.RELEASE.jar
Downloading: http://repo1.maven.org/maven2/org/springframework/spring-core/3.0.6.RELEASE/spring-core-3.0.6.RELEASE.jar
Downloaded: http://repo1.maven.org/maven2/aopalliance/aopalliance/1.0/aopalliance-1.0.jar
(5 KB at 3.4 KB/sec)
Downloading: http://repo1.maven.org/maven2/org/springframework/spring-expression/3.0.6.RELEASE/spring-expression-3.0.6.RELEASE.jar
Downloaded: http://repo1.maven.org/maven2/org/springframework/spring-context/3.0.6.RELEASE/spring-context-3.0.6.RELEASE.jar
(655 KB at 416.6 KB/sec)
Downloading: http://repo1.maven.org/maven2/org/springframework/spring-asm/3.0.6.RELEASE/spring-asm-3.0.6.RELEASE.jar
Downloaded: http://repo1.maven.org/maven2/org/springframework/spring-aop/3.0.6.RELEASE/spring-aop-3.0.6.RELEASE.jar
(314 KB at 174.1 KB/sec)
Downloading: http://repo1.maven.org/maven2/org/springframework/osgi/spring-osgi-extender/1.2.1/spring-osgi-extender-1.2.1.jar
Downloaded: http://repo1.maven.org/maven2/org/springframework/spring-core/3.0.6.RELEASE/spring-core-3.0.6.RELEASE.jar
(374 KB at 182.1 KB/sec)
Downloaded: http://repo1.maven.org/maven2/org/springframework/spring-beans/3.0.6.RELEASE/spring-beans-3.0.6.RELEASE.jar
(544 KB at 193.2 KB/sec)
Downloaded: http://repo1.maven.org/maven2/org/springframework/spring-expression/3.0.6.RELEASE/spring-expression-3.0.6.RELEASE.jar
(166 KB at 82.9 KB/sec)
Downloaded: http://repo1.maven.org/maven2/org/springframework/spring-asm/3.0.6.RELEASE/spring-asm-3.0.6.RELEASE.jar
(52 KB at 26.2 KB/sec)
Downloaded: http://repo1.maven.org/maven2/org/springframework/osgi/spring-osgi-extender/1.2.1/spring-osgi-extender-1.2.1.jar
(118 KB at 59.0 KB/sec)
[INFO] 
[INFO] --- maven-clean-plugin:2.4.1:clean (default-clean) @ org.apache.karaf.shell.bundles
---
[INFO] 
[INFO] --- maven-enforcer-plugin:1.0.1:enforce (enforce-maven) @ org.apache.karaf.shell.bundles
---
[INFO] 
[INFO] --- maven-bundle-plugin:2.3.5:cleanVersions (cleanVersions) @ org.apache.karaf.shell.bundles
---
[INFO] 
[INFO] --- maven-remote-resources-plugin:1.2.1:process (default) @ org.apache.karaf.shell.bundles
---
[debug] execute contextualize
[INFO] [INFO] Using 'UTF-8' encoding to copy filtered resources.
[INFO] Copying 2 resources

[INFO] --- maven-resources-plugin:2.5:resources (default-resources) @ org.apache.karaf.shell.bundles
---
[INFO] Copying 1 resource
[INFO] Copying 3 resources
[INFO] 
[INFO] --- maven-compiler-plugin:2.3.2:compile (default-compile) @ org.apache.karaf.shell.bundles
---
[INFO] Compiling 23 source files to <https://builds.apache.org/job/Karaf/ws/karaf/shell/bundles/target/classes>
[debug] execute contextualize
[INFO] [INFO] Using 'UTF-8' encoding to copy filtered resources.
[INFO] skip non existing resourceDirectory <https://builds.apache.org/job/Karaf/ws/karaf/shell/bundles/src/test/resources>
[INFO] Copying 3 resources

[INFO] --- maven-resources-plugin:2.5:testResources (default-testResources) @ org.apache.karaf.shell.bundles
---
[INFO] 
[INFO] --- maven-compiler-plugin:2.3.2:testCompile (default-testCompile) @ org.apache.karaf.shell.bundles
---[INFO] Compiling 1 source file to <https://builds.apache.org/job/Karaf/ws/karaf/shell/bundles/target/test-classes>

[INFO] [INFO] Surefire report directory: <https://builds.apache.org/job/Karaf/ws/karaf/shell/bundles/target/surefire-reports>

[INFO] 
-------------------------------------------------------
--- maven-surefire-plugin:2.9:test (default-test) @ org.apache.karaf.shell.bundles ---
 T E S T S
-------------------------------------------------------
Running org.apache.karaf.shell.bundles.wikidoc.WikiParserTest
Tests run: 2, Failures: 0, Errors: 0, Skipped: 0, Time elapsed: 0.054 sec

Results :

Tests run: 2, Failures: 0, Errors: 0, Skipped: 0

[JENKINS] Recording test results
[INFO] 
[INFO] --- maven-bundle-plugin:2.3.5:bundle (default-bundle) @ org.apache.karaf.shell.bundles
---
[WARNING] Bundle org.apache.karaf.shell:org.apache.karaf.shell.bundles:bundle:3.0.0-SNAPSHOT
: Did not find matching referal for !org.apache.karaf.shell.bundles*
[INFO] Installing <https://builds.apache.org/job/Karaf/ws/karaf/shell/bundles/target/org.apache.karaf.shell.bundles-3.0.0-SNAPSHOT.jar>
to <https://builds.apache.org/job/Karaf/ws/.repository/org/apache/karaf/shell/org.apache.karaf.shell.bundles/3.0.0-SNAPSHOT/org.apache.karaf.shell.bundles-3.0.0-SNAPSHOT.jar>
[INFO] [INFO] Installing <https://builds.apache.org/job/Karaf/ws/karaf/shell/bundles/pom.xml>
to <https://builds.apache.org/job/Karaf/ws/.repository/org/apache/karaf/shell/org.apache.karaf.shell.bundles/3.0.0-SNAPSHOT/org.apache.karaf.shell.bundles-3.0.0-SNAPSHOT.pom>

[INFO] --- maven-install-plugin:2.3.1:install (default-install) @ org.apache.karaf.shell.bundles
---
[INFO] 
[INFO] --- maven-bundle-plugin:2.3.5:install (default-install) @ org.apache.karaf.shell.bundles
---
[INFO] Installing org/apache/karaf/shell/org.apache.karaf.shell.bundles/3.0.0-SNAPSHOT/org.apache.karaf.shell.bundles-3.0.0-SNAPSHOT.jar
[INFO] Writing OBR metadata
[JENKINS] Archiving <https://builds.apache.org/job/Karaf/ws/karaf/shell/bundles/pom.xml>
to /home/hudson/hudson/jobs/Karaf/modules/org.apache.karaf.shell$org.apache.karaf.shell.bundles/builds/2011-11-24_22-01-21/archive/org.apache.karaf.shell/org.apache.karaf.shell.bundles/3.0.0-SNAPSHOT/org.apache.karaf.shell.bundles-3.0.0-SNAPSHOT.pom
[JENKINS] Archiving <https://builds.apache.org/job/Karaf/ws/karaf/shell/bundles/target/org.apache.karaf.shell.bundles-3.0.0-SNAPSHOT.jar>
to /home/hudson/hudson/jobs/Karaf/modules/org.apache.karaf.shell$org.apache.karaf.shell.bundles/builds/2011-11-24_22-01-21/archive/org.apache.karaf.shell/org.apache.karaf.shell.bundles/3.0.0-SNAPSHOT/org.apache.karaf.shell.bundles-3.0.0-SNAPSHOT-.jar
[INFO]                                                                         
[INFO] ------------------------------------------------------------------------
[INFO] Building Apache Karaf :: Shell :: ConfigAdmin Commands 3.0.0-SNAPSHOT
[INFO] ------------------------------------------------------------------------
[INFO] 
[INFO] --- maven-clean-plugin:2.4.1:clean (default-clean) @ org.apache.karaf.shell.config
---
[INFO] 
[INFO] --- maven-enforcer-plugin:1.0.1:enforce (enforce-maven) @ org.apache.karaf.shell.config
---
[INFO] 
[INFO] --- maven-bundle-plugin:2.3.5:cleanVersions (cleanVersions) @ org.apache.karaf.shell.config
---
[INFO] 
[INFO] --- maven-remote-resources-plugin:1.2.1:process (default) @ org.apache.karaf.shell.config
---
[INFO] [debug] execute contextualize
[INFO] Using 'UTF-8' encoding to copy filtered resources.

[INFO] --- maven-resources-plugin:2.5:resources (default-resources) @ org.apache.karaf.shell.config
---
[INFO] Copying 5 resources
[INFO] Copying 1 resource
[INFO] Copying 3 resources
[INFO] [INFO] Compiling 13 source files to <https://builds.apache.org/job/Karaf/ws/karaf/shell/config/target/classes>

[INFO] --- maven-compiler-plugin:2.3.2:compile (default-compile) @ org.apache.karaf.shell.config
---
[INFO] -------------------------------------------------------------
[ERROR] COMPILATION ERROR : 
[INFO] -------------------------------------------------------------
[ERROR] <https://builds.apache.org/job/Karaf/ws/karaf/shell/config/src/main/java/org/apache/karaf/shell/config/ConfigPropertyCommandSupport.java>:[4,37]
package org.apache.felix.gogo.commands does not exist
[ERROR] <https://builds.apache.org/job/Karaf/ws/karaf/shell/config/src/main/java/org/apache/karaf/shell/config/ConfigPropertyCommandSupport.java>:[13,5]
cannot find symbol
symbol  : class Option
location: class org.apache.karaf.shell.config.ConfigPropertyCommandSupport
[ERROR] <https://builds.apache.org/job/Karaf/ws/karaf/shell/config/src/main/java/org/apache/karaf/shell/config/ConfigPropertyCommandSupport.java>:[16,5]
cannot find symbol
symbol  : class Option
location: class org.apache.karaf.shell.config.ConfigPropertyCommandSupport
[INFO] 3 errors 
[INFO] -------------------------------------------------------------
[JENKINS] Archiving <https://builds.apache.org/job/Karaf/ws/karaf/shell/config/pom.xml>
to /home/hudson/hudson/jobs/Karaf/modules/org.apache.karaf.shell$org.apache.karaf.shell.config/builds/2011-11-24_22-01-21/archive/org.apache.karaf.shell/org.apache.karaf.shell.config/3.0.0-SNAPSHOT/org.apache.karaf.shell.config-3.0.0-SNAPSHOT.pom
[INFO] ------------------------------------------------------------------------
[INFO] Reactor Summary:
[INFO] 
[INFO] Apache Karaf ...................................... SUCCESS [1:22.945s]
[INFO] Apache Karaf :: JAAS .............................. SUCCESS [0.355s]
[INFO] Apache Karaf :: JAAS :: Boot ...................... SUCCESS [17.897s]
[INFO] Apache Karaf :: JAAS :: Config .................... SUCCESS [10.656s]
[INFO] Apache Karaf :: JAAS :: Modules ................... SUCCESS [11.287s]
[INFO] Apache Karaf :: Shell ............................. SUCCESS [0.244s]
[INFO] Apache Karaf :: Shell :: Console .................. SUCCESS [12.329s]
[INFO] Apache Karaf :: Util .............................. SUCCESS [9.802s]
[INFO] Apache Karaf :: Main .............................. SUCCESS [43.910s]
[INFO] Apache Karaf :: Features .......................... SUCCESS [0.252s]
[INFO] Apache Karaf :: Features :: Core .................. SUCCESS [9.741s]
[INFO] Apache Karaf :: Features :: Command ............... SUCCESS [1.375s]
[INFO] Apache Karaf :: Features :: Management ............ SUCCESS [1.782s]
[INFO] Apache Karaf :: Features :: OBR Resolver .......... SUCCESS [3.273s]
[INFO] Apache Karaf :: Admin ............................. SUCCESS [0.316s]
[INFO] Apache Karaf :: Admin :: Core ..................... SUCCESS [4.325s]
[INFO] Apache Karaf :: Admin :: Command .................. SUCCESS [7.622s]
[INFO] Apache Karaf :: Admin :: Management ............... SUCCESS [3.055s]
[INFO] Apache Karaf :: Deployer .......................... SUCCESS [0.135s]
[INFO] Apache Karaf :: Deployer :: Spring ................ SUCCESS [3.293s]
[INFO] Apache Karaf :: Deployer :: Blueprint ............. SUCCESS [1.655s]
[INFO] Apache Karaf :: Deployer :: Features .............. SUCCESS [1.311s]
[INFO] Apache Karaf :: Deployer :: Karaf Archive (.kar) .. SUCCESS [1.587s]
[INFO] Apache Karaf :: Deployer :: Wrap Non OSGi Jar ..... SUCCESS [1.147s]
[INFO] Apache Karaf :: Shell :: Various Commands ......... SUCCESS [2.087s]
[INFO] Apache Karaf :: Shell :: Bundles Commands ......... SUCCESS [13.116s]
[INFO] Apache Karaf :: Shell :: ConfigAdmin Commands ..... FAILURE [1.251s]
[INFO] Apache Karaf :: Shell :: Development Commands ..... SKIPPED
[INFO] Apache Karaf :: Shell :: Http Commands ............ SKIPPED
[INFO] Apache Karaf :: Shell :: Log Commands ............. SKIPPED
[INFO] Apache Karaf :: Shell :: OBR Commands ............. SKIPPED
[INFO] Apache Karaf :: Shell :: PackageAdmin Commands .... SKIPPED
[INFO] Apache Karaf :: Shell :: Services Commands ........ SKIPPED
[INFO] Apache Karaf :: Shell :: SSH ...................... SKIPPED
[INFO] Apache Karaf :: Shell :: System Commands .......... SKIPPED
[INFO] Apache Karaf :: Shell :: Web Commands ............. SKIPPED
[INFO] Apache Karaf :: Shell :: Service Wrapper .......... SKIPPED
[INFO] Apache Karaf :: JAAS :: Jasypt Encryption ......... SKIPPED
[INFO] Apache Karaf :: Jaas :: Command ................... SKIPPED
[INFO] Apache Karaf :: Client ............................ SKIPPED
[INFO] Apache Karaf :: Management ........................ SKIPPED
[INFO] Apache Karaf :: Management ........................ SKIPPED
[INFO] Apache Karaf :: Management :: MBeans .............. SKIPPED
[INFO] Apache Karaf :: Management :: MBeans :: Bundles ... SKIPPED
[INFO] Apache Karaf :: Management :: MBeans :: Services .. SKIPPED
[INFO] Apache Karaf :: Management :: MBeans :: System .... SKIPPED
[INFO] Apache Karaf :: Management :: MBeans :: Packages .. SKIPPED
[INFO] Apache Karaf :: Management :: MBeans :: Config .... SKIPPED
[INFO] Apache Karaf :: Management :: MBeans :: Dev ....... SKIPPED
[INFO] Apache Karaf :: Management :: MBeans :: HTTP ...... SKIPPED
[INFO] Apache Karaf :: Management :: MBeans :: Log ....... SKIPPED
[INFO] Apache Karaf :: Management :: MBeans :: OBR ....... SKIPPED
[INFO] Apache Karaf :: Management :: MBeans :: Web ....... SKIPPED
[INFO] Apache Karaf :: Web Console ....................... SKIPPED
[INFO] Apache Karaf :: Web Console :: Console ............ SKIPPED
[INFO] Apache Karaf :: Web Console :: Branding ........... SKIPPED
[INFO] Apache Karaf :: Web Console :: Features Plugin .... SKIPPED
[INFO] Apache Karaf :: Web Console :: Gogo Plugin ........ SKIPPED
[INFO] Apache Karaf :: Web Console :: HTTP Plugin ........ SKIPPED
[INFO] Apache Karaf :: Web Console :: Admin Plugin ....... SKIPPED
[INFO] Apache Karaf :: Exception ......................... SKIPPED
[INFO] Apache Karaf :: Scheduler ......................... SKIPPED
[INFO] Apache Karaf :: Scheduler :: Core ................. SKIPPED
[INFO] Apache Karaf :: Assemblies ........................ SKIPPED
[INFO] Apache Karaf :: Assemblies :: Features ............ SKIPPED
[INFO] Apache Karaf :: Tooling ........................... SKIPPED
[INFO] Apache Karaf :: Tooling :: Maven Karaf Plugin ..... SKIPPED
[INFO] Apache Karaf :: Assemblies :: Features :: Framework  SKIPPED
[INFO] Apache Karaf :: Diagnostic ........................ SKIPPED
[INFO] Apache Karaf :: Diagnostic :: Core ................ SKIPPED
[INFO] Apache Karaf :: Diagnostic :: Common .............. SKIPPED
[INFO] Apache Karaf :: Diagnostic :: Command ............. SKIPPED
[INFO] Apache Karaf :: Diagnostic :: Management .......... SKIPPED
[INFO] Apache Karaf :: Assemblies :: Features :: Standard  SKIPPED
[INFO] Apache Karaf :: Assemblies :: Features :: Enterprise  SKIPPED
[INFO] Apache Karaf :: Assemblies :: Minimal Distribution  SKIPPED
[INFO] Apache Karaf :: Assemblies :: Default Distribution  SKIPPED
[INFO] Apache Karaf :: Demos ............................. SKIPPED
[INFO] Apache Karaf :: Demos :: Web ...................... SKIPPED
[INFO] Apache Karaf :: Demos :: Branding ................. SKIPPED
[INFO] Apache Karaf :: Demos :: Branding :: Shell ........ SKIPPED
[INFO] Apache Karaf :: Demos :: Demo Dump provider ....... SKIPPED
[INFO] Apache Karaf :: Integration Tests ................. SKIPPED
[INFO] Apache Karaf :: Integration Tests :: Dependencies . SKIPPED
[INFO] Apache Karaf :: Tooling :: Testing Environment .... SKIPPED
[INFO] Apache Karaf :: Integration Tests :: ITests ....... SKIPPED
[INFO] Apache Karaf :: Integration Tests :: Kit Tests .... SKIPPED
[INFO] Apache Karaf :: Archetypes ........................ SKIPPED
[INFO] Apache Karaf :: Archetypes :: Command Archetype ... SKIPPED
[INFO] Apache Karaf :: Archetypes :: Feature Archetype ... SKIPPED
[INFO] Apache Karaf :: Manual ............................ SKIPPED
[INFO] ------------------------------------------------------------------------
[INFO] BUILD FAILURE
[INFO] ------------------------------------------------------------------------
[INFO] Total time: 5:08.856s
[INFO] Finished at: Thu Nov 24 22:06:33 UTC 2011
[INFO] Final Memory: 79M/334M
[INFO] ------------------------------------------------------------------------
Waiting for Jenkins to finish collecting data
mavenExecutionResult exceptions not empty
message : Failed to execute goal org.apache.maven.plugins:maven-compiler-plugin:2.3.2:compile
(default-compile) on project org.apache.karaf.shell.config: Compilation failure
cause : Compilation failure
Stack trace : 
org.apache.maven.lifecycle.LifecycleExecutionException: Failed to execute goal org.apache.maven.plugins:maven-compiler-plugin:2.3.2:compile
(default-compile) on project org.apache.karaf.shell.config: Compilation failure
	at org.apache.maven.lifecycle.internal.MojoExecutor.execute(MojoExecutor.java:213)
	at org.apache.maven.lifecycle.internal.MojoExecutor.execute(MojoExecutor.java:153)
	at org.apache.maven.lifecycle.internal.MojoExecutor.execute(MojoExecutor.java:145)
	at org.apache.maven.lifecycle.internal.LifecycleModuleBuilder.buildProject(LifecycleModuleBuilder.java:84)
	at org.apache.maven.lifecycle.internal.LifecycleModuleBuilder.buildProject(LifecycleModuleBuilder.java:59)
	at org.apache.maven.lifecycle.internal.LifecycleStarter.singleThreadedBuild(LifecycleStarter.java:183)
	at org.apache.maven.lifecycle.internal.LifecycleStarter.execute(LifecycleStarter.java:161)
	at org.apache.maven.DefaultMaven.doExecute(DefaultMaven.java:319)
	at org.apache.maven.DefaultMaven.execute(DefaultMaven.java:156)
	at org.jvnet.hudson.maven3.launcher.Maven3Launcher.main(Maven3Launcher.java:79)
	at sun.reflect.NativeMethodAccessorImpl.invoke0(Native Method)
	at sun.reflect.NativeMethodAccessorImpl.invoke(NativeMethodAccessorImpl.java:39)
	at sun.reflect.DelegatingMethodAccessorImpl.invoke(DelegatingMethodAccessorImpl.java:25)
	at java.lang.reflect.Method.invoke(Method.java:597)
	at org.codehaus.plexus.classworlds.launcher.Launcher.launchStandard(Launcher.java:329)
	at org.codehaus.plexus.classworlds.launcher.Launcher.launch(Launcher.java:239)
	at org.jvnet.hudson.maven3.agent.Maven3Main.launch(Maven3Main.java:158)
	at hudson.maven.Maven3Builder.call(Maven3Builder.java:122)
	at hudson.maven.Maven3Builder.call(Maven3Builder.java:74)
	at hudson.remoting.UserRequest.perform(UserRequest.java:118)
	at hudson.remoting.UserRequest.perform(UserRequest.java:48)
	at hudson.remoting.Request$2.run(Request.java:287)
	at java.util.concurrent.Executors$RunnableAdapter.call(Executors.java:441)
	at java.util.concurrent.FutureTask$Sync.innerRun(FutureTask.java:303)
	at java.util.concurrent.FutureTask.run(FutureTask.java:138)
	at java.util.concurrent.ThreadPoolExecutor$Worker.runTask(ThreadPoolExecutor.java:886)
	at java.util.concurrent.ThreadPoolExecutor$Worker.run(ThreadPoolExecutor.java:908)
	at java.lang.Thread.run(Thread.java:662)
Caused by: org.apache.maven.plugin.CompilationFailureException: Compilation failure
	at org.apache.maven.plugin.AbstractCompilerMojo.execute(AbstractCompilerMojo.java:656)
	at org.apache.maven.plugin.CompilerMojo.execute(CompilerMojo.java:128)
	at org.apache.maven.plugin.DefaultBuildPluginManager.executeMojo(DefaultBuildPluginManager.java:101)
	at org.apache.maven.lifecycle.internal.MojoExecutor.execute(MojoExecutor.java:209)
	... 27 more
Sending e-mails to: commits@karaf.apache.org
channel stopped


Mime
View raw message