karaf-commits mailing list archives

Site index · List index
Message view « Date » · « Thread »
Top « Date » · « Thread »
From Apache Jenkins Server <jenk...@builds.apache.org>
Subject Build failed in Jenkins: Karaf #667
Date Sun, 09 Oct 2011 20:09:23 GMT
See <https://builds.apache.org/job/Karaf/667/changes>

Changes:

[jbonofre] [KARAF-919] Kar uninstall now deletes the timestamp file

------------------------------------------
[...truncated 5446 lines...]

[INFO] --- maven-resources-plugin:2.5:testResources (default-testResources) @ org.apache.karaf.shell.dev
---
[INFO] [INFO] Compiling 5 source files to <https://builds.apache.org/job/Karaf/ws/karaf/shell/dev/target/test-classes>

[INFO] --- maven-compiler-plugin:2.3.2:testCompile (default-testCompile) @ org.apache.karaf.shell.dev
---
[INFO] Surefire report directory: <https://builds.apache.org/job/Karaf/ws/karaf/shell/dev/target/surefire-reports>
[INFO] 
-------------------------------------------------------
 T E S T S
-------------------------------------------------------

[INFO] --- maven-surefire-plugin:2.9:test (default-test) @ org.apache.karaf.shell.dev ---
Running org.apache.karaf.shell.dev.framework.FelixTest
- set felix.log.level=4 in etc/config.properties

Restart Karaf now to enable Felix debug logging
- removed felix.log.level from etc/config.properties

Restart Karaf now to disable Felix debug logging
Tests run: 2, Failures: 0, Errors: 0, Skipped: 0, Time elapsed: 0.149 sec
Running org.apache.karaf.shell.dev.framework.EquinoxTest
- set bundles.debug=etc/equinox-debug.properties in etc/config.properties
- created etc/equinox-debug.properties to configure Equinox debugging options

Enable specific debug options in etc/equinox-debug.properties
and restart Karaf now to enable Equinox debug logging
- removed bundles.debug from etc/config.properties

Restart Karaf now to disable Equinox debug logging
Tests run: 2, Failures: 0, Errors: 0, Skipped: 0, Time elapsed: 0.053 sec
Running org.apache.karaf.shell.dev.util.BundlesTest
Tests run: 1, Failures: 0, Errors: 0, Skipped: 0, Time elapsed: 0.002 sec
Running org.apache.karaf.shell.dev.util.ImportTest
Tests run: 5, Failures: 0, Errors: 0, Skipped: 0, Time elapsed: 0.005 sec
Running org.apache.karaf.shell.dev.util.TreeTest
Tests run: 6, Failures: 0, Errors: 0, Skipped: 0, Time elapsed: 0.006 sec

Results :

Tests run: 16, Failures: 0, Errors: 0, Skipped: 0

[JENKINS] Recording test results
[INFO] 
[INFO] --- maven-bundle-plugin:2.3.5:bundle (default-bundle) @ org.apache.karaf.shell.dev
---
[WARNING] Bundle org.apache.karaf.shell:org.apache.karaf.shell.dev:bundle:3.0.0-SNAPSHOT :
Split package org/apache/felix/utils/properties
Use directive -split-package:=(merge-first|merge-last|error|first) on Export/Private Package
instruction to get rid of this warning
Package found in   [Jar:org.apache.karaf.jaas.modules, Jar:org.apache.felix.utils]
Reference from     <https://builds.apache.org/job/Karaf/ws/.repository/org/apache/felix/org.apache.felix.utils/1.1.0/org.apache.felix.utils-1.1.0.jar>
Classpath          [Jar:., Jar:org.apache.karaf.shell.console, Jar:org.apache.karaf.jaas.modules,
Jar:org.apache.karaf.jaas.config, Jar:org.apache.aries.blueprint, Jar:org.apache.aries.util,
Jar:pax-url-wrap, Jar:pax-url-aether, Jar:org.osgi.core, Jar:org.osgi.compendium, Jar:slf4j-api,
Jar:org.apache.felix.utils]
[WARNING] Bundle org.apache.karaf.shell:org.apache.karaf.shell.dev:bundle:3.0.0-SNAPSHOT :
Did not find matching referal for !com.sun.jdmk.comm
[WARNING] Bundle org.apache.karaf.shell:org.apache.karaf.shell.dev:bundle:3.0.0-SNAPSHOT :
Did not find matching referal for !org.apache.karaf.shell.dev.*
[INFO] [INFO] Installing <https://builds.apache.org/job/Karaf/ws/karaf/shell/dev/target/org.apache.karaf.shell.dev-3.0.0-SNAPSHOT.jar>
to <https://builds.apache.org/job/Karaf/ws/.repository/org/apache/karaf/shell/org.apache.karaf.shell.dev/3.0.0-SNAPSHOT/org.apache.karaf.shell.dev-3.0.0-SNAPSHOT.jar>
[INFO] Installing <https://builds.apache.org/job/Karaf/ws/karaf/shell/dev/pom.xml> to
<https://builds.apache.org/job/Karaf/ws/.repository/org/apache/karaf/shell/org.apache.karaf.shell.dev/3.0.0-SNAPSHOT/org.apache.karaf.shell.dev-3.0.0-SNAPSHOT.pom>

[INFO] --- maven-install-plugin:2.3.1:install (default-install) @ org.apache.karaf.shell.dev
---
[INFO] [INFO] Installing org/apache/karaf/shell/org.apache.karaf.shell.dev/3.0.0-SNAPSHOT/org.apache.karaf.shell.dev-3.0.0-SNAPSHOT.jar
[INFO] Writing OBR metadata

[INFO] --- maven-bundle-plugin:2.3.5:install (default-install) @ org.apache.karaf.shell.dev
---
[JENKINS] Archiving <https://builds.apache.org/job/Karaf/ws/karaf/shell/dev/pom.xml>
to /home/hudson/hudson/jobs/Karaf/modules/org.apache.karaf.shell$org.apache.karaf.shell.dev/builds/2011-10-09_20-02-31/archive/org.apache.karaf.shell/org.apache.karaf.shell.dev/3.0.0-SNAPSHOT/org.apache.karaf.shell.dev-3.0.0-SNAPSHOT.pom
[JENKINS] Archiving <https://builds.apache.org/job/Karaf/ws/karaf/shell/dev/target/org.apache.karaf.shell.dev-3.0.0-SNAPSHOT.jar>
to /home/hudson/hudson/jobs/Karaf/modules/org.apache.karaf.shell$org.apache.karaf.shell.dev/builds/2011-10-09_20-02-31/archive/org.apache.karaf.shell/org.apache.karaf.shell.dev/3.0.0-SNAPSHOT/org.apache.karaf.shell.dev-3.0.0-SNAPSHOT-.jar
[INFO] Downloading: https://oss.sonatype.org/content/repositories/ops4j-snapshots/org/ops4j/pax/web/pax-web-spi/1.1.2-SNAPSHOT/maven-metadata.xml
Downloading: http://repository.sonatype.org/content/groups/sonatype-public-grid/org/ops4j/pax/web/pax-web-spi/1.1.2-SNAPSHOT/maven-metadata.xml
                                                                        
[INFO] Downloading: http://repo.fusesource.com/nexus/content/repositories/snapshots/org/ops4j/pax/web/pax-web-spi/1.1.2-SNAPSHOT/maven-metadata.xml
Downloading: http://repository.apache.org/content/groups/snapshots-group/org/ops4j/pax/web/pax-web-spi/1.1.2-SNAPSHOT/maven-metadata.xml
------------------------------------------------------------------------
[INFO] Building Apache Karaf :: Shell :: Http Commands 3.0.0-SNAPSHOT
[INFO] ------------------------------------------------------------------------
Downloading: http://repository.apache.org/snapshots/org/ops4j/pax/web/pax-web-spi/1.1.2-SNAPSHOT/maven-metadata.xml
Downloading: http://repository.apache.org/content/groups/snapshots-group/org/ops4j/pax/web/pax-web-spi/1.1.2-SNAPSHOT/pax-web-spi-1.1.2-SNAPSHOT.pom
Downloading: http://repository.sonatype.org/content/groups/sonatype-public-grid/org/ops4j/pax/web/pax-web-spi/1.1.2-SNAPSHOT/pax-web-spi-1.1.2-SNAPSHOT.pom
Downloading: http://repo.fusesource.com/nexus/content/repositories/snapshots/org/ops4j/pax/web/pax-web-spi/1.1.2-SNAPSHOT/pax-web-spi-1.1.2-SNAPSHOT.pom
Downloading: https://oss.sonatype.org/content/repositories/ops4j-snapshots/org/ops4j/pax/web/pax-web-spi/1.1.2-SNAPSHOT/pax-web-spi-1.1.2-SNAPSHOT.pom
Downloading: http://repository.apache.org/snapshots/org/ops4j/pax/web/pax-web-spi/1.1.2-SNAPSHOT/pax-web-spi-1.1.2-SNAPSHOT.pom
[WARNING] The POM for org.ops4j.pax.web:pax-web-spi:jar:1.1.2-SNAPSHOT is missing, no dependency
information available
Downloading: http://svn.apache.org/repos/asf/servicemix/m2-repo/javax/servlet/servlet-api/2.5/servlet-api-2.5.pom
Downloading: http://repo1.maven.org/maven2/javax/servlet/servlet-api/2.5/servlet-api-2.5.pom
Downloaded: http://repo1.maven.org/maven2/javax/servlet/servlet-api/2.5/servlet-api-2.5.pom
(157 B at 0.4 KB/sec)
Downloading: http://repository.apache.org/content/groups/snapshots-group/org/ops4j/pax/web/pax-web-spi/1.1.2-SNAPSHOT/pax-web-spi-1.1.2-SNAPSHOT.jar
Downloading: http://repository.sonatype.org/content/groups/sonatype-public-grid/org/ops4j/pax/web/pax-web-spi/1.1.2-SNAPSHOT/pax-web-spi-1.1.2-SNAPSHOT.jar
Downloading: http://repo.fusesource.com/nexus/content/repositories/snapshots/org/ops4j/pax/web/pax-web-spi/1.1.2-SNAPSHOT/pax-web-spi-1.1.2-SNAPSHOT.jar
Downloading: https://oss.sonatype.org/content/repositories/ops4j-snapshots/org/ops4j/pax/web/pax-web-spi/1.1.2-SNAPSHOT/pax-web-spi-1.1.2-SNAPSHOT.jar
Downloading: http://repository.apache.org/snapshots/org/ops4j/pax/web/pax-web-spi/1.1.2-SNAPSHOT/pax-web-spi-1.1.2-SNAPSHOT.jar
Downloading: http://svn.apache.org/repos/asf/servicemix/m2-repo/javax/servlet/servlet-api/2.5/servlet-api-2.5.jar
Downloading: http://repo1.maven.org/maven2/javax/servlet/servlet-api/2.5/servlet-api-2.5.jar
Downloaded: http://repo1.maven.org/maven2/javax/servlet/servlet-api/2.5/servlet-api-2.5.jar
(103 KB at 189.7 KB/sec)
[JENKINS] Archiving <https://builds.apache.org/job/Karaf/ws/karaf/shell/http/pom.xml>
to /home/hudson/hudson/jobs/Karaf/modules/org.apache.karaf.shell$org.apache.karaf.shell.http/builds/2011-10-09_20-02-31/archive/org.apache.karaf.shell/org.apache.karaf.shell.http/3.0.0-SNAPSHOT/org.apache.karaf.shell.http-3.0.0-SNAPSHOT.pom
[INFO] ------------------------------------------------------------------------
[INFO] Reactor Summary:
[INFO] 
[INFO] Apache Karaf ...................................... SUCCESS [1:25.021s]
[INFO] Apache Karaf :: JAAS .............................. SUCCESS [0.698s]
[INFO] Apache Karaf :: JAAS :: Boot ...................... SUCCESS [19.341s]
[INFO] Apache Karaf :: JAAS :: Config .................... SUCCESS [10.552s]
[INFO] Apache Karaf :: JAAS :: Modules ................... SUCCESS [32.536s]
[INFO] Apache Karaf :: Shell ............................. SUCCESS [0.566s]
[INFO] Apache Karaf :: Shell :: Console .................. SUCCESS [13.684s]
[INFO] Apache Karaf :: Util .............................. SUCCESS [11.962s]
[INFO] Apache Karaf :: Main .............................. SUCCESS [31.670s]
[INFO] Apache Karaf :: Features .......................... SUCCESS [0.646s]
[INFO] Apache Karaf :: Features :: Core .................. SUCCESS [10.902s]
[INFO] Apache Karaf :: Features :: Command ............... SUCCESS [2.157s]
[INFO] Apache Karaf :: Features :: Management ............ SUCCESS [3.566s]
[INFO] Apache Karaf :: Features :: OBR Resolver .......... SUCCESS [4.051s]
[INFO] Apache Karaf :: Admin ............................. SUCCESS [0.678s]
[INFO] Apache Karaf :: Admin :: Core ..................... SUCCESS [6.620s]
[INFO] Apache Karaf :: Admin :: Command .................. SUCCESS [5.693s]
[INFO] Apache Karaf :: Admin :: Management ............... SUCCESS [4.869s]
[INFO] Apache Karaf :: Deployer .......................... SUCCESS [0.662s]
[INFO] Apache Karaf :: Deployer :: Spring ................ SUCCESS [4.582s]
[INFO] Apache Karaf :: Deployer :: Blueprint ............. SUCCESS [2.717s]
[INFO] Apache Karaf :: Deployer :: Features .............. SUCCESS [1.954s]
[INFO] Apache Karaf :: Deployer :: Karaf Archive (.kar) .. SUCCESS [2.951s]
[INFO] Apache Karaf :: Deployer :: Wrap Non OSGi Jar ..... SUCCESS [2.610s]
[INFO] Apache Karaf :: Shell :: Various Commands ......... SUCCESS [3.254s]
[INFO] Apache Karaf :: Shell :: Bundles Commands ......... SUCCESS [12.047s]
[INFO] Apache Karaf :: Shell :: ConfigAdmin Commands ..... SUCCESS [2.974s]
[INFO] Apache Karaf :: Shell :: Development Commands ..... SUCCESS [11.284s]
[INFO] Apache Karaf :: Shell :: Http Commands ............ FAILURE [7.174s]
[INFO] Apache Karaf :: Shell :: Log Commands ............. SKIPPED
[INFO] Apache Karaf :: Shell :: OBR Commands ............. SKIPPED
[INFO] Apache Karaf :: Shell :: PackageAdmin Commands .... SKIPPED
[INFO] Apache Karaf :: Shell :: Services Commands ........ SKIPPED
[INFO] Apache Karaf :: Shell :: SSH ...................... SKIPPED
[INFO] Apache Karaf :: Shell :: System Commands .......... SKIPPED
[INFO] Apache Karaf :: Shell :: Web Commands ............. SKIPPED
[INFO] Apache Karaf :: Shell :: Service Wrapper .......... SKIPPED
[INFO] Apache Karaf :: JAAS :: Jasypt Encryption ......... SKIPPED
[INFO] Apache Karaf :: Jaas :: Command ................... SKIPPED
[INFO] Apache Karaf :: Client ............................ SKIPPED
[INFO] Apache Karaf :: Management ........................ SKIPPED
[INFO] Apache Karaf :: Management ........................ SKIPPED
[INFO] Apache Karaf :: Management :: MBeans .............. SKIPPED
[INFO] Apache Karaf :: Management :: MBeans :: Bundles ... SKIPPED
[INFO] Apache Karaf :: Management :: MBeans :: Services .. SKIPPED
[INFO] Apache Karaf :: Management :: MBeans :: System .... SKIPPED
[INFO] Apache Karaf :: Management :: MBeans :: Packages .. SKIPPED
[INFO] Apache Karaf :: Management :: MBeans :: Config .... SKIPPED
[INFO] Apache Karaf :: Management :: MBeans :: Dev ....... SKIPPED
[INFO] Apache Karaf :: Management :: MBeans :: HTTP ...... SKIPPED
[INFO] Apache Karaf :: Management :: MBeans :: Log ....... SKIPPED
[INFO] Apache Karaf :: Management :: MBeans :: OBR ....... SKIPPED
[INFO] Apache Karaf :: Management :: MBeans :: Web ....... SKIPPED
[INFO] Apache Karaf :: Web Console ....................... SKIPPED
[INFO] Apache Karaf :: Web Console :: Console ............ SKIPPED
[INFO] Apache Karaf :: Web Console :: Branding ........... SKIPPED
[INFO] Apache Karaf :: Web Console :: Features Plugin .... SKIPPED
[INFO] Apache Karaf :: Web Console :: Gogo Plugin ........ SKIPPED
[INFO] Apache Karaf :: Web Console :: HTTP Plugin ........ SKIPPED
[INFO] Apache Karaf :: Web Console :: Admin Plugin ....... SKIPPED
[INFO] Apache Karaf :: Exception ......................... SKIPPED
[INFO] Apache Karaf :: Scheduler ......................... SKIPPED
[INFO] Apache Karaf :: Scheduler :: Core ................. SKIPPED
[INFO] Apache Karaf :: Assemblies ........................ SKIPPED
[INFO] Apache Karaf :: Assemblies :: Features ............ SKIPPED
[INFO] Apache Karaf :: Tooling ........................... SKIPPED
[INFO] Apache Karaf :: Tooling :: Maven Karaf Plugin ..... SKIPPED
[INFO] Apache Karaf :: Assemblies :: Features :: Framework  SKIPPED
[INFO] Apache Karaf :: Assemblies :: Full KAR ............ SKIPPED
[INFO] Apache Karaf :: Diagnostic ........................ SKIPPED
[INFO] Apache Karaf :: Diagnostic :: Core ................ SKIPPED
[INFO] Apache Karaf :: Diagnostic :: Common .............. SKIPPED
[INFO] Apache Karaf :: Diagnostic :: Command ............. SKIPPED
[INFO] Apache Karaf :: Diagnostic :: Management .......... SKIPPED
[INFO] Apache Karaf :: Assemblies :: Features :: Standard  SKIPPED
[INFO] Apache Karaf :: Assemblies :: Features :: Enterprise  SKIPPED
[INFO] Apache Karaf :: Assemblies :: Minimal ............. SKIPPED
[INFO] Apache Karaf :: Assemblies :: Full ................ SKIPPED
[INFO] Apache Karaf :: Demos ............................. SKIPPED
[INFO] Apache Karaf :: Demos :: Web ...................... SKIPPED
[INFO] Apache Karaf :: Demos :: Branding ................. SKIPPED
[INFO] Apache Karaf :: Demos :: Branding :: Shell ........ SKIPPED
[INFO] Apache Karaf :: Demos :: Demo Dump provider ....... SKIPPED
[INFO] Apache Karaf :: Integration Tests ................. SKIPPED
[INFO] Apache Karaf :: Integration Tests :: Dependencies . SKIPPED
[INFO] Apache Karaf :: Tooling :: Testing Environment .... SKIPPED
[INFO] Apache Karaf :: Integration Tests :: ITests ....... SKIPPED
[INFO] Apache Karaf :: Integration Tests :: Kit Tests .... SKIPPED
[INFO] Apache Karaf :: Archetypes ........................ SKIPPED
[INFO] Apache Karaf :: Archetypes :: Command Archetype ... SKIPPED
[INFO] Apache Karaf :: Archetypes :: Feature Archetype ... SKIPPED
[INFO] Apache Karaf :: Manual ............................ SKIPPED
[INFO] ------------------------------------------------------------------------
[INFO] BUILD FAILURE
[INFO] ------------------------------------------------------------------------
[INFO] Total time: 6:39.924s
[INFO] Finished at: Sun Oct 09 20:09:20 UTC 2011
[INFO] Final Memory: 66M/573M
[INFO] ------------------------------------------------------------------------
mavenExecutionResult exceptions not empty
message : Failed to execute goal on project org.apache.karaf.shell.http: Could not resolve
dependencies for project org.apache.karaf.shell:org.apache.karaf.shell.http:bundle:3.0.0-SNAPSHOT:
Could not find artifact org.ops4j.pax.web:pax-web-spi:jar:1.1.2-SNAPSHOT in apache-snapshots
(http://repository.apache.org/content/groups/snapshots-group)
cause : Could not resolve dependencies for project org.apache.karaf.shell:org.apache.karaf.shell.http:bundle:3.0.0-SNAPSHOT:
Could not find artifact org.ops4j.pax.web:pax-web-spi:jar:1.1.2-SNAPSHOT in apache-snapshots
(http://repository.apache.org/content/groups/snapshots-group)
Stack trace : 
org.apache.maven.lifecycle.LifecycleExecutionException: Failed to execute goal on project
org.apache.karaf.shell.http: Could not resolve dependencies for project org.apache.karaf.shell:org.apache.karaf.shell.http:bundle:3.0.0-SNAPSHOT:
Could not find artifact org.ops4j.pax.web:pax-web-spi:jar:1.1.2-SNAPSHOT in apache-snapshots
(http://repository.apache.org/content/groups/snapshots-group)
	at org.apache.maven.lifecycle.internal.LifecycleDependencyResolver.getDependencies(LifecycleDependencyResolver.java:196)
	at org.apache.maven.lifecycle.internal.LifecycleDependencyResolver.resolveProjectDependencies(LifecycleDependencyResolver.java:108)
	at org.apache.maven.lifecycle.internal.MojoExecutor.ensureDependenciesAreResolved(MojoExecutor.java:258)
	at org.apache.maven.lifecycle.internal.MojoExecutor.execute(MojoExecutor.java:201)
	at org.apache.maven.lifecycle.internal.MojoExecutor.execute(MojoExecutor.java:153)
	at org.apache.maven.lifecycle.internal.MojoExecutor.execute(MojoExecutor.java:145)
	at org.apache.maven.lifecycle.internal.LifecycleModuleBuilder.buildProject(LifecycleModuleBuilder.java:84)
	at org.apache.maven.lifecycle.internal.LifecycleModuleBuilder.buildProject(LifecycleModuleBuilder.java:59)
	at org.apache.maven.lifecycle.internal.LifecycleStarter.singleThreadedBuild(LifecycleStarter.java:183)
	at org.apache.maven.lifecycle.internal.LifecycleStarter.execute(LifecycleStarter.java:161)
	at org.apache.maven.DefaultMaven.doExecute(DefaultMaven.java:319)
	at org.apache.maven.DefaultMaven.execute(DefaultMaven.java:156)
	at org.jvnet.hudson.maven3.launcher.Maven3Launcher.main(Maven3Launcher.java:79)
	at sun.reflect.NativeMethodAccessorImpl.invoke0(Native Method)
	at sun.reflect.NativeMethodAccessorImpl.invoke(NativeMethodAccessorImpl.java:39)
	at sun.reflect.DelegatingMethodAccessorImpl.invoke(DelegatingMethodAccessorImpl.java:25)
	at java.lang.reflect.Method.invoke(Method.java:597)
	at org.codehaus.plexus.classworlds.launcher.Launcher.launchStandard(Launcher.java:329)
	at org.codehaus.plexus.classworlds.launcher.Launcher.launch(Launcher.java:239)
	at org.jvnet.hudson.maven3.agent.Maven3Main.launch(Maven3Main.java:158)
	at hudson.maven.Maven3Builder.call(Maven3Builder.java:122)
	at hudson.maven.Maven3Builder.call(Maven3Builder.java:74)
	at hudson.remoting.UserRequest.perform(UserRequest.java:118)
	at hudson.remoting.UserRequest.perform(UserRequest.java:48)
	at hudson.remoting.Request$2.run(Request.java:287)
	at java.util.concurrent.Executors$RunnableAdapter.call(Executors.java:441)
	at java.util.concurrent.FutureTask$Sync.innerRun(FutureTask.java:303)
	at java.util.concurrent.FutureTask.run(FutureTask.java:138)
	at java.util.concurrent.ThreadPoolExecutor$Worker.runTask(ThreadPoolExecutor.java:886)
	at java.util.concurrent.ThreadPoolExecutor$Worker.run(ThreadPoolExecutor.java:908)
	at java.lang.Thread.run(Thread.java:619)
Caused by: org.apache.maven.project.DependencyResolutionException: Could not resolve dependencies
for project org.apache.karaf.shell:org.apache.karaf.shell.http:bundle:3.0.0-SNAPSHOT: Could
not find artifact org.ops4j.pax.web:pax-web-spi:jar:1.1.2-SNAPSHOT in apache-snapshots (http://repository.apache.org/content/groups/snapshots-group)
	at org.apache.maven.project.DefaultProjectDependenciesResolver.resolve(DefaultProjectDependenciesResolver.java:170)
	at org.apache.maven.lifecycle.internal.LifecycleDependencyResolver.getDependencies(LifecycleDependencyResolver.java:171)
	... 30 more
Caused by: org.sonatype.aether.resolution.DependencyResolutionException: Could not find artifact
org.ops4j.pax.web:pax-web-spi:jar:1.1.2-SNAPSHOT in apache-snapshots (http://repository.apache.org/content/groups/snapshots-group)
	at org.sonatype.aether.impl.internal.DefaultRepositorySystem.resolveDependencies(DefaultRepositorySystem.java:412)
	at org.apache.maven.project.DefaultProjectDependenciesResolver.resolve(DefaultProjectDependenciesResolver.java:164)
	... 31 more
Caused by: org.sonatype.aether.resolution.ArtifactResolutionException: Could not find artifact
org.ops4j.pax.web:pax-web-spi:jar:1.1.2-SNAPSHOT in apache-snapshots (http://repository.apache.org/content/groups/snapshots-group)
	at org.sonatype.aether.impl.internal.DefaultArtifactResolver.resolve(DefaultArtifactResolver.java:541)
	at org.sonatype.aether.impl.internal.DefaultArtifactResolver.resolveArtifacts(DefaultArtifactResolver.java:220)
	at org.sonatype.aether.impl.internal.DefaultRepositorySystem.resolveDependencies(DefaultRepositorySystem.java:395)
	... 32 more
Caused by: org.sonatype.aether.transfer.ArtifactNotFoundException: Could not find artifact
org.ops4j.pax.web:pax-web-spi:jar:1.1.2-SNAPSHOT in apache-snapshots (http://repository.apache.org/content/groups/snapshots-group)
	at org.sonatype.aether.connector.wagon.WagonRepositoryConnector$4.wrap(WagonRepositoryConnector.java:945)
	at org.sonatype.aether.connector.wagon.WagonRepositoryConnector$4.wrap(WagonRepositoryConnector.java:940)
	at org.sonatype.aether.connector.wagon.WagonRepositoryConnector$GetTask.flush(WagonRepositoryConnector.java:695)
	at org.sonatype.aether.connector.wagon.WagonRepositoryConnector$GetTask.flush(WagonRepositoryConnector.java:689)
	at org.sonatype.aether.connector.wagon.WagonRepositoryConnector.get(WagonRepositoryConnector.java:445)
	at org.sonatype.aether.impl.internal.DefaultArtifactResolver.resolve(DefaultArtifactResolver.java:460)
	... 34 more
Sending e-mails to: commits@karaf.apache.org
channel stopped


Mime
View raw message