karaf-commits mailing list archives

Site index · List index
Message view « Date » · « Thread »
Top « Date » · « Thread »
From Apache Jenkins Server <jenk...@builds.apache.org>
Subject Build failed in Jenkins: Karaf #637
Date Mon, 26 Sep 2011 11:16:58 GMT
See <https://builds.apache.org/job/Karaf/637/changes>

Changes:

[jbonofre] [KARAF-786] Add Packages MBean

[jbonofre] [KARAF-786] Fix NPE on the Services MBean

[jbonofre] [KARAF-786] Add Services and System MBeans

[jbonofre] [KARAF-786] Update bundle.info for the Bundles MBean

------------------------------------------
[...truncated 8753 lines...]
Downloading: http://repo1.maven.org/maven2/org/apache/aries/jmx/org.apache.aries.jmx.blueprint/0.3/org.apache.aries.jmx.blueprint-0.3.jar
Downloaded: http://repo1.maven.org/maven2/org/apache/aries/jmx/org.apache.aries.jmx.blueprint/0.3/org.apache.aries.jmx.blueprint-0.3.jar
(67 KB at 131.0 KB/sec)
[INFO] 
[INFO] --- karaf-maven-plugin:3.0.0-SNAPSHOT:instance-create-archive (package) @ apache-karaf-minimal
---
[INFO] Installing <https://builds.apache.org/job/Karaf/ws/karaf/assemblies/apache-karaf-minimal/pom.xml>
to <https://builds.apache.org/job/Karaf/ws/.repository/org/apache/karaf/assemblies/apache-karaf-minimal/3.0.0-SNAPSHOT/apache-karaf-minimal-3.0.0-SNAPSHOT.pom>
[INFO] [INFO] Installing <https://builds.apache.org/job/Karaf/ws/karaf/assemblies/apache-karaf-minimal/target/apache-karaf-minimal-3.0.0-SNAPSHOT.tar.gz>
to <https://builds.apache.org/job/Karaf/ws/.repository/org/apache/karaf/assemblies/apache-karaf-minimal/3.0.0-SNAPSHOT/apache-karaf-minimal-3.0.0-SNAPSHOT.tar.gz>

[INFO] --- maven-install-plugin:2.3.1:install (default-install) @ apache-karaf-minimal ---
[INFO] Installing <https://builds.apache.org/job/Karaf/ws/karaf/assemblies/apache-karaf-minimal/target/apache-karaf-minimal-3.0.0-SNAPSHOT.zip>
to <https://builds.apache.org/job/Karaf/ws/.repository/org/apache/karaf/assemblies/apache-karaf-minimal/3.0.0-SNAPSHOT/apache-karaf-minimal-3.0.0-SNAPSHOT.zip>
[JENKINS] Archiving <https://builds.apache.org/job/Karaf/ws/karaf/assemblies/apache-karaf-minimal/pom.xml>
to /home/hudson/hudson/jobs/Karaf/modules/org.apache.karaf.assemblies$apache-karaf-minimal/builds/2011-09-26_11-03-38/archive/org.apache.karaf.assemblies/apache-karaf-minimal/3.0.0-SNAPSHOT/apache-karaf-minimal-3.0.0-SNAPSHOT.pom
[JENKINS] Archiving <https://builds.apache.org/job/Karaf/ws/karaf/assemblies/apache-karaf-minimal/target/apache-karaf-minimal-3.0.0-SNAPSHOT.tar.gz>
to /home/hudson/hudson/jobs/Karaf/modules/org.apache.karaf.assemblies$apache-karaf-minimal/builds/2011-09-26_11-03-38/archive/org.apache.karaf.assemblies/apache-karaf-minimal/3.0.0-SNAPSHOT/apache-karaf-minimal-3.0.0-SNAPSHOT.tar.gz
[JENKINS] Archiving <https://builds.apache.org/job/Karaf/ws/karaf/assemblies/apache-karaf-minimal/target/apache-karaf-minimal-3.0.0-SNAPSHOT.zip>
to /home/hudson/hudson/jobs/Karaf/modules/org.apache.karaf.assemblies$apache-karaf-minimal/builds/2011-09-26_11-03-38/archive/org.apache.karaf.assemblies/apache-karaf-minimal/3.0.0-SNAPSHOT/apache-karaf-minimal-3.0.0-SNAPSHOT.zip
[INFO]                                                                         
[INFO] ------------------------------------------------------------------------
[INFO] Building Apache Karaf :: Assemblies :: Full 3.0.0-SNAPSHOT
[INFO] ------------------------------------------------------------------------
[INFO] 
[INFO] --- maven-clean-plugin:2.4.1:clean (default-clean) @ apache-karaf-full ---
[INFO] 
[INFO] --- maven-enforcer-plugin:1.0.1:enforce (enforce-maven) @ apache-karaf-full ---
[INFO] 
[INFO] --- maven-bundle-plugin:2.3.5:cleanVersions (cleanVersions) @ apache-karaf-full ---
[INFO] 
[INFO] --- maven-remote-resources-plugin:1.2.1:process (default) @ apache-karaf-full ---
[INFO] [debug] execute contextualize
[INFO] Using 'UTF-8' encoding to copy filtered resources.
[INFO] Copying 4 resources

[INFO] --- maven-resources-plugin:2.5:resources (process-resources) @ apache-karaf-full ---
[INFO] 
[INFO] --- karaf-maven-plugin:3.0.0-SNAPSHOT:install-kars (process-resources) @ apache-karaf-full
---
Sep 26, 2011 11:15:42 AM org.apache.karaf.deployer.kar.KarArtifactInstaller init
INFO: Karaf archives will be extracted to ./target/local-repo
Sep 26, 2011 11:15:42 AM org.apache.karaf.deployer.kar.KarArtifactInstaller init
INFO: Timestamps for Karaf archives will be extracted to ./target/local-repo/.timestamps
Sep 26, 2011 11:15:42 AM org.apache.karaf.deployer.kar.KarArtifactInstaller install
INFO: Installing <https://builds.apache.org/job/Karaf/ws/karaf/assemblies/features/framework/target/org.apache.karaf.feature.framework-3.0.0-SNAPSHOT.kar>
[INFO] Installing feature mvn:org.apache.karaf.assemblies.features/org.apache.karaf.feature.framework/3.0.0-SNAPSHOT/xml/features
to system and startup.properties
Sep 26, 2011 11:15:42 AM org.apache.karaf.deployer.kar.KarArtifactInstaller addToFeaturesRepositories
INFO: Added feature repository 'mvn:org.apache.karaf.assemblies.features/org.apache.karaf.feature.framework/3.0.0-SNAPSHOT/xml/features'.
Sep 26, 2011 11:15:42 AM org.apache.karaf.deployer.kar.KarArtifactInstaller install
INFO: Installing <https://builds.apache.org/job/Karaf/ws/karaf/assemblies/features/full/target/org.apache.karaf.feature.full-3.0.0-SNAPSHOT.kar>
[INFO] Adding feature repository to system: mvn:org.apache.karaf.assemblies.features/org.apache.karaf.feature.full/3.0.0-SNAPSHOT/xml/features
Sep 26, 2011 11:15:42 AM org.apache.karaf.deployer.kar.KarArtifactInstaller addToFeaturesRepositories
INFO: Added feature repository 'mvn:org.apache.karaf.assemblies.features/org.apache.karaf.feature.full/3.0.0-SNAPSHOT/xml/features'.
[INFO] Adding feature repository to system: mvn:org.apache.karaf.assemblies.features/org.apache.karaf.feature.standard/3.0.0-SNAPSHOT/xml/features
[INFO] Adding feature repository to system: mvn:org.apache.karaf.assemblies.features/org.apache.karaf.feature.enterprise/3.0.0-SNAPSHOT/xml/features
[INFO] 
[INFO] --- karaf-maven-plugin:3.0.0-SNAPSHOT:instance-create-archive (package) @ apache-karaf-full
---
[INFO] Installing <https://builds.apache.org/job/Karaf/ws/karaf/assemblies/apache-karaf-full/pom.xml>
to <https://builds.apache.org/job/Karaf/ws/.repository/org/apache/karaf/assemblies/apache-karaf-full/3.0.0-SNAPSHOT/apache-karaf-full-3.0.0-SNAPSHOT.pom>
[INFO] [INFO] Installing <https://builds.apache.org/job/Karaf/ws/karaf/assemblies/apache-karaf-full/target/apache-karaf-full-3.0.0-SNAPSHOT.tar.gz>
to <https://builds.apache.org/job/Karaf/ws/.repository/org/apache/karaf/assemblies/apache-karaf-full/3.0.0-SNAPSHOT/apache-karaf-full-3.0.0-SNAPSHOT.tar.gz>

[INFO] --- maven-install-plugin:2.3.1:install (default-install) @ apache-karaf-full ---
[INFO] Installing <https://builds.apache.org/job/Karaf/ws/karaf/assemblies/apache-karaf-full/target/apache-karaf-full-3.0.0-SNAPSHOT.zip>
to <https://builds.apache.org/job/Karaf/ws/.repository/org/apache/karaf/assemblies/apache-karaf-full/3.0.0-SNAPSHOT/apache-karaf-full-3.0.0-SNAPSHOT.zip>
[JENKINS] Archiving <https://builds.apache.org/job/Karaf/ws/karaf/assemblies/apache-karaf-full/pom.xml>
to /home/hudson/hudson/jobs/Karaf/modules/org.apache.karaf.assemblies$apache-karaf-full/builds/2011-09-26_11-03-38/archive/org.apache.karaf.assemblies/apache-karaf-full/3.0.0-SNAPSHOT/apache-karaf-full-3.0.0-SNAPSHOT.pom
[JENKINS] Archiving <https://builds.apache.org/job/Karaf/ws/karaf/assemblies/apache-karaf-full/target/apache-karaf-full-3.0.0-SNAPSHOT.tar.gz>
to /home/hudson/hudson/jobs/Karaf/modules/org.apache.karaf.assemblies$apache-karaf-full/builds/2011-09-26_11-03-38/archive/org.apache.karaf.assemblies/apache-karaf-full/3.0.0-SNAPSHOT/apache-karaf-full-3.0.0-SNAPSHOT.tar.gz
[JENKINS] Archiving <https://builds.apache.org/job/Karaf/ws/karaf/assemblies/apache-karaf-full/target/apache-karaf-full-3.0.0-SNAPSHOT.zip>
to /home/hudson/hudson/jobs/Karaf/modules/org.apache.karaf.assemblies$apache-karaf-full/builds/2011-09-26_11-03-38/archive/org.apache.karaf.assemblies/apache-karaf-full/3.0.0-SNAPSHOT/apache-karaf-full-3.0.0-SNAPSHOT.zip
[INFO]                                                                         
[INFO] ------------------------------------------------------------------------
[INFO] Building Apache Karaf :: Demos 3.0.0-SNAPSHOT
[INFO] ------------------------------------------------------------------------
[INFO] 
[INFO] --- maven-clean-plugin:2.4.1:clean (default-clean) @ demos ---
[INFO] 
[INFO] --- maven-enforcer-plugin:1.0.1:enforce (enforce-maven) @ demos ---
[INFO] 
[INFO] --- maven-bundle-plugin:2.3.5:cleanVersions (cleanVersions) @ demos ---
[INFO] 
[INFO] --- maven-remote-resources-plugin:1.2.1:process (default) @ demos ---
[INFO] [INFO] Installing <https://builds.apache.org/job/Karaf/ws/karaf/demos/pom.xml>
to <https://builds.apache.org/job/Karaf/ws/.repository/org/apache/karaf/demos/demos/3.0.0-SNAPSHOT/demos-3.0.0-SNAPSHOT.pom>

[INFO] --- maven-install-plugin:2.3.1:install (default-install) @ demos ---
[JENKINS] Archiving <https://builds.apache.org/job/Karaf/ws/karaf/demos/pom.xml> to
/home/hudson/hudson/jobs/Karaf/modules/org.apache.karaf.demos$demos/builds/2011-09-26_11-03-38/archive/org.apache.karaf.demos/demos/3.0.0-SNAPSHOT/demos-3.0.0-SNAPSHOT.pom
[INFO] Downloading: http://repo1.maven.org/maven2/org/apache/maven/plugins/maven-antrun-plugin/1.6/maven-antrun-plugin-1.6.pom
                                                                        
[INFO] ------------------------------------------------------------------------
[INFO] Building Apache Karaf :: Demos :: Web 3.0.0-SNAPSHOT
[INFO] ------------------------------------------------------------------------
Downloaded: http://repo1.maven.org/maven2/org/apache/maven/plugins/maven-antrun-plugin/1.6/maven-antrun-plugin-1.6.pom
(5 KB at 9.1 KB/sec)
Downloading: http://repo1.maven.org/maven2/org/apache/maven/plugins/maven-antrun-plugin/1.6/maven-antrun-plugin-1.6.jar
Downloaded: http://repo1.maven.org/maven2/org/apache/maven/plugins/maven-antrun-plugin/1.6/maven-antrun-plugin-1.6.jar
(29 KB at 58.5 KB/sec)
Downloading: http://repo1.maven.org/maven2/org/apache/maven/plugins/maven-war-plugin/2.1.1/maven-war-plugin-2.1.1.pom
Downloaded: http://repo1.maven.org/maven2/org/apache/maven/plugins/maven-war-plugin/2.1.1/maven-war-plugin-2.1.1.pom
(7 KB at 11.6 KB/sec)
Downloading: http://repo1.maven.org/maven2/org/apache/maven/plugins/maven-war-plugin/2.1.1/maven-war-plugin-2.1.1.jar
Downloaded: http://repo1.maven.org/maven2/org/apache/maven/plugins/maven-war-plugin/2.1.1/maven-war-plugin-2.1.1.jar
(76 KB at 170.3 KB/sec)
Downloading: http://repository.apache.org/content/groups/snapshots-group/org/apache/karaf/assemblies/apache-karaf-full/3.0.0-SNAPSHOT/apache-karaf-full-3.0.0-SNAPSHOT-bin.zip
Downloading: http://repository.sonatype.org/content/groups/sonatype-public-grid/org/apache/karaf/assemblies/apache-karaf-full/3.0.0-SNAPSHOT/apache-karaf-full-3.0.0-SNAPSHOT-bin.zip
Downloading: http://repo.fusesource.com/nexus/content/repositories/snapshots/org/apache/karaf/assemblies/apache-karaf-full/3.0.0-SNAPSHOT/apache-karaf-full-3.0.0-SNAPSHOT-bin.zip
Downloading: https://oss.sonatype.org/content/repositories/ops4j-snapshots/org/apache/karaf/assemblies/apache-karaf-full/3.0.0-SNAPSHOT/apache-karaf-full-3.0.0-SNAPSHOT-bin.zip
Downloading: http://repository.apache.org/snapshots/org/apache/karaf/assemblies/apache-karaf-full/3.0.0-SNAPSHOT/apache-karaf-full-3.0.0-SNAPSHOT-bin.zip
[JENKINS] Archiving <https://builds.apache.org/job/Karaf/ws/karaf/demos/web/pom.xml>
to /home/hudson/hudson/jobs/Karaf/modules/org.apache.karaf.demos$web/builds/2011-09-26_11-03-38/archive/org.apache.karaf.demos/web/3.0.0-SNAPSHOT/web-3.0.0-SNAPSHOT.pom
[INFO] ------------------------------------------------------------------------
[INFO] Reactor Summary:
[INFO] 
[INFO] Apache Karaf ...................................... SUCCESS [1:21.471s]
[INFO] Apache Karaf :: Util .............................. SUCCESS [34.566s]
[INFO] Apache Karaf :: Main .............................. SUCCESS [30.026s]
[INFO] Apache Karaf :: JAAS .............................. SUCCESS [0.283s]
[INFO] Apache Karaf :: JAAS :: Boot ...................... SUCCESS [8.826s]
[INFO] Apache Karaf :: JAAS :: Config .................... SUCCESS [9.672s]
[INFO] Apache Karaf :: JAAS :: Modules ................... SUCCESS [4.275s]
[INFO] Apache Karaf :: Shell ............................. SUCCESS [0.321s]
[INFO] Apache Karaf :: Shell :: Console .................. SUCCESS [14.183s]
[INFO] Apache Karaf :: Features .......................... SUCCESS [0.362s]
[INFO] Apache Karaf :: Features :: Core .................. SUCCESS [9.683s]
[INFO] Apache Karaf :: Features :: Command ............... SUCCESS [1.535s]
[INFO] Apache Karaf :: Features :: Management ............ SUCCESS [1.976s]
[INFO] Apache Karaf :: Features :: OBR Resolver .......... SUCCESS [7.981s]
[INFO] Apache Karaf :: Admin ............................. SUCCESS [0.234s]
[INFO] Apache Karaf :: Admin :: Core ..................... SUCCESS [4.316s]
[INFO] Apache Karaf :: Admin :: Command .................. SUCCESS [4.146s]
[INFO] Apache Karaf :: Admin :: Management ............... SUCCESS [3.281s]
[INFO] Apache Karaf :: Deployer .......................... SUCCESS [0.271s]
[INFO] Apache Karaf :: Deployer :: Spring ................ SUCCESS [3.104s]
[INFO] Apache Karaf :: Deployer :: Blueprint ............. SUCCESS [1.951s]
[INFO] Apache Karaf :: Deployer :: Features .............. SUCCESS [1.502s]
[INFO] Apache Karaf :: Deployer :: Karaf Archive (.kar) .. SUCCESS [1.779s]
[INFO] Apache Karaf :: Deployer :: Wrap Non OSGi Jar ..... SUCCESS [7.334s]
[INFO] Apache Karaf :: Shell :: Various Commands ......... SUCCESS [2.213s]
[INFO] Apache Karaf :: Shell :: ConfigAdmin Commands ..... SUCCESS [2.173s]
[INFO] Apache Karaf :: Shell :: Log Commands ............. SUCCESS [5.431s]
[INFO] Apache Karaf :: Shell :: OBR Commands ............. SUCCESS [4.874s]
[INFO] Apache Karaf :: Shell :: OSGi Commands ............ SUCCESS [16.175s]
[INFO] Apache Karaf :: Shell :: PackageAdmin Commands .... SUCCESS [1.441s]
[INFO] Apache Karaf :: Shell :: SSH ...................... SUCCESS [4.576s]
[INFO] Apache Karaf :: Shell :: Service Wrapper .......... SUCCESS [2.587s]
[INFO] Apache Karaf :: Shell :: Development Commands ..... SUCCESS [11.458s]
[INFO] Apache Karaf :: Shell :: Http Commands ............ SUCCESS [3.868s]
[INFO] Apache Karaf :: Shell :: Web Commands ............. SUCCESS [1.397s]
[INFO] Apache Karaf :: JAAS :: Jasypt Encryption ......... SUCCESS [9.782s]
[INFO] Apache Karaf :: Jaas :: Command ................... SUCCESS [1.297s]
[INFO] Apache Karaf :: Client ............................ SUCCESS [13.760s]
[INFO] Apache Karaf :: Management ........................ SUCCESS [0.247s]
[INFO] Apache Karaf :: Management ........................ SUCCESS [1.794s]
[INFO] Apache Karaf :: Management :: MBeans .............. SUCCESS [0.309s]
[INFO] Apache Karaf :: Management :: MBeans :: Bundles ... SUCCESS [1.123s]
[INFO] Apache Karaf :: Management :: MBeans :: Services .. SUCCESS [1.189s]
[INFO] Apache Karaf :: Management :: MBeans :: System .... SUCCESS [1.190s]
[INFO] Apache Karaf :: Management :: MBeans :: Packages .. SUCCESS [1.402s]
[INFO] Apache Karaf :: Management :: MBeans :: Config .... SUCCESS [1.786s]
[INFO] Apache Karaf :: Management :: MBeans :: Dev ....... SUCCESS [7.038s]
[INFO] Apache Karaf :: Management :: MBeans :: HTTP ...... SUCCESS [1.289s]
[INFO] Apache Karaf :: Management :: MBeans :: Log ....... SUCCESS [1.273s]
[INFO] Apache Karaf :: Management :: MBeans :: OBR ....... SUCCESS [1.268s]
[INFO] Apache Karaf :: Web Console ....................... SUCCESS [0.311s]
[INFO] Apache Karaf :: Web Console :: Console ............ SUCCESS [10.495s]
[INFO] Apache Karaf :: Web Console :: Branding ........... SUCCESS [1.444s]
[INFO] Apache Karaf :: Web Console :: Features Plugin .... SUCCESS [2.337s]
[INFO] Apache Karaf :: Web Console :: Gogo Plugin ........ SUCCESS [1.910s]
[INFO] Apache Karaf :: Web Console :: HTTP Plugin ........ SUCCESS [1.456s]
[INFO] Apache Karaf :: Web Console :: Admin Plugin ....... SUCCESS [3.374s]
[INFO] Apache Karaf :: Exception ......................... SUCCESS [1.351s]
[INFO] Apache Karaf :: Scheduler ......................... SUCCESS [0.327s]
[INFO] Apache Karaf :: Scheduler :: Core ................. SUCCESS [1.203s]
[INFO] Apache Karaf :: Assemblies ........................ SUCCESS [0.360s]
[INFO] Apache Karaf :: Assemblies :: Features ............ SUCCESS [0.341s]
[INFO] Apache Karaf :: Tooling ........................... SUCCESS [0.289s]
[INFO] Apache Karaf :: Tooling :: Maven Karaf Plugin ..... SUCCESS [1:40.392s]
[INFO] Apache Karaf :: Assemblies :: Framework KAR ....... SUCCESS [31.092s]
[INFO] Apache Karaf :: Assemblies :: Full KAR ............ SUCCESS [2.025s]
[INFO] Apache Karaf :: Diagnostic ........................ SUCCESS [0.282s]
[INFO] Apache Karaf :: Diagnostic :: Core ................ SUCCESS [1.171s]
[INFO] Apache Karaf :: Diagnostic :: Common .............. SUCCESS [1.445s]
[INFO] Apache Karaf :: Diagnostic :: Command ............. SUCCESS [1.255s]
[INFO] Apache Karaf :: Diagnostic :: Management .......... SUCCESS [2.093s]
[INFO] Apache Karaf :: Assemblies :: Features :: Standard  SUCCESS [0.983s]
[INFO] Apache Karaf :: Assemblies :: Features :: Enterprise  SUCCESS [0.308s]
[INFO] Apache Karaf :: Assemblies :: Minimal ............. SUCCESS [3.423s]
[INFO] Apache Karaf :: Assemblies :: Full ................ SUCCESS [2.399s]
[INFO] Apache Karaf :: Demos ............................. SUCCESS [0.242s]
[INFO] Apache Karaf :: Demos :: Web ...................... FAILURE [9.260s]
[INFO] Apache Karaf :: Demos :: Branding ................. SKIPPED
[INFO] Apache Karaf :: Demos :: Branding :: Shell ........ SKIPPED
[INFO] Apache Karaf :: Demos :: Demo Dump provider ....... SKIPPED
[INFO] Apache Karaf :: Integration Tests ................. SKIPPED
[INFO] Apache Karaf :: Integration Tests :: Dependencies . SKIPPED
[INFO] Apache Karaf :: Tooling :: Testing Environment .... SKIPPED
[INFO] Apache Karaf :: Integration Tests :: ITests ....... SKIPPED
[INFO] Apache Karaf :: Integration Tests :: Kit Tests .... SKIPPED
[INFO] Apache Karaf :: Archetypes ........................ SKIPPED
[INFO] Apache Karaf :: Archetypes :: Command Archetype ... SKIPPED
[INFO] Apache Karaf :: Archetypes :: Feature Archetype ... SKIPPED
[INFO] Apache Karaf :: Manual ............................ SKIPPED
[INFO] ------------------------------------------------------------------------
[INFO] BUILD FAILURE
[INFO] ------------------------------------------------------------------------
[INFO] Total time: 13:14.022s
[INFO] Finished at: Mon Sep 26 11:16:56 UTC 2011
[INFO] Final Memory: 79M/829M
[INFO] ------------------------------------------------------------------------
mavenExecutionResult exceptions not empty
message : Failed to execute goal on project web: Could not resolve dependencies for project
org.apache.karaf.demos:web:war:3.0.0-SNAPSHOT: Could not find artifact org.apache.karaf.assemblies:apache-karaf-full:zip:bin:3.0.0-SNAPSHOT
in apache-snapshots (http://repository.apache.org/content/groups/snapshots-group)
cause : Could not resolve dependencies for project org.apache.karaf.demos:web:war:3.0.0-SNAPSHOT:
Could not find artifact org.apache.karaf.assemblies:apache-karaf-full:zip:bin:3.0.0-SNAPSHOT
in apache-snapshots (http://repository.apache.org/content/groups/snapshots-group)
Stack trace : 
org.apache.maven.lifecycle.LifecycleExecutionException: Failed to execute goal on project
web: Could not resolve dependencies for project org.apache.karaf.demos:web:war:3.0.0-SNAPSHOT:
Could not find artifact org.apache.karaf.assemblies:apache-karaf-full:zip:bin:3.0.0-SNAPSHOT
in apache-snapshots (http://repository.apache.org/content/groups/snapshots-group)
	at org.apache.maven.lifecycle.internal.LifecycleDependencyResolver.getDependencies(LifecycleDependencyResolver.java:196)
	at org.apache.maven.lifecycle.internal.LifecycleDependencyResolver.resolveProjectDependencies(LifecycleDependencyResolver.java:108)
	at org.apache.maven.lifecycle.internal.MojoExecutor.ensureDependenciesAreResolved(MojoExecutor.java:258)
	at org.apache.maven.lifecycle.internal.MojoExecutor.execute(MojoExecutor.java:201)
	at org.apache.maven.lifecycle.internal.MojoExecutor.execute(MojoExecutor.java:153)
	at org.apache.maven.lifecycle.internal.MojoExecutor.execute(MojoExecutor.java:145)
	at org.apache.maven.lifecycle.internal.LifecycleModuleBuilder.buildProject(LifecycleModuleBuilder.java:84)
	at org.apache.maven.lifecycle.internal.LifecycleModuleBuilder.buildProject(LifecycleModuleBuilder.java:59)
	at org.apache.maven.lifecycle.internal.LifecycleStarter.singleThreadedBuild(LifecycleStarter.java:183)
	at org.apache.maven.lifecycle.internal.LifecycleStarter.execute(LifecycleStarter.java:161)
	at org.apache.maven.DefaultMaven.doExecute(DefaultMaven.java:319)
	at org.apache.maven.DefaultMaven.execute(DefaultMaven.java:156)
	at org.jvnet.hudson.maven3.launcher.Maven3Launcher.main(Maven3Launcher.java:79)
	at sun.reflect.NativeMethodAccessorImpl.invoke0(Native Method)
	at sun.reflect.NativeMethodAccessorImpl.invoke(NativeMethodAccessorImpl.java:39)
	at sun.reflect.DelegatingMethodAccessorImpl.invoke(DelegatingMethodAccessorImpl.java:25)
	at java.lang.reflect.Method.invoke(Method.java:597)
	at org.codehaus.plexus.classworlds.launcher.Launcher.launchStandard(Launcher.java:329)
	at org.codehaus.plexus.classworlds.launcher.Launcher.launch(Launcher.java:239)
	at org.jvnet.hudson.maven3.agent.Maven3Main.launch(Maven3Main.java:158)
	at hudson.maven.Maven3Builder.call(Maven3Builder.java:122)
	at hudson.maven.Maven3Builder.call(Maven3Builder.java:74)
	at hudson.remoting.UserRequest.perform(UserRequest.java:118)
	at hudson.remoting.UserRequest.perform(UserRequest.java:48)
	at hudson.remoting.Request$2.run(Request.java:287)
	at java.util.concurrent.Executors$RunnableAdapter.call(Executors.java:441)
	at java.util.concurrent.FutureTask$Sync.innerRun(FutureTask.java:303)
	at java.util.concurrent.FutureTask.run(FutureTask.java:138)
	at java.util.concurrent.ThreadPoolExecutor$Worker.runTask(ThreadPoolExecutor.java:886)
	at java.util.concurrent.ThreadPoolExecutor$Worker.run(ThreadPoolExecutor.java:908)
	at java.lang.Thread.run(Thread.java:619)
Caused by: org.apache.maven.project.DependencyResolutionException: Could not resolve dependencies
for project org.apache.karaf.demos:web:war:3.0.0-SNAPSHOT: Could not find artifact org.apache.karaf.assemblies:apache-karaf-full:zip:bin:3.0.0-SNAPSHOT
in apache-snapshots (http://repository.apache.org/content/groups/snapshots-group)
	at org.apache.maven.project.DefaultProjectDependenciesResolver.resolve(DefaultProjectDependenciesResolver.java:170)
	at org.apache.maven.lifecycle.internal.LifecycleDependencyResolver.getDependencies(LifecycleDependencyResolver.java:171)
	... 30 more
Caused by: org.sonatype.aether.resolution.DependencyResolutionException: Could not find artifact
org.apache.karaf.assemblies:apache-karaf-full:zip:bin:3.0.0-SNAPSHOT in apache-snapshots (http://repository.apache.org/content/groups/snapshots-group)
	at org.sonatype.aether.impl.internal.DefaultRepositorySystem.resolveDependencies(DefaultRepositorySystem.java:412)
	at org.apache.maven.project.DefaultProjectDependenciesResolver.resolve(DefaultProjectDependenciesResolver.java:164)
	... 31 more
Caused by: org.sonatype.aether.resolution.ArtifactResolutionException: Could not find artifact
org.apache.karaf.assemblies:apache-karaf-full:zip:bin:3.0.0-SNAPSHOT in apache-snapshots (http://repository.apache.org/content/groups/snapshots-group)
	at org.sonatype.aether.impl.internal.DefaultArtifactResolver.resolve(DefaultArtifactResolver.java:541)
	at org.sonatype.aether.impl.internal.DefaultArtifactResolver.resolveArtifacts(DefaultArtifactResolver.java:220)
	at org.sonatype.aether.impl.internal.DefaultRepositorySystem.resolveDependencies(DefaultRepositorySystem.java:395)
	... 32 more
Caused by: org.sonatype.aether.transfer.ArtifactNotFoundException: Could not find artifact
org.apache.karaf.assemblies:apache-karaf-full:zip:bin:3.0.0-SNAPSHOT in apache-snapshots (http://repository.apache.org/content/groups/snapshots-group)
	at org.sonatype.aether.connector.wagon.WagonRepositoryConnector$4.wrap(WagonRepositoryConnector.java:945)
	at org.sonatype.aether.connector.wagon.WagonRepositoryConnector$4.wrap(WagonRepositoryConnector.java:940)
	at org.sonatype.aether.connector.wagon.WagonRepositoryConnector$GetTask.flush(WagonRepositoryConnector.java:695)
	at org.sonatype.aether.connector.wagon.WagonRepositoryConnector$GetTask.flush(WagonRepositoryConnector.java:689)
	at org.sonatype.aether.connector.wagon.WagonRepositoryConnector.get(WagonRepositoryConnector.java:445)
	at org.sonatype.aether.impl.internal.DefaultArtifactResolver.resolve(DefaultArtifactResolver.java:460)
	... 34 more
Sending e-mails to: commits@karaf.apache.org
channel stopped


Mime
View raw message