karaf-commits mailing list archives

Site index · List index
Message view « Date » · « Thread »
Top « Date » · « Thread »
From Apache Jenkins Server <hud...@hudson.apache.org>
Subject Build failed in Jenkins: Karaf-2.2.x #135
Date Tue, 31 May 2011 20:27:58 GMT
See <https://builds.apache.org/hudson/job/Karaf-2.2.x/135/changes>

Changes:

[jbonofre] [KARAF-663] Automatically add Karaf core features descriptors (standard and enterprise)
in the add-features-to-repo goal.

------------------------------------------
[...truncated 7974 lines...]
[INFO] Unable to find resource 'org.eclipse.jetty:jetty-security:jar:7.4.1.v20110513' in repository
servicemix (http://svn.apache.org/repos/asf/servicemix/m2-repo)
Downloading: http://repo1.maven.org/maven2/org/eclipse/jetty/jetty-security/7.4.1.v20110513/jetty-security-7.4.1.v20110513.jar

1060K downloaded  (pax-web-extender-war-1.0.4-20110518.205534-2.jar)
Downloading: http://svn.apache.org/repos/asf/servicemix/m2-repo/org/eclipse/jetty/jetty-servlet/7.4.1.v20110513/jetty-servlet-7.4.1.v20110513.jar
Downloading: https://oss.sonatype.org/content/repositories/ops4j-snapshots//org/ops4j/pax/web/pax-web-extender-whiteboard/1.0.4-SNAPSHOT/pax-web-extender-whiteboard-1.0.4-20110518.205548-2.jar
[INFO] Unable to find resource 'org.eclipse.jetty:jetty-servlet:jar:7.4.1.v20110513' in repository
servicemix (http://svn.apache.org/repos/asf/servicemix/m2-repo)
Downloading: http://repo1.maven.org/maven2/org/eclipse/jetty/jetty-servlet/7.4.1.v20110513/jetty-servlet-7.4.1.v20110513.jar

Downloading: http://svn.apache.org/repos/asf/servicemix/m2-repo/org/eclipse/jetty/jetty-xml/7.4.1.v20110513/jetty-xml-7.4.1.v20110513.jar
[INFO] Unable to find resource 'org.eclipse.jetty:jetty-xml:jar:7.4.1.v20110513' in repository
servicemix (http://svn.apache.org/repos/asf/servicemix/m2-repo)
Downloading: http://repo1.maven.org/maven2/org/eclipse/jetty/jetty-xml/7.4.1.v20110513/jetty-xml-7.4.1.v20110513.jar

1016K downloaded  (pax-web-extender-whiteboard-1.0.4-20110518.205548-2.jar)
Downloading: https://oss.sonatype.org/content/repositories/ops4j-snapshots//org/ops4j/pax/web/pax-web-deployer/1.0.4-SNAPSHOT/pax-web-deployer-1.0.4-20110518.205600-2.jar
[INFO] snapshot org.apache.karaf.webconsole:org.apache.karaf.webconsole.gogo:2.2.2-SNAPSHOT:
checking for updates from ops4j.sonatype.snapshots.deploy
[INFO] snapshot org.apache.karaf.shell:org.apache.karaf.shell.packages:2.2.2-SNAPSHOT: checking
for updates from ops4j.sonatype.snapshots.deploy
22K downloaded  (pax-web-deployer-1.0.4-20110518.205600-2.jar)
[INFO] snapshot org.apache.karaf.webconsole:org.apache.karaf.webconsole.gogo:2.2.2-SNAPSHOT:
checking for updates from apache.snapshots
[INFO] snapshot org.apache.karaf.shell:org.apache.karaf.shell.packages:2.2.2-SNAPSHOT: checking
for updates from apache.snapshots
[INFO] snapshot org.apache.karaf.shell:org.apache.karaf.shell.commands:2.2.2-SNAPSHOT: checking
for updates from fusesource.snapshots
[INFO] snapshot org.apache.karaf.shell:org.apache.karaf.shell.commands:2.2.2-SNAPSHOT: checking
for updates from ops4j.sonatype.snapshots.deploy
[INFO] snapshot org.apache.karaf.shell:org.apache.karaf.shell.commands:2.2.2-SNAPSHOT: checking
for updates from apache.snapshots
[INFO] snapshot org.apache.karaf.shell:org.apache.karaf.shell.ssh:2.2.2-SNAPSHOT: checking
for updates from fusesource.snapshots
[INFO] snapshot org.apache.karaf.shell:org.apache.karaf.shell.ssh:2.2.2-SNAPSHOT: checking
for updates from ops4j.sonatype.snapshots.deploy
[INFO] snapshot org.apache.karaf.shell:org.apache.karaf.shell.ssh:2.2.2-SNAPSHOT: checking
for updates from apache.snapshots
[INFO] snapshot org.apache.karaf.shell:org.apache.karaf.shell.dev:2.2.2-SNAPSHOT: checking
for updates from fusesource.snapshots
[INFO] snapshot org.apache.karaf.shell:org.apache.karaf.shell.dev:2.2.2-SNAPSHOT: checking
for updates from ops4j.sonatype.snapshots.deploy
[INFO] snapshot org.apache.karaf.shell:org.apache.karaf.shell.dev:2.2.2-SNAPSHOT: checking
for updates from apache.snapshots
[INFO] snapshot org.apache.karaf.diagnostic:org.apache.karaf.diagnostic.common:2.2.2-SNAPSHOT:
checking for updates from ops4j.sonatype.snapshots.deploy
[INFO] snapshot org.apache.karaf.diagnostic:org.apache.karaf.diagnostic.common:2.2.2-SNAPSHOT:
checking for updates from apache.snapshots
[INFO] snapshot org.apache.karaf.diagnostic:org.apache.karaf.diagnostic.command:2.2.2-SNAPSHOT:
checking for updates from fusesource.snapshots
[INFO] snapshot org.apache.karaf.diagnostic:org.apache.karaf.diagnostic.command:2.2.2-SNAPSHOT:
checking for updates from ops4j.sonatype.snapshots.deploy
[INFO] snapshot org.apache.karaf.diagnostic:org.apache.karaf.diagnostic.command:2.2.2-SNAPSHOT:
checking for updates from apache.snapshots
[INFO] snapshot org.apache.karaf.diagnostic:org.apache.karaf.diagnostic.management:2.2.2-SNAPSHOT:
checking for updates from fusesource.snapshots
[INFO] snapshot org.apache.karaf.diagnostic:org.apache.karaf.diagnostic.management:2.2.2-SNAPSHOT:
checking for updates from ops4j.sonatype.snapshots.deploy
[INFO] snapshot org.apache.karaf.diagnostic:org.apache.karaf.diagnostic.management:2.2.2-SNAPSHOT:
checking for updates from apache.snapshots
[INFO] [enforcer:enforce {execution: enforce-versions}]
[INFO] [bundle:cleanVersions {execution: cleanVersions}]
[INFO] [remote-resources:process {execution: default}]
[INFO] [antrun:run {execution: copy-notice}]
[INFO] Executing tasks

main:
     [copy] Warning: Could not find file <https://builds.apache.org/hudson/job/Karaf-2.2.x/ws/karaf/assemblies/apache-karaf/NOTICE>
to copy.
[INFO] Executed tasks
[INFO] [resources:resources {execution: filter}]
[INFO] Using 'UTF-8' encoding to copy filtered resources.
[INFO] Copying 14 resources
[INFO] Copying 0 resource
[INFO] Copying 3 resources
Downloading: http://repo1.maven.org/maven2/org/codehaus/plexus/plexus-archiver/1.0-alpha-9/plexus-archiver-1.0-alpha-9.pom

Downloading: http://svn.apache.org/repos/asf/servicemix/m2-repo/org/codehaus/plexus/plexus-io/1.0-alpha-1/plexus-io-1.0-alpha-1.pom
[INFO] Unable to find resource 'org.codehaus.plexus:plexus-io:pom:1.0-alpha-1' in repository
servicemix (http://svn.apache.org/repos/asf/servicemix/m2-repo)
Downloading: http://repo1.maven.org/maven2/org/codehaus/plexus/plexus-io/1.0-alpha-1/plexus-io-1.0-alpha-1.pom

Downloading: http://repo1.maven.org/maven2/org/codehaus/plexus/plexus-utils/1.4.6/plexus-utils-1.4.6.pom

Downloading: http://repo1.maven.org/maven2/org/apache/maven/shared/file-management/1.1/file-management-1.1.pom

Downloading: http://svn.apache.org/repos/asf/servicemix/m2-repo/org/apache/maven/shared/maven-shared-io/1.0/maven-shared-io-1.0.pom
[INFO] Unable to find resource 'org.apache.maven.shared:maven-shared-io:pom:1.0' in repository
servicemix (http://svn.apache.org/repos/asf/servicemix/m2-repo)
Downloading: http://repo1.maven.org/maven2/org/apache/maven/shared/maven-shared-io/1.0/maven-shared-io-1.0.pom

Downloading: http://repo1.maven.org/maven2/org/apache/maven/shared/maven-dependency-analyzer/1.1/maven-dependency-analyzer-1.1.pom

Downloading: http://svn.apache.org/repos/asf/servicemix/m2-repo/asm/asm/3.0/asm-3.0.pom
[INFO] Unable to find resource 'asm:asm:pom:3.0' in repository servicemix (http://svn.apache.org/repos/asf/servicemix/m2-repo)
Downloading: http://repo1.maven.org/maven2/asm/asm/3.0/asm-3.0.pom

Downloading: http://svn.apache.org/repos/asf/servicemix/m2-repo/asm/asm-parent/3.0/asm-parent-3.0.pom
[INFO] Unable to find resource 'asm:asm-parent:pom:3.0' in repository servicemix (http://svn.apache.org/repos/asf/servicemix/m2-repo)
Downloading: http://repo1.maven.org/maven2/asm/asm-parent/3.0/asm-parent-3.0.pom

Downloading: http://repo1.maven.org/maven2/org/apache/maven/reporting/maven-reporting-impl/2.0.4/maven-reporting-impl-2.0.4.pom

Downloading: http://svn.apache.org/repos/asf/servicemix/m2-repo/org/apache/maven/doxia/doxia-core/1.0-alpha-7/doxia-core-1.0-alpha-7.pom
[INFO] Unable to find resource 'org.apache.maven.doxia:doxia-core:pom:1.0-alpha-7' in repository
servicemix (http://svn.apache.org/repos/asf/servicemix/m2-repo)
Downloading: http://repo1.maven.org/maven2/org/apache/maven/doxia/doxia-core/1.0-alpha-7/doxia-core-1.0-alpha-7.pom

Downloading: http://svn.apache.org/repos/asf/servicemix/m2-repo/oro/oro/2.0.7/oro-2.0.7.pom
[INFO] Unable to find resource 'oro:oro:pom:2.0.7' in repository servicemix (http://svn.apache.org/repos/asf/servicemix/m2-repo)
Downloading: http://repo1.maven.org/maven2/oro/oro/2.0.7/oro-2.0.7.pom

Downloading: http://svn.apache.org/repos/asf/servicemix/m2-repo/org/apache/maven/doxia/doxia-site-renderer/1.0-alpha-7/doxia-site-renderer-1.0-alpha-7.pom
[INFO] Unable to find resource 'org.apache.maven.doxia:doxia-site-renderer:pom:1.0-alpha-7'
in repository servicemix (http://svn.apache.org/repos/asf/servicemix/m2-repo)
Downloading: http://repo1.maven.org/maven2/org/apache/maven/doxia/doxia-site-renderer/1.0-alpha-7/doxia-site-renderer-1.0-alpha-7.pom

Downloading: http://svn.apache.org/repos/asf/servicemix/m2-repo/org/codehaus/plexus/plexus-velocity/1.1.2/plexus-velocity-1.1.2.pom
[INFO] Unable to find resource 'org.codehaus.plexus:plexus-velocity:pom:1.1.2' in repository
servicemix (http://svn.apache.org/repos/asf/servicemix/m2-repo)
Downloading: http://repo1.maven.org/maven2/org/codehaus/plexus/plexus-velocity/1.1.2/plexus-velocity-1.1.2.pom

Downloading: http://svn.apache.org/repos/asf/servicemix/m2-repo/commons-logging/commons-logging-api/1.0.4/commons-logging-api-1.0.4.pom
[INFO] Unable to find resource 'commons-logging:commons-logging-api:pom:1.0.4' in repository
servicemix (http://svn.apache.org/repos/asf/servicemix/m2-repo)
Downloading: http://repo1.maven.org/maven2/commons-logging/commons-logging-api/1.0.4/commons-logging-api-1.0.4.pom

Downloading: http://svn.apache.org/repos/asf/servicemix/m2-repo/org/apache/maven/doxia/doxia-decoration-model/1.0-alpha-7/doxia-decoration-model-1.0-alpha-7.pom
[INFO] Unable to find resource 'org.apache.maven.doxia:doxia-decoration-model:pom:1.0-alpha-7'
in repository servicemix (http://svn.apache.org/repos/asf/servicemix/m2-repo)
Downloading: http://repo1.maven.org/maven2/org/apache/maven/doxia/doxia-decoration-model/1.0-alpha-7/doxia-decoration-model-1.0-alpha-7.pom

Downloading: http://svn.apache.org/repos/asf/servicemix/m2-repo/org/apache/maven/doxia/doxia-core/1.0-alpha-7/doxia-core-1.0-alpha-7.jar
Downloading: http://svn.apache.org/repos/asf/servicemix/m2-repo/commons-logging/commons-logging-api/1.0.4/commons-logging-api-1.0.4.jar
Downloading: http://repo1.maven.org/maven2/org/codehaus/plexus/plexus-utils/1.4.6/plexus-utils-1.4.6.jar
Downloading: http://svn.apache.org/repos/asf/servicemix/m2-repo/oro/oro/2.0.7/oro-2.0.7.jar
Downloading: http://svn.apache.org/repos/asf/servicemix/m2-repo/asm/asm/3.0/asm-3.0.jar
[INFO] Unable to find resource 'commons-logging:commons-logging-api:jar:1.0.4' in repository
servicemix (http://svn.apache.org/repos/asf/servicemix/m2-repo)
[INFO] Unable to find resource 'oro:oro:jar:2.0.7' in repository servicemix (http://svn.apache.org/repos/asf/servicemix/m2-repo)
[INFO] Unable to find resource 'asm:asm:jar:3.0' in repository servicemix (http://svn.apache.org/repos/asf/servicemix/m2-repo)
Downloading: http://repo1.maven.org/maven2/commons-logging/commons-logging-api/1.0.4/commons-logging-api-1.0.4.jar
[INFO] Unable to find resource 'org.apache.maven.doxia:doxia-core:jar:1.0-alpha-7' in repository
servicemix (http://svn.apache.org/repos/asf/servicemix/m2-repo)
Downloading: http://repo1.maven.org/maven2/oro/oro/2.0.7/oro-2.0.7.jar
Downloading: http://repo1.maven.org/maven2/asm/asm/3.0/asm-3.0.jar
Downloading: http://repo1.maven.org/maven2/org/apache/maven/doxia/doxia-core/1.0-alpha-7/doxia-core-1.0-alpha-7.jar





Downloading: http://repo1.maven.org/maven2/org/apache/maven/shared/file-management/1.1/file-management-1.1.jar
Downloading: http://repo1.maven.org/maven2/org/apache/maven/reporting/maven-reporting-impl/2.0.4/maven-reporting-impl-2.0.4.jar
Downloading: http://svn.apache.org/repos/asf/servicemix/m2-repo/commons-collections/commons-collections/2.1/commons-collections-2.1.jar
[INFO] Unable to find resource 'commons-collections:commons-collections:jar:2.1' in repository
servicemix (http://svn.apache.org/repos/asf/servicemix/m2-repo)
Downloading: http://repo1.maven.org/maven2/commons-collections/commons-collections/2.1/commons-collections-2.1.jar
Downloading: http://svn.apache.org/repos/asf/servicemix/m2-repo/plexus/plexus-utils/1.0.2/plexus-utils-1.0.2.jar
[INFO] Unable to find resource 'plexus:plexus-utils:jar:1.0.2' in repository servicemix (http://svn.apache.org/repos/asf/servicemix/m2-repo)
Downloading: http://repo1.maven.org/maven2/plexus/plexus-utils/1.0.2/plexus-utils-1.0.2.jar
Downloading: http://svn.apache.org/repos/asf/servicemix/m2-repo/org/apache/maven/doxia/doxia-site-renderer/1.0-alpha-7/doxia-site-renderer-1.0-alpha-7.jar
[INFO] Unable to find resource 'org.apache.maven.doxia:doxia-site-renderer:jar:1.0-alpha-7'
in repository servicemix (http://svn.apache.org/repos/asf/servicemix/m2-repo)
Downloading: http://repo1.maven.org/maven2/org/apache/maven/doxia/doxia-site-renderer/1.0-alpha-7/doxia-site-renderer-1.0-alpha-7.jar





Downloading: http://repo1.maven.org/maven2/org/codehaus/plexus/plexus-archiver/1.0-alpha-9/plexus-archiver-1.0-alpha-9.jar
Downloading: http://svn.apache.org/repos/asf/servicemix/m2-repo/org/apache/maven/shared/maven-shared-io/1.0/maven-shared-io-1.0.jar
[INFO] Unable to find resource 'org.apache.maven.shared:maven-shared-io:jar:1.0' in repository
servicemix (http://svn.apache.org/repos/asf/servicemix/m2-repo)
Downloading: http://repo1.maven.org/maven2/org/apache/maven/shared/maven-shared-io/1.0/maven-shared-io-1.0.jar
Downloading: http://svn.apache.org/repos/asf/servicemix/m2-repo/org/apache/maven/doxia/doxia-decoration-model/1.0-alpha-7/doxia-decoration-model-1.0-alpha-7.jar
[INFO] Unable to find resource 'org.apache.maven.doxia:doxia-decoration-model:jar:1.0-alpha-7'
in repository servicemix (http://svn.apache.org/repos/asf/servicemix/m2-repo)
Downloading: http://repo1.maven.org/maven2/org/apache/maven/doxia/doxia-decoration-model/1.0-alpha-7/doxia-decoration-model-1.0-alpha-7.jar



Downloading: http://repo1.maven.org/maven2/org/codehaus/plexus/plexus-io/1.0-alpha-1/plexus-io-1.0-alpha-1.jar
Downloading: http://repo1.maven.org/maven2/org/apache/maven/shared/maven-dependency-analyzer/1.1/maven-dependency-analyzer-1.1.jar


Downloading: http://svn.apache.org/repos/asf/servicemix/m2-repo/org/codehaus/plexus/plexus-velocity/1.1.2/plexus-velocity-1.1.2.jar
[INFO] Unable to find resource 'org.codehaus.plexus:plexus-velocity:jar:1.1.2' in repository
servicemix (http://svn.apache.org/repos/asf/servicemix/m2-repo)
Downloading: http://repo1.maven.org/maven2/org/codehaus/plexus/plexus-velocity/1.1.2/plexus-velocity-1.1.2.jar

[INFO] [dependency:copy {execution: copy}]
[INFO] Configured Artifact: org.apache.karaf:org.apache.karaf.main:?:jar
[INFO] Configured Artifact: org.apache.karaf:org.apache.karaf.client:?:jar
[INFO] Configured Artifact: org.apache.karaf.jaas:org.apache.karaf.jaas.boot:?:jar
[INFO] Copying org.apache.karaf.main-2.2.2-SNAPSHOT.jar to <https://builds.apache.org/hudson/job/Karaf-2.2.x/ws/karaf/assemblies/apache-karaf/target/dependencies/lib/karaf.jar>
[INFO] Copying org.apache.karaf.client-2.2.2-SNAPSHOT.jar to <https://builds.apache.org/hudson/job/Karaf-2.2.x/ws/karaf/assemblies/apache-karaf/target/dependencies/lib/bin/karaf-client.jar>
[INFO] Copying org.apache.karaf.jaas.boot-2.2.2-SNAPSHOT.jar to <https://builds.apache.org/hudson/job/Karaf-2.2.x/ws/karaf/assemblies/apache-karaf/target/dependencies/lib/karaf-jaas-boot.jar>
[INFO] Preparing features:add-features-to-repo
[WARNING] Removing: add-features-to-repo from forked lifecycle, to prevent recursive invocation.
[JENKINS] Archiving <https://builds.apache.org/hudson/job/Karaf-2.2.x/ws/karaf/assemblies/apache-karaf/pom.xml>
to /home/hudson/hudson/jobs/Karaf-2.2.x/modules/org.apache.karaf$apache-karaf/builds/2011-05-31_20-06-55/archive/org.apache.karaf/apache-karaf/2.2.2-SNAPSHOT/apache-karaf-2.2.2-SNAPSHOT.pom
[INFO] [enforcer:enforce {execution: enforce-versions}]
[INFO] [bundle:cleanVersions {execution: cleanVersions}]
[INFO] [remote-resources:process {execution: default}]
[INFO] [antrun:run {execution: copy-notice}]
[INFO] Executing tasks

main:
     [copy] Warning: Could not find file <https://builds.apache.org/hudson/job/Karaf-2.2.x/ws/karaf/assemblies/apache-karaf/NOTICE>
to copy.
[INFO] Executed tasks
[INFO] [resources:resources {execution: filter}]
[INFO] Using 'UTF-8' encoding to copy filtered resources.
[INFO] Copying 14 resources
[INFO] Copying 0 resource
[INFO] Copying 3 resources
[INFO] Copying 3 resources
[INFO] [dependency:copy {execution: copy}]
[INFO] Configured Artifact: org.apache.karaf:org.apache.karaf.main:?:jar
[INFO] Configured Artifact: org.apache.karaf:org.apache.karaf.client:?:jar
[INFO] Configured Artifact: org.apache.karaf.jaas:org.apache.karaf.jaas.boot:?:jar
[INFO] org.apache.karaf:org.apache.karaf.main:2.2.2-SNAPSHOT:jar already exists in <https://builds.apache.org/hudson/job/Karaf-2.2.x/ws/karaf/assemblies/apache-karaf/target/dependencies/lib>
[INFO] org.apache.karaf:org.apache.karaf.client:2.2.2-SNAPSHOT:jar already exists in <https://builds.apache.org/hudson/job/Karaf-2.2.x/ws/karaf/assemblies/apache-karaf/target/dependencies/lib/bin>
[INFO] org.apache.karaf.jaas:org.apache.karaf.jaas.boot:2.2.2-SNAPSHOT:jar already exists
in <https://builds.apache.org/hudson/job/Karaf-2.2.x/ws/karaf/assemblies/apache-karaf/target/dependencies/lib>
[INFO] [features:add-features-to-repo {execution: add-features-to-repo}]
[INFO] Copying bundle: org.apache.karaf.assemblies.features:enterprise:xml:features:2.2.2-SNAPSHOT
[INFO] snapshot org.apache.karaf.assemblies.features:enterprise:2.2.2-SNAPSHOT: checking for
updates from fusesource.snapshots
[INFO] snapshot org.apache.karaf.assemblies.features:enterprise:2.2.2-SNAPSHOT: checking for
updates from ops4j.sonatype.snapshots.deploy
[INFO] snapshot org.apache.karaf.assemblies.features:enterprise:2.2.2-SNAPSHOT: checking for
updates from apache.snapshots
[INFO] Copying bundle: org.apache.karaf.assemblies.features:standard:xml:features:2.2.2-SNAPSHOT
[INFO] snapshot org.apache.karaf.assemblies.features:standard:2.2.2-SNAPSHOT: checking for
updates from fusesource.snapshots
[INFO] snapshot org.apache.karaf.assemblies.features:standard:2.2.2-SNAPSHOT: checking for
updates from ops4j.sonatype.snapshots.deploy
[INFO] snapshot org.apache.karaf.assemblies.features:standard:2.2.2-SNAPSHOT: checking for
updates from apache.snapshots
[INFO] ------------------------------------------------------------------------
[ERROR] BUILD ERROR
[INFO] ------------------------------------------------------------------------
[INFO] Error populating repository

Embedded error: Unable to find the feature 'config'
[INFO] ------------------------------------------------------------------------
[INFO] Trace
org.apache.maven.lifecycle.LifecycleExecutionException: Error populating repository
	at org.apache.maven.lifecycle.DefaultLifecycleExecutor.executeGoals(DefaultLifecycleExecutor.java:719)
	at org.apache.maven.lifecycle.DefaultLifecycleExecutor.executeGoalWithLifecycle(DefaultLifecycleExecutor.java:556)
	at org.apache.maven.lifecycle.DefaultLifecycleExecutor.executeGoal(DefaultLifecycleExecutor.java:535)
	at org.apache.maven.lifecycle.DefaultLifecycleExecutor.executeGoalAndHandleFailures(DefaultLifecycleExecutor.java:387)
	at org.apache.maven.lifecycle.DefaultLifecycleExecutor.executeTaskSegments(DefaultLifecycleExecutor.java:348)
	at org.apache.maven.lifecycle.DefaultLifecycleExecutor.execute(DefaultLifecycleExecutor.java:180)
	at org.apache.maven.lifecycle.LifecycleExecutorInterceptor.execute(LifecycleExecutorInterceptor.java:65)
	at org.apache.maven.DefaultMaven.doExecute(DefaultMaven.java:328)
	at org.apache.maven.DefaultMaven.execute(DefaultMaven.java:138)
	at org.apache.maven.cli.MavenCli.main(MavenCli.java:362)
	at sun.reflect.NativeMethodAccessorImpl.invoke0(Native Method)
	at sun.reflect.NativeMethodAccessorImpl.invoke(NativeMethodAccessorImpl.java:39)
	at sun.reflect.DelegatingMethodAccessorImpl.invoke(DelegatingMethodAccessorImpl.java:25)
	at java.lang.reflect.Method.invoke(Method.java:592)
	at org.codehaus.classworlds.Launcher.launchEnhanced(Launcher.java:315)
	at org.codehaus.classworlds.Launcher.launch(Launcher.java:255)
	at hudson.maven.agent.Main.launch(Main.java:185)
	at hudson.maven.MavenBuilder.call(MavenBuilder.java:164)
	at hudson.maven.MavenModuleSetBuild$Builder.call(MavenModuleSetBuild.java:987)
	at hudson.maven.MavenModuleSetBuild$Builder.call(MavenModuleSetBuild.java:918)
	at hudson.remoting.UserRequest.perform(UserRequest.java:118)
	at hudson.remoting.UserRequest.perform(UserRequest.java:48)
	at hudson.remoting.Request$2.run(Request.java:270)
	at java.util.concurrent.Executors$RunnableAdapter.call(Executors.java:417)
	at java.util.concurrent.FutureTask$Sync.innerRun(FutureTask.java:269)
	at java.util.concurrent.FutureTask.run(FutureTask.java:123)
	at java.util.concurrent.ThreadPoolExecutor$Worker.runTask(ThreadPoolExecutor.java:651)
	at java.util.concurrent.ThreadPoolExecutor$Worker.run(ThreadPoolExecutor.java:676)
	at java.lang.Thread.run(Thread.java:595)
Caused by: org.apache.maven.plugin.MojoExecutionException: Error populating repository
	at org.apache.karaf.tooling.features.AddFeaturesToRepoMojo.execute(AddFeaturesToRepoMojo.java:221)
	at org.apache.maven.plugin.DefaultPluginManager.executeMojo(DefaultPluginManager.java:490)
	at hudson.maven.agent.PluginManagerInterceptor.executeMojo(PluginManagerInterceptor.java:182)
	at org.apache.maven.lifecycle.DefaultLifecycleExecutor.executeGoals(DefaultLifecycleExecutor.java:694)
	... 28 more
Caused by: java.lang.IllegalArgumentException: Unable to find the feature 'config'
	at org.apache.karaf.tooling.features.AddFeaturesToRepoMojo.addFeatures(AddFeaturesToRepoMojo.java:257)
	at org.apache.karaf.tooling.features.AddFeaturesToRepoMojo.execute(AddFeaturesToRepoMojo.java:171)
	... 31 more
[INFO] ------------------------------------------------------------------------
[INFO] Total time: 20 minutes 19 seconds
[INFO] Finished at: Tue May 31 20:27:55 UTC 2011
[INFO] Final Memory: 92M/324M
[INFO] ------------------------------------------------------------------------
Sending e-mails to: commits@karaf.apache.org
channel stopped


Mime
View raw message