karaf-commits mailing list archives

Site index · List index
Message view « Date » · « Thread »
Top « Date » · « Thread »
From Apache Jenkins Server <hud...@hudson.apache.org>
Subject Build failed in Jenkins: Karaf-2.2.x #123
Date Wed, 18 May 2011 15:17:09 GMT
See <https://builds.apache.org/hudson/job/Karaf-2.2.x/123/changes>

Changes:

[gawor] KARAF-496: Karaf prompt displayed twice on Windows with unsupported terminal

------------------------------------------
[...truncated 5820 lines...]

-------------------------------------------------------
 T E S T S
-------------------------------------------------------
Running org.apache.karaf.shell.dev.util.BundlesTest
Tests run: 1, Failures: 0, Errors: 0, Skipped: 0, Time elapsed: 0.015 sec
Running org.apache.karaf.shell.dev.util.TreeTest
Tests run: 6, Failures: 0, Errors: 0, Skipped: 0, Time elapsed: 0.011 sec
Running org.apache.karaf.shell.dev.framework.EquinoxTest
- set osgi.debug=etc/equinox-debug.properties in etc/config.properties
- created etc/equinox-debug.properties to configure Equinox debugging options

Enable specific debug options in etc/equinox-debug.properties
and restart Karaf now to enable Equinox debug logging
- removed osgi.debug from etc/config.properties

Restart Karaf now to disable Equinox debug logging
Tests run: 2, Failures: 0, Errors: 0, Skipped: 0, Time elapsed: 0.11 sec
Running org.apache.karaf.shell.dev.util.ImportTest
Tests run: 5, Failures: 0, Errors: 0, Skipped: 0, Time elapsed: 0.019 sec
Running org.apache.karaf.shell.dev.framework.FelixTest
- set felix.log.level=4 in etc/config.properties

Restart Karaf now to enable Felix debug logging
- removed felix.log.level from etc/config.properties

Restart Karaf now to disable Felix debug logging
Tests run: 2, Failures: 0, Errors: 0, Skipped: 0, Time elapsed: 0.054 sec

Results :

Tests run: 16, Failures: 0, Errors: 0, Skipped: 0

[JENKINS] Recording test results
[INFO] [bundle:bundle {execution: default-bundle}]
[WARNING] Warning building bundle org.apache.karaf.shell:org.apache.karaf.shell.dev:bundle:2.2.2-SNAPSHOT
: Split package org/apache/karaf/util
Use directive -split-package:=(merge-first|merge-last|error|first) on Export/Private Package
instruction to get rid of this warning
Package found in   [Jar:org.apache.karaf.jaas.modules, Jar:org.apache.karaf.util]
Reference from     <https://builds.apache.org/hudson/job/Karaf-2.2.x/ws/karaf/util/target/org.apache.karaf.util-2.2.2-SNAPSHOT.jar>
Classpath          [Jar:., Jar:org.apache.karaf.shell.console, Jar:jline, Jar:jansi, Jar:org.osgi.core,
Jar:org.osgi.compendium, Jar:org.apache.karaf.jaas.modules, Jar:org.apache.karaf.jaas.config,
Jar:org.apache.karaf.jaas.boot, Jar:org.apache.karaf.util, Jar:org.apache.aries.blueprint,
Jar:org.apache.aries.util, Jar:slf4j-api, Jar:org.apache.aries.testsupport.unit, Jar:org.apache.aries.proxy.api,
Jar:org.apache.felix.gogo.runtime, Jar:pax-url-wrap, Jar:pax-url-mvn, Jar:org.apache.felix.utils]
[WARNING] Warning building bundle org.apache.karaf.shell:org.apache.karaf.shell.dev:bundle:2.2.2-SNAPSHOT
: Did not find matching referal for !org.apache.karaf.shell.dev*
[INFO] [install:install {execution: default-install}]
[INFO] Installing <https://builds.apache.org/hudson/job/Karaf-2.2.x/ws/karaf/shell/dev/target/org.apache.karaf.shell.dev-2.2.2-SNAPSHOT.jar>
to <https://builds.apache.org/hudson/job/Karaf-2.2.x/ws/.repository/org/apache/karaf/shell/org.apache.karaf.shell.dev/2.2.2-SNAPSHOT/org.apache.karaf.shell.dev-2.2.2-SNAPSHOT.jar>
[INFO] [bundle:install {execution: default-install}]
[INFO] Installing org/apache/karaf/shell/org.apache.karaf.shell.dev/2.2.2-SNAPSHOT/org.apache.karaf.shell.dev-2.2.2-SNAPSHOT.jar
[INFO] Writing OBR metadata
[JENKINS] Archiving <https://builds.apache.org/hudson/job/Karaf-2.2.x/ws/karaf/shell/dev/pom.xml>
to /home/hudson/hudson/jobs/Karaf-2.2.x/modules/org.apache.karaf.shell$org.apache.karaf.shell.dev/builds/2011-05-18_15-04-44/archive/org.apache.karaf.shell/org.apache.karaf.shell.dev/2.2.2-SNAPSHOT/org.apache.karaf.shell.dev-2.2.2-SNAPSHOT.pom
[JENKINS] Archiving <https://builds.apache.org/hudson/job/Karaf-2.2.x/ws/karaf/shell/dev/target/org.apache.karaf.shell.dev-2.2.2-SNAPSHOT.jar>
to /home/hudson/hudson/jobs/Karaf-2.2.x/modules/org.apache.karaf.shell$org.apache.karaf.shell.dev/builds/2011-05-18_15-04-44/archive/org.apache.karaf.shell/org.apache.karaf.shell.dev/2.2.2-SNAPSHOT/org.apache.karaf.shell.dev-2.2.2-SNAPSHOT.jar
[INFO] ------------------------------------------------------------------------
[INFO] Building Apache Karaf :: Shell :: Web Commands
[INFO]    task-segment: [clean, install]
[INFO] ------------------------------------------------------------------------
[INFO] [clean:clean {execution: default-clean}]
[INFO] [bundle:cleanVersions {execution: cleanVersions}]
[INFO] [remote-resources:process {execution: default}]
[INFO] snapshot org.ops4j.pax.web:pax-web-spi:1.0.4-SNAPSHOT: checking for updates from fusesource.snapshots
[INFO] snapshot org.ops4j.pax.web:pax-web-spi:1.0.4-SNAPSHOT: checking for updates from ops4j.sonatype.snapshots.deploy
[INFO] snapshot org.ops4j.pax.web:pax-web-spi:1.0.4-SNAPSHOT: checking for updates from apache.snapshots
Downloading: http://repo.fusesource.com/nexus/content/repositories/snapshots/org/ops4j/pax/web/pax-web-spi/1.0.4-SNAPSHOT/pax-web-spi-1.0.4-SNAPSHOT.pom
[INFO] Unable to find resource 'org.ops4j.pax.web:pax-web-spi:pom:1.0.4-SNAPSHOT' in repository
fusesource.snapshots (http://repo.fusesource.com/nexus/content/repositories/snapshots)
Downloading: https://oss.sonatype.org/content/repositories/ops4j-snapshots//org/ops4j/pax/web/pax-web-spi/1.0.4-SNAPSHOT/pax-web-spi-1.0.4-SNAPSHOT.pom
[INFO] Unable to find resource 'org.ops4j.pax.web:pax-web-spi:pom:1.0.4-SNAPSHOT' in repository
ops4j.sonatype.snapshots.deploy (https://oss.sonatype.org/content/repositories/ops4j-snapshots/)
Downloading: http://repository.apache.org/snapshots/org/ops4j/pax/web/pax-web-spi/1.0.4-SNAPSHOT/pax-web-spi-1.0.4-SNAPSHOT.pom
[INFO] Unable to find resource 'org.ops4j.pax.web:pax-web-spi:pom:1.0.4-SNAPSHOT' in repository
apache.snapshots (http://repository.apache.org/snapshots)
Downloading: http://repo.fusesource.com/nexus/content/repositories/snapshots/org/ops4j/pax/web/pax-web-spi/1.0.4-SNAPSHOT/pax-web-spi-1.0.4-SNAPSHOT.jar
[INFO] Unable to find resource 'org.ops4j.pax.web:pax-web-spi:jar:1.0.4-SNAPSHOT' in repository
fusesource.snapshots (http://repo.fusesource.com/nexus/content/repositories/snapshots)
Downloading: https://oss.sonatype.org/content/repositories/ops4j-snapshots//org/ops4j/pax/web/pax-web-spi/1.0.4-SNAPSHOT/pax-web-spi-1.0.4-SNAPSHOT.jar
[INFO] Unable to find resource 'org.ops4j.pax.web:pax-web-spi:jar:1.0.4-SNAPSHOT' in repository
ops4j.sonatype.snapshots.deploy (https://oss.sonatype.org/content/repositories/ops4j-snapshots/)
Downloading: http://repository.apache.org/snapshots/org/ops4j/pax/web/pax-web-spi/1.0.4-SNAPSHOT/pax-web-spi-1.0.4-SNAPSHOT.jar
[INFO] Unable to find resource 'org.ops4j.pax.web:pax-web-spi:jar:1.0.4-SNAPSHOT' in repository
apache.snapshots (http://repository.apache.org/snapshots)
[JENKINS] Archiving <https://builds.apache.org/hudson/job/Karaf-2.2.x/ws/karaf/shell/web/pom.xml>
to /home/hudson/hudson/jobs/Karaf-2.2.x/modules/org.apache.karaf.shell$org.apache.karaf.shell.web/builds/2011-05-18_15-04-44/archive/org.apache.karaf.shell/org.apache.karaf.shell.web/2.2.2-SNAPSHOT/org.apache.karaf.shell.web-2.2.2-SNAPSHOT.pom
[INFO] ------------------------------------------------------------------------
[ERROR] BUILD ERROR
[INFO] ------------------------------------------------------------------------
[INFO] Failed to resolve artifact.

Missing:
----------
1) org.ops4j.pax.web:pax-web-spi:jar:1.0.4-SNAPSHOT

  Try downloading the file manually from the project website.

  Then, install it using the command: 
      mvn install:install-file -DgroupId=org.ops4j.pax.web -DartifactId=pax-web-spi -Dversion=1.0.4-SNAPSHOT
-Dpackaging=jar -Dfile=/path/to/file

  Alternatively, if you host your own repository you can deploy the file there: 
      mvn deploy:deploy-file -DgroupId=org.ops4j.pax.web -DartifactId=pax-web-spi -Dversion=1.0.4-SNAPSHOT
-Dpackaging=jar -Dfile=/path/to/file -Durl=[url] -DrepositoryId=[id]

  Path to dependency: 
  	1) org.apache.karaf.shell:org.apache.karaf.shell.web:bundle:2.2.2-SNAPSHOT
  	2) org.ops4j.pax.web:pax-web-spi:jar:1.0.4-SNAPSHOT

----------
1 required artifact is missing.

for artifact: 
  org.apache.karaf.shell:org.apache.karaf.shell.web:bundle:2.2.2-SNAPSHOT

from the specified remote repositories:
  central (http://repo1.maven.org/maven2),
  fusesource.snapshots (http://repo.fusesource.com/nexus/content/repositories/snapshots),
  Nexus (http://repository.apache.org/snapshots),
  ops4j.sonatype.snapshots.deploy (https://oss.sonatype.org/content/repositories/ops4j-snapshots/),
  servicemix (http://svn.apache.org/repos/asf/servicemix/m2-repo)



[INFO] ------------------------------------------------------------------------
[INFO] Trace
org.apache.maven.lifecycle.LifecycleExecutionException: Failed to resolve dependencies for
one or more projects in the reactor. Reason: Missing:
----------
1) org.ops4j.pax.web:pax-web-spi:jar:1.0.4-SNAPSHOT

  Try downloading the file manually from the project website.

  Then, install it using the command: 
      mvn install:install-file -DgroupId=org.ops4j.pax.web -DartifactId=pax-web-spi -Dversion=1.0.4-SNAPSHOT
-Dpackaging=jar -Dfile=/path/to/file

  Alternatively, if you host your own repository you can deploy the file there: 
      mvn deploy:deploy-file -DgroupId=org.ops4j.pax.web -DartifactId=pax-web-spi -Dversion=1.0.4-SNAPSHOT
-Dpackaging=jar -Dfile=/path/to/file -Durl=[url] -DrepositoryId=[id]

  Path to dependency: 
  	1) org.apache.karaf.shell:org.apache.karaf.shell.web:bundle:2.2.2-SNAPSHOT
  	2) org.ops4j.pax.web:pax-web-spi:jar:1.0.4-SNAPSHOT

----------
1 required artifact is missing.

for artifact: 
  org.apache.karaf.shell:org.apache.karaf.shell.web:bundle:2.2.2-SNAPSHOT

from the specified remote repositories:
  central (http://repo1.maven.org/maven2),
  fusesource.snapshots (http://repo.fusesource.com/nexus/content/repositories/snapshots),
  Nexus (http://repository.apache.org/snapshots),
  ops4j.sonatype.snapshots.deploy (https://oss.sonatype.org/content/repositories/ops4j-snapshots/),
  servicemix (http://svn.apache.org/repos/asf/servicemix/m2-repo)


	at org.apache.maven.lifecycle.DefaultLifecycleExecutor.executeGoals(DefaultLifecycleExecutor.java:719)
	at org.apache.maven.lifecycle.DefaultLifecycleExecutor.executeGoalWithLifecycle(DefaultLifecycleExecutor.java:556)
	at org.apache.maven.lifecycle.DefaultLifecycleExecutor.executeGoal(DefaultLifecycleExecutor.java:535)
	at org.apache.maven.lifecycle.DefaultLifecycleExecutor.executeGoalAndHandleFailures(DefaultLifecycleExecutor.java:387)
	at org.apache.maven.lifecycle.DefaultLifecycleExecutor.executeTaskSegments(DefaultLifecycleExecutor.java:348)
	at org.apache.maven.lifecycle.DefaultLifecycleExecutor.execute(DefaultLifecycleExecutor.java:180)
	at org.apache.maven.lifecycle.LifecycleExecutorInterceptor.execute(LifecycleExecutorInterceptor.java:65)
	at org.apache.maven.DefaultMaven.doExecute(DefaultMaven.java:328)
	at org.apache.maven.DefaultMaven.execute(DefaultMaven.java:138)
	at org.apache.maven.cli.MavenCli.main(MavenCli.java:362)
	at sun.reflect.NativeMethodAccessorImpl.invoke0(Native Method)
	at sun.reflect.NativeMethodAccessorImpl.invoke(NativeMethodAccessorImpl.java:39)
	at sun.reflect.DelegatingMethodAccessorImpl.invoke(DelegatingMethodAccessorImpl.java:25)
	at java.lang.reflect.Method.invoke(Method.java:592)
	at org.codehaus.classworlds.Launcher.launchEnhanced(Launcher.java:315)
	at org.codehaus.classworlds.Launcher.launch(Launcher.java:255)
	at hudson.maven.agent.Main.launch(Main.java:185)
	at hudson.maven.MavenBuilder.call(MavenBuilder.java:164)
	at hudson.maven.MavenModuleSetBuild$Builder.call(MavenModuleSetBuild.java:987)
	at hudson.maven.MavenModuleSetBuild$Builder.call(MavenModuleSetBuild.java:918)
	at hudson.remoting.UserRequest.perform(UserRequest.java:118)
	at hudson.remoting.UserRequest.perform(UserRequest.java:48)
	at hudson.remoting.Request$2.run(Request.java:270)
	at java.util.concurrent.Executors$RunnableAdapter.call(Executors.java:417)
	at java.util.concurrent.FutureTask$Sync.innerRun(FutureTask.java:269)
	at java.util.concurrent.FutureTask.run(FutureTask.java:123)
	at java.util.concurrent.ThreadPoolExecutor$Worker.runTask(ThreadPoolExecutor.java:651)
	at java.util.concurrent.ThreadPoolExecutor$Worker.run(ThreadPoolExecutor.java:676)
	at java.lang.Thread.run(Thread.java:595)
Caused by: org.apache.maven.plugin.MojoExecutionException: Failed to resolve dependencies
for one or more projects in the reactor. Reason: Missing:
----------
1) org.ops4j.pax.web:pax-web-spi:jar:1.0.4-SNAPSHOT

  Try downloading the file manually from the project website.

  Then, install it using the command: 
      mvn install:install-file -DgroupId=org.ops4j.pax.web -DartifactId=pax-web-spi -Dversion=1.0.4-SNAPSHOT
-Dpackaging=jar -Dfile=/path/to/file

  Alternatively, if you host your own repository you can deploy the file there: 
      mvn deploy:deploy-file -DgroupId=org.ops4j.pax.web -DartifactId=pax-web-spi -Dversion=1.0.4-SNAPSHOT
-Dpackaging=jar -Dfile=/path/to/file -Durl=[url] -DrepositoryId=[id]

  Path to dependency: 
  	1) org.apache.karaf.shell:org.apache.karaf.shell.web:bundle:2.2.2-SNAPSHOT
  	2) org.ops4j.pax.web:pax-web-spi:jar:1.0.4-SNAPSHOT

----------
1 required artifact is missing.

for artifact: 
  org.apache.karaf.shell:org.apache.karaf.shell.web:bundle:2.2.2-SNAPSHOT

from the specified remote repositories:
  central (http://repo1.maven.org/maven2),
  fusesource.snapshots (http://repo.fusesource.com/nexus/content/repositories/snapshots),
  Nexus (http://repository.apache.org/snapshots),
  ops4j.sonatype.snapshots.deploy (https://oss.sonatype.org/content/repositories/ops4j-snapshots/),
  servicemix (http://svn.apache.org/repos/asf/servicemix/m2-repo)


	at org.apache.maven.plugin.resources.remote.ProcessRemoteResourcesMojo.resolveProjectArtifacts(ProcessRemoteResourcesMojo.java:702)
	at org.apache.maven.plugin.resources.remote.ProcessRemoteResourcesMojo.getProjects(ProcessRemoteResourcesMojo.java:602)
	at org.apache.maven.plugin.resources.remote.ProcessRemoteResourcesMojo.configureVelocityContext(ProcessRemoteResourcesMojo.java:969)
	at org.apache.maven.plugin.resources.remote.ProcessRemoteResourcesMojo.execute(ProcessRemoteResourcesMojo.java:492)
	at org.apache.maven.plugin.DefaultPluginManager.executeMojo(DefaultPluginManager.java:490)
	at hudson.maven.agent.PluginManagerInterceptor.executeMojo(PluginManagerInterceptor.java:182)
	at org.apache.maven.lifecycle.DefaultLifecycleExecutor.executeGoals(DefaultLifecycleExecutor.java:694)
	... 28 more
Caused by: org.apache.maven.artifact.resolver.MultipleArtifactsNotFoundException: Missing:
----------
1) org.ops4j.pax.web:pax-web-spi:jar:1.0.4-SNAPSHOT

  Try downloading the file manually from the project website.

  Then, install it using the command: 
      mvn install:install-file -DgroupId=org.ops4j.pax.web -DartifactId=pax-web-spi -Dversion=1.0.4-SNAPSHOT
-Dpackaging=jar -Dfile=/path/to/file

  Alternatively, if you host your own repository you can deploy the file there: 
      mvn deploy:deploy-file -DgroupId=org.ops4j.pax.web -DartifactId=pax-web-spi -Dversion=1.0.4-SNAPSHOT
-Dpackaging=jar -Dfile=/path/to/file -Durl=[url] -DrepositoryId=[id]

  Path to dependency: 
  	1) org.apache.karaf.shell:org.apache.karaf.shell.web:bundle:2.2.2-SNAPSHOT
  	2) org.ops4j.pax.web:pax-web-spi:jar:1.0.4-SNAPSHOT

----------
1 required artifact is missing.

for artifact: 
  org.apache.karaf.shell:org.apache.karaf.shell.web:bundle:2.2.2-SNAPSHOT

from the specified remote repositories:
  central (http://repo1.maven.org/maven2),
  fusesource.snapshots (http://repo.fusesource.com/nexus/content/repositories/snapshots),
  Nexus (http://repository.apache.org/snapshots),
  ops4j.sonatype.snapshots.deploy (https://oss.sonatype.org/content/repositories/ops4j-snapshots/),
  servicemix (http://svn.apache.org/repos/asf/servicemix/m2-repo)


	at org.apache.maven.artifact.resolver.DefaultArtifactResolver.resolveTransitively(DefaultArtifactResolver.java:360)
	at org.apache.maven.artifact.resolver.DefaultArtifactResolver.resolveTransitively(DefaultArtifactResolver.java:304)
	at org.apache.maven.shared.artifact.resolver.DefaultProjectDependenciesResolver.resolve(DefaultProjectDependenciesResolver.java:140)
	at org.apache.maven.shared.artifact.resolver.DefaultProjectDependenciesResolver.resolve(DefaultProjectDependenciesResolver.java:187)
	at org.apache.maven.plugin.resources.remote.ProcessRemoteResourcesMojo.resolveProjectArtifacts(ProcessRemoteResourcesMojo.java:697)
	... 34 more
[INFO] ------------------------------------------------------------------------
[INFO] Total time: 11 minutes 50 seconds
[INFO] Finished at: Wed May 18 07:17:06 GMT-08:00 2011
[INFO] Final Memory: 54M/321M
[INFO] ------------------------------------------------------------------------
Sending e-mails to: commits@karaf.apache.org
channel stopped


Mime
View raw message