karaf-commits mailing list archives

Site index · List index
Message view « Date » · « Thread »
Top « Date » · « Thread »
From Apache Hudson Server <hud...@hudson.apache.org>
Subject Build failed in Hudson: Karaf-2.1.x » Apache Karaf :: Demos :: web #2
Date Thu, 06 Jan 2011 19:45:05 GMT
See <https://hudson.apache.org/hudson/job/Karaf-2.1.x/org.apache.karaf.demos$web/2/>

------------------------------------------
[INFO] ------------------------------------------------------------------------
[INFO] Building Apache Karaf :: Demos :: web
[INFO]    task-segment: [clean, install]
[INFO] ------------------------------------------------------------------------
Downloading: http://repo1.maven.org/maven2/org/apache/maven/plugins/maven-war-plugin/2.1-beta-1/maven-war-plugin-2.1-beta-1.pom

Downloading: http://repo1.maven.org/maven2/org/apache/maven/plugins/maven-war-plugin/2.1-beta-1/maven-war-plugin-2.1-beta-1.jar

Downloading: http://repo1.maven.org/maven2/org/mortbay/jetty/maven-jetty-plugin/6.1.12rc1/maven-jetty-plugin-6.1.12rc1.pom

Downloading: http://repo1.maven.org/maven2/org/mortbay/jetty/project/6.1.12rc1/project-6.1.12rc1.pom

Downloading: http://snapshots.repository.codehaus.org/org/mortbay/jetty/jetty-parent/4/jetty-parent-4.pom
[INFO] Unable to find resource 'org.mortbay.jetty:jetty-parent:pom:4' in repository codehaus.org
(http://snapshots.repository.codehaus.org)
Downloading: http://repo1.maven.org/maven2/org/mortbay/jetty/jetty-parent/4/jetty-parent-4.pom

Downloading: http://repo1.maven.org/maven2/org/mortbay/jetty/maven-jetty-plugin/6.1.12rc1/maven-jetty-plugin-6.1.12rc1.jar

Downloading: http://repo1.maven.org/maven2/org/apache/maven/plugins/maven-dependency-plugin/2.0/maven-dependency-plugin-2.0.pom

Downloading: http://repo1.maven.org/maven2/org/apache/maven/plugins/maven-plugins/10/maven-plugins-10.pom

Downloading: http://repo1.maven.org/maven2/org/apache/maven/plugins/maven-dependency-plugin/2.0/maven-dependency-plugin-2.0.jar

[INFO] [clean:clean {execution: default-clean}]
[INFO] [bundle:cleanVersions {execution: cleanVersions}]
[INFO] [remote-resources:process {execution: default}]
Downloading: http://repo1.maven.org/maven2/org/apache/maven/maven-plugin-api/2.0.8/maven-plugin-api-2.0.8.pom

Downloading: http://svn.apache.org/repos/asf/servicemix/m2-repo/org/apache/maven/maven-settings/2.0.8/maven-settings-2.0.8.pom
[INFO] Unable to find resource 'org.apache.maven:maven-settings:pom:2.0.8' in repository servicemix
(http://svn.apache.org/repos/asf/servicemix/m2-repo)
Downloading: http://jansi.fusesource.org/repo/release/org/apache/maven/maven-settings/2.0.8/maven-settings-2.0.8.pom
[INFO] Unable to find resource 'org.apache.maven:maven-settings:pom:2.0.8' in repository jansi.release.m2
(http://jansi.fusesource.org/repo/release)
Downloading: http://repo1.maven.org/maven2/org/apache/maven/maven-settings/2.0.8/maven-settings-2.0.8.pom

Downloading: http://svn.apache.org/repos/asf/servicemix/m2-repo/org/apache/maven/maven-model/2.0.8/maven-model-2.0.8.pom
[INFO] Unable to find resource 'org.apache.maven:maven-model:pom:2.0.8' in repository servicemix
(http://svn.apache.org/repos/asf/servicemix/m2-repo)
Downloading: http://jansi.fusesource.org/repo/release/org/apache/maven/maven-model/2.0.8/maven-model-2.0.8.pom
[INFO] Unable to find resource 'org.apache.maven:maven-model:pom:2.0.8' in repository jansi.release.m2
(http://jansi.fusesource.org/repo/release)
Downloading: http://repo1.maven.org/maven2/org/apache/maven/maven-model/2.0.8/maven-model-2.0.8.pom

Downloading: http://svn.apache.org/repos/asf/servicemix/m2-repo/org/apache/maven/maven-profile/2.0.8/maven-profile-2.0.8.pom
[INFO] Unable to find resource 'org.apache.maven:maven-profile:pom:2.0.8' in repository servicemix
(http://svn.apache.org/repos/asf/servicemix/m2-repo)
Downloading: http://jansi.fusesource.org/repo/release/org/apache/maven/maven-profile/2.0.8/maven-profile-2.0.8.pom
[INFO] Unable to find resource 'org.apache.maven:maven-profile:pom:2.0.8' in repository jansi.release.m2
(http://jansi.fusesource.org/repo/release)
Downloading: http://repo1.maven.org/maven2/org/apache/maven/maven-profile/2.0.8/maven-profile-2.0.8.pom

Downloading: http://svn.apache.org/repos/asf/servicemix/m2-repo/org/apache/maven/maven-artifact-manager/2.0.8/maven-artifact-manager-2.0.8.pom
[INFO] Unable to find resource 'org.apache.maven:maven-artifact-manager:pom:2.0.8' in repository
servicemix (http://svn.apache.org/repos/asf/servicemix/m2-repo)
Downloading: http://jansi.fusesource.org/repo/release/org/apache/maven/maven-artifact-manager/2.0.8/maven-artifact-manager-2.0.8.pom
[INFO] Unable to find resource 'org.apache.maven:maven-artifact-manager:pom:2.0.8' in repository
jansi.release.m2 (http://jansi.fusesource.org/repo/release)
Downloading: http://repo1.maven.org/maven2/org/apache/maven/maven-artifact-manager/2.0.8/maven-artifact-manager-2.0.8.pom

Downloading: http://svn.apache.org/repos/asf/servicemix/m2-repo/org/apache/maven/maven-repository-metadata/2.0.8/maven-repository-metadata-2.0.8.pom
[INFO] Unable to find resource 'org.apache.maven:maven-repository-metadata:pom:2.0.8' in repository
servicemix (http://svn.apache.org/repos/asf/servicemix/m2-repo)
Downloading: http://jansi.fusesource.org/repo/release/org/apache/maven/maven-repository-metadata/2.0.8/maven-repository-metadata-2.0.8.pom
[INFO] Unable to find resource 'org.apache.maven:maven-repository-metadata:pom:2.0.8' in repository
jansi.release.m2 (http://jansi.fusesource.org/repo/release)
Downloading: http://repo1.maven.org/maven2/org/apache/maven/maven-repository-metadata/2.0.8/maven-repository-metadata-2.0.8.pom

Downloading: http://svn.apache.org/repos/asf/servicemix/m2-repo/org/apache/maven/maven-plugin-registry/2.0.8/maven-plugin-registry-2.0.8.pom
[INFO] Unable to find resource 'org.apache.maven:maven-plugin-registry:pom:2.0.8' in repository
servicemix (http://svn.apache.org/repos/asf/servicemix/m2-repo)
Downloading: http://jansi.fusesource.org/repo/release/org/apache/maven/maven-plugin-registry/2.0.8/maven-plugin-registry-2.0.8.pom
[INFO] Unable to find resource 'org.apache.maven:maven-plugin-registry:pom:2.0.8' in repository
jansi.release.m2 (http://jansi.fusesource.org/repo/release)
Downloading: http://repo1.maven.org/maven2/org/apache/maven/maven-plugin-registry/2.0.8/maven-plugin-registry-2.0.8.pom

Downloading: http://repo1.maven.org/maven2/org/apache/maven/maven-core/2.0.8/maven-core-2.0.8.pom

Downloading: http://svn.apache.org/repos/asf/servicemix/m2-repo/org/apache/maven/maven-plugin-parameter-documenter/2.0.8/maven-plugin-parameter-documenter-2.0.8.pom
[INFO] Unable to find resource 'org.apache.maven:maven-plugin-parameter-documenter:pom:2.0.8'
in repository servicemix (http://svn.apache.org/repos/asf/servicemix/m2-repo)
Downloading: http://jansi.fusesource.org/repo/release/org/apache/maven/maven-plugin-parameter-documenter/2.0.8/maven-plugin-parameter-documenter-2.0.8.pom
[INFO] Unable to find resource 'org.apache.maven:maven-plugin-parameter-documenter:pom:2.0.8'
in repository jansi.release.m2 (http://jansi.fusesource.org/repo/release)
Downloading: http://repo1.maven.org/maven2/org/apache/maven/maven-plugin-parameter-documenter/2.0.8/maven-plugin-parameter-documenter-2.0.8.pom

Downloading: http://svn.apache.org/repos/asf/servicemix/m2-repo/org/apache/maven/reporting/maven-reporting-api/2.0.8/maven-reporting-api-2.0.8.pom
[INFO] Unable to find resource 'org.apache.maven.reporting:maven-reporting-api:pom:2.0.8'
in repository servicemix (http://svn.apache.org/repos/asf/servicemix/m2-repo)
Downloading: http://jansi.fusesource.org/repo/release/org/apache/maven/reporting/maven-reporting-api/2.0.8/maven-reporting-api-2.0.8.pom
[INFO] Unable to find resource 'org.apache.maven.reporting:maven-reporting-api:pom:2.0.8'
in repository jansi.release.m2 (http://jansi.fusesource.org/repo/release)
Downloading: http://repo1.maven.org/maven2/org/apache/maven/reporting/maven-reporting-api/2.0.8/maven-reporting-api-2.0.8.pom

Downloading: http://svn.apache.org/repos/asf/servicemix/m2-repo/org/apache/maven/reporting/maven-reporting/2.0.8/maven-reporting-2.0.8.pom
[INFO] Unable to find resource 'org.apache.maven.reporting:maven-reporting:pom:2.0.8' in repository
servicemix (http://svn.apache.org/repos/asf/servicemix/m2-repo)
Downloading: http://jansi.fusesource.org/repo/release/org/apache/maven/reporting/maven-reporting/2.0.8/maven-reporting-2.0.8.pom
[INFO] Unable to find resource 'org.apache.maven.reporting:maven-reporting:pom:2.0.8' in repository
jansi.release.m2 (http://jansi.fusesource.org/repo/release)
Downloading: http://repo1.maven.org/maven2/org/apache/maven/reporting/maven-reporting/2.0.8/maven-reporting-2.0.8.pom

Downloading: http://svn.apache.org/repos/asf/servicemix/m2-repo/org/apache/maven/doxia/doxia-sink-api/1.0-alpha-9/doxia-sink-api-1.0-alpha-9.pom
[INFO] Unable to find resource 'org.apache.maven.doxia:doxia-sink-api:pom:1.0-alpha-9' in
repository servicemix (http://svn.apache.org/repos/asf/servicemix/m2-repo)
Downloading: http://jansi.fusesource.org/repo/release/org/apache/maven/doxia/doxia-sink-api/1.0-alpha-9/doxia-sink-api-1.0-alpha-9.pom
[INFO] Unable to find resource 'org.apache.maven.doxia:doxia-sink-api:pom:1.0-alpha-9' in
repository jansi.release.m2 (http://jansi.fusesource.org/repo/release)
Downloading: http://repo1.maven.org/maven2/org/apache/maven/doxia/doxia-sink-api/1.0-alpha-9/doxia-sink-api-1.0-alpha-9.pom

Downloading: http://svn.apache.org/repos/asf/servicemix/m2-repo/org/apache/maven/doxia/doxia/1.0-alpha-9/doxia-1.0-alpha-9.pom
[INFO] Unable to find resource 'org.apache.maven.doxia:doxia:pom:1.0-alpha-9' in repository
servicemix (http://svn.apache.org/repos/asf/servicemix/m2-repo)
Downloading: http://jansi.fusesource.org/repo/release/org/apache/maven/doxia/doxia/1.0-alpha-9/doxia-1.0-alpha-9.pom
[INFO] Unable to find resource 'org.apache.maven.doxia:doxia:pom:1.0-alpha-9' in repository
jansi.release.m2 (http://jansi.fusesource.org/repo/release)
Downloading: http://repo1.maven.org/maven2/org/apache/maven/doxia/doxia/1.0-alpha-9/doxia-1.0-alpha-9.pom

Downloading: http://svn.apache.org/repos/asf/servicemix/m2-repo/org/apache/maven/maven-error-diagnostics/2.0.8/maven-error-diagnostics-2.0.8.pom
[INFO] Unable to find resource 'org.apache.maven:maven-error-diagnostics:pom:2.0.8' in repository
servicemix (http://svn.apache.org/repos/asf/servicemix/m2-repo)
Downloading: http://jansi.fusesource.org/repo/release/org/apache/maven/maven-error-diagnostics/2.0.8/maven-error-diagnostics-2.0.8.pom
[INFO] Unable to find resource 'org.apache.maven:maven-error-diagnostics:pom:2.0.8' in repository
jansi.release.m2 (http://jansi.fusesource.org/repo/release)
Downloading: http://repo1.maven.org/maven2/org/apache/maven/maven-error-diagnostics/2.0.8/maven-error-diagnostics-2.0.8.pom

Downloading: http://svn.apache.org/repos/asf/servicemix/m2-repo/org/apache/maven/maven-plugin-descriptor/2.0.8/maven-plugin-descriptor-2.0.8.pom
[INFO] Unable to find resource 'org.apache.maven:maven-plugin-descriptor:pom:2.0.8' in repository
servicemix (http://svn.apache.org/repos/asf/servicemix/m2-repo)
Downloading: http://jansi.fusesource.org/repo/release/org/apache/maven/maven-plugin-descriptor/2.0.8/maven-plugin-descriptor-2.0.8.pom
[INFO] Unable to find resource 'org.apache.maven:maven-plugin-descriptor:pom:2.0.8' in repository
jansi.release.m2 (http://jansi.fusesource.org/repo/release)
Downloading: http://repo1.maven.org/maven2/org/apache/maven/maven-plugin-descriptor/2.0.8/maven-plugin-descriptor-2.0.8.pom

Downloading: http://svn.apache.org/repos/asf/servicemix/m2-repo/org/apache/maven/maven-monitor/2.0.8/maven-monitor-2.0.8.pom
[INFO] Unable to find resource 'org.apache.maven:maven-monitor:pom:2.0.8' in repository servicemix
(http://svn.apache.org/repos/asf/servicemix/m2-repo)
Downloading: http://jansi.fusesource.org/repo/release/org/apache/maven/maven-monitor/2.0.8/maven-monitor-2.0.8.pom
[INFO] Unable to find resource 'org.apache.maven:maven-monitor:pom:2.0.8' in repository jansi.release.m2
(http://jansi.fusesource.org/repo/release)
Downloading: http://repo1.maven.org/maven2/org/apache/maven/maven-monitor/2.0.8/maven-monitor-2.0.8.pom

Downloading: http://repo1.maven.org/maven2/org/apache/maven/shared/maven-dependency-analyzer/1.0/maven-dependency-analyzer-1.0.pom

Downloading: http://repo1.maven.org/maven2/org/apache/maven/doxia/doxia-sink-api/1.0-alpha-8/doxia-sink-api-1.0-alpha-8.pom

Downloading: http://repo1.maven.org/maven2/org/apache/maven/doxia/doxia/1.0-alpha-8/doxia-1.0-alpha-8.pom

Downloading: http://repo1.maven.org/maven2/org/apache/maven/maven-parent/1/maven-parent-1.pom

Downloading: http://repo1.maven.org/maven2/org/apache/apache/1/apache-1.pom

Downloading: http://repo1.maven.org/maven2/org/apache/maven/doxia/doxia-site-renderer/1.0-alpha-8/doxia-site-renderer-1.0-alpha-8.pom

Downloading: http://svn.apache.org/repos/asf/servicemix/m2-repo/org/apache/maven/doxia/doxia-core/1.0-alpha-8/doxia-core-1.0-alpha-8.pom
[INFO] Unable to find resource 'org.apache.maven.doxia:doxia-core:pom:1.0-alpha-8' in repository
servicemix (http://svn.apache.org/repos/asf/servicemix/m2-repo)
Downloading: http://jansi.fusesource.org/repo/release/org/apache/maven/doxia/doxia-core/1.0-alpha-8/doxia-core-1.0-alpha-8.pom
[INFO] Unable to find resource 'org.apache.maven.doxia:doxia-core:pom:1.0-alpha-8' in repository
jansi.release.m2 (http://jansi.fusesource.org/repo/release)
Downloading: http://repo1.maven.org/maven2/org/apache/maven/doxia/doxia-core/1.0-alpha-8/doxia-core-1.0-alpha-8.pom

Downloading: http://svn.apache.org/repos/asf/servicemix/m2-repo/org/apache/maven/doxia/doxia-decoration-model/1.0-alpha-8/doxia-decoration-model-1.0-alpha-8.pom
[INFO] Unable to find resource 'org.apache.maven.doxia:doxia-decoration-model:pom:1.0-alpha-8'
in repository servicemix (http://svn.apache.org/repos/asf/servicemix/m2-repo)
Downloading: http://jansi.fusesource.org/repo/release/org/apache/maven/doxia/doxia-decoration-model/1.0-alpha-8/doxia-decoration-model-1.0-alpha-8.pom
[INFO] Unable to find resource 'org.apache.maven.doxia:doxia-decoration-model:pom:1.0-alpha-8'
in repository jansi.release.m2 (http://jansi.fusesource.org/repo/release)
Downloading: http://repo1.maven.org/maven2/org/apache/maven/doxia/doxia-decoration-model/1.0-alpha-8/doxia-decoration-model-1.0-alpha-8.pom

Downloading: http://repo1.maven.org/maven2/org/apache/maven/doxia/doxia-site-renderer/1.0-alpha-8/doxia-site-renderer-1.0-alpha-8.jar
Downloading: http://repo1.maven.org/maven2/org/apache/maven/shared/maven-dependency-analyzer/1.0/maven-dependency-analyzer-1.0.jar


Downloading: http://svn.apache.org/repos/asf/servicemix/m2-repo/org/apache/maven/doxia/doxia-decoration-model/1.0-alpha-8/doxia-decoration-model-1.0-alpha-8.jar
[INFO] Unable to find resource 'org.apache.maven.doxia:doxia-decoration-model:jar:1.0-alpha-8'
in repository servicemix (http://svn.apache.org/repos/asf/servicemix/m2-repo)
Downloading: http://jansi.fusesource.org/repo/release/org/apache/maven/doxia/doxia-decoration-model/1.0-alpha-8/doxia-decoration-model-1.0-alpha-8.jar
[INFO] Unable to find resource 'org.apache.maven.doxia:doxia-decoration-model:jar:1.0-alpha-8'
in repository jansi.release.m2 (http://jansi.fusesource.org/repo/release)
Downloading: http://repo1.maven.org/maven2/org/apache/maven/doxia/doxia-decoration-model/1.0-alpha-8/doxia-decoration-model-1.0-alpha-8.jar

[INFO] [dependency:unpack {execution: unpack-unix}]
[INFO] Configured Artifact: org.apache.karaf:apache-karaf:?:zip
[INFO] snapshot org.apache.karaf:apache-karaf:2.1.3-SNAPSHOT: checking for updates from apache-snapshots
[INFO] snapshot org.apache.karaf:apache-karaf:2.1.3-SNAPSHOT: checking for updates from apache.snapshots
[INFO] Unpacking /home/hudson/hudson-slave/workspace/Karaf-2.1.x/.repository/org/apache/karaf/apache-karaf/2.1.3-SNAPSHOT/apache-karaf-2.1.3-SNAPSHOT.zipto
 <https://hudson.apache.org/hudson/job/Karaf-2.1.x/org.apache.karaf.demos$web/ws/target/karaf/WEB-INF>
with Includes null and excludes:**/lib/*,**/*.txt,**/bin/*,**/demos/**,**/lib,**/bin,**/demos
[INFO] [antrun:run {execution: copy-notice}]
[INFO] Executing tasks
     [copy] Copying 1 file to <https://hudson.apache.org/hudson/job/Karaf-2.1.x/org.apache.karaf.demos$web/ws/target/maven-shared-archive-resources/META-INF>
[INFO] Executed tasks
[INFO] [resources:resources {execution: default-resources}]
[INFO] Using 'UTF-8' encoding to copy filtered resources.
[INFO] skip non existing resourceDirectory <https://hudson.apache.org/hudson/job/Karaf-2.1.x/org.apache.karaf.demos$web/ws/src/main/resources>
[INFO] Copying 3 resources
[INFO] [antrun:run {execution: copy-karaf}]
[INFO] Executing tasks
     [move] Moving 60 files to <https://hudson.apache.org/hudson/job/Karaf-2.1.x/org.apache.karaf.demos$web/ws/target/karaf/WEB-INF/karaf>
[INFO] Executed tasks
[INFO] [compiler:compile {execution: default-compile}]
[INFO] Compiling 1 source file to <https://hudson.apache.org/hudson/job/Karaf-2.1.x/org.apache.karaf.demos$web/ws/target/classes>
[HUDSON] Archiving <https://hudson.apache.org/hudson/job/Karaf-2.1.x/org.apache.karaf.demos$web/ws/pom.xml>
to /home/hudson/hudson/jobs/Karaf-2.1.x/modules/org.apache.karaf.demos$web/builds/2011-01-06_19-24-13/archive/org.apache.karaf.demos/web/2.1.3-SNAPSHOT/pom.xml
[INFO] ------------------------------------------------------------------------
[ERROR] BUILD FAILURE
[INFO] ------------------------------------------------------------------------
[INFO] Compilation failure
<https://hudson.apache.org/hudson/job/Karaf-2.1.x/org.apache.karaf.demos$web/ws/src/main/java/org/apache/karaf/web/WebAppListener.java>:[55,36]
destroy() in org.apache.karaf.main.Main cannot be applied to (boolean)


[INFO] ------------------------------------------------------------------------
[INFO] Trace
org.apache.maven.BuildFailureException: Compilation failure
<https://hudson.apache.org/hudson/job/Karaf-2.1.x/org.apache.karaf.demos$web/ws/src/main/java/org/apache/karaf/web/WebAppListener.java>:[55,36]
destroy() in org.apache.karaf.main.Main cannot be applied to (boolean)


	at org.apache.maven.lifecycle.DefaultLifecycleExecutor.executeGoals(DefaultLifecycleExecutor.java:715)
	at org.apache.maven.lifecycle.DefaultLifecycleExecutor.executeGoalWithLifecycle(DefaultLifecycleExecutor.java:556)
	at org.apache.maven.lifecycle.DefaultLifecycleExecutor.executeGoal(DefaultLifecycleExecutor.java:535)
	at org.apache.maven.lifecycle.DefaultLifecycleExecutor.executeGoalAndHandleFailures(DefaultLifecycleExecutor.java:387)
	at org.apache.maven.lifecycle.DefaultLifecycleExecutor.executeTaskSegments(DefaultLifecycleExecutor.java:348)
	at org.apache.maven.lifecycle.DefaultLifecycleExecutor.execute(DefaultLifecycleExecutor.java:180)
	at org.apache.maven.lifecycle.LifecycleExecutorInterceptor.execute(LifecycleExecutorInterceptor.java:65)
	at org.apache.maven.DefaultMaven.doExecute(DefaultMaven.java:328)
	at org.apache.maven.DefaultMaven.execute(DefaultMaven.java:138)
	at org.apache.maven.cli.MavenCli.main(MavenCli.java:362)
	at sun.reflect.NativeMethodAccessorImpl.invoke0(Native Method)
	at sun.reflect.NativeMethodAccessorImpl.invoke(NativeMethodAccessorImpl.java:39)
	at sun.reflect.DelegatingMethodAccessorImpl.invoke(DelegatingMethodAccessorImpl.java:25)
	at java.lang.reflect.Method.invoke(Method.java:592)
	at org.codehaus.classworlds.Launcher.launchEnhanced(Launcher.java:315)
	at org.codehaus.classworlds.Launcher.launch(Launcher.java:255)
	at hudson.maven.agent.Main.launch(Main.java:165)
	at hudson.maven.MavenBuilder.call(MavenBuilder.java:165)
	at hudson.maven.MavenModuleSetBuild$Builder.call(MavenModuleSetBuild.java:750)
	at hudson.maven.MavenModuleSetBuild$Builder.call(MavenModuleSetBuild.java:694)
	at hudson.remoting.UserRequest.perform(UserRequest.java:114)
	at hudson.remoting.UserRequest.perform(UserRequest.java:48)
	at hudson.remoting.Request$2.run(Request.java:270)
	at java.util.concurrent.Executors$RunnableAdapter.call(Executors.java:417)
	at java.util.concurrent.FutureTask$Sync.innerRun(FutureTask.java:269)
	at java.util.concurrent.FutureTask.run(FutureTask.java:123)
	at java.util.concurrent.ThreadPoolExecutor$Worker.runTask(ThreadPoolExecutor.java:651)
	at java.util.concurrent.ThreadPoolExecutor$Worker.run(ThreadPoolExecutor.java:676)
	at java.lang.Thread.run(Thread.java:595)
Caused by: org.apache.maven.plugin.CompilationFailureException: Compilation failure
<https://hudson.apache.org/hudson/job/Karaf-2.1.x/org.apache.karaf.demos$web/ws/src/main/java/org/apache/karaf/web/WebAppListener.java>:[55,36]
destroy() in org.apache.karaf.main.Main cannot be applied to (boolean)


	at org.apache.maven.plugin.AbstractCompilerMojo.execute(AbstractCompilerMojo.java:516)
	at org.apache.maven.plugin.CompilerMojo.execute(CompilerMojo.java:114)
	at org.apache.maven.plugin.DefaultPluginManager.executeMojo(DefaultPluginManager.java:490)
	at hudson.maven.agent.PluginManagerInterceptor.executeMojo(PluginManagerInterceptor.java:182)
	at org.apache.maven.lifecycle.DefaultLifecycleExecutor.executeGoals(DefaultLifecycleExecutor.java:694)
	... 28 more
[INFO] ------------------------------------------------------------------------
[INFO] Total time: 20 minutes 42 seconds
[INFO] Finished at: Thu Jan 06 19:45:05 UTC 2011
[INFO] Final Memory: 81M/318M
[INFO] ------------------------------------------------------------------------


Mime
View raw message