karaf-commits mailing list archives

Site index · List index
Message view « Date » · « Thread »
Top « Date » · « Thread »
From Apache Hudson Server <hud...@hudson.apache.org>
Subject Build failed in Hudson: Karaf #163
Date Mon, 08 Nov 2010 10:20:39 GMT
See <https://hudson.apache.org/hudson/job/Karaf/163/changes>

Changes:

[jbonofre] [KARAF-267] Use ServiceMix ASM 3.1 bundle in place of the Springsource one.

------------------------------------------
[...truncated 5172 lines...]
[INFO] Using 'UTF-8' encoding to copy filtered resources.
[INFO] skip non existing resourceDirectory <https://hudson.apache.org/hudson/job/Karaf/ws/karaf/jaas/modules/src/test/resources>
[INFO] Copying 3 resources
[INFO] [compiler:testCompile {execution: default-testCompile}]
[INFO] Compiling 1 source file to <https://hudson.apache.org/hudson/job/Karaf/ws/karaf/jaas/modules/target/test-classes>
[INFO] [surefire:test {execution: default-test}]
[INFO] Surefire report directory: <https://hudson.apache.org/hudson/job/Karaf/ws/karaf/jaas/modules/target/surefire-reports>

-------------------------------------------------------
 T E S T S
-------------------------------------------------------
Running org.apache.karaf.jaas.modules.properties.PropertiesConverterTest
Tests run: 3, Failures: 0, Errors: 0, Skipped: 0, Time elapsed: 0.018 sec

Results :

Tests run: 3, Failures: 0, Errors: 0, Skipped: 0

[HUDSON] Recording test results
[INFO] [bundle:bundle {execution: default-bundle}]
[INFO] [install:install {execution: default-install}]
[INFO] Installing <https://hudson.apache.org/hudson/job/Karaf/ws/karaf/jaas/modules/target/org.apache.karaf.jaas.modules-2.1.99-SNAPSHOT.jar>
to <https://hudson.apache.org/hudson/job/Karaf/ws/.repository/org/apache/karaf/jaas/org.apache.karaf.jaas.modules/2.1.99-SNAPSHOT/org.apache.karaf.jaas.modules-2.1.99-SNAPSHOT.jar>
[INFO] [bundle:install {execution: default-install}]
[INFO] Installing org/apache/karaf/jaas/org.apache.karaf.jaas.modules/2.1.99-SNAPSHOT/org.apache.karaf.jaas.modules-2.1.99-SNAPSHOT.jar
[INFO] Writing OBR metadata
[HUDSON] Archiving <https://hudson.apache.org/hudson/job/Karaf/ws/karaf/jaas/modules/pom.xml>
to /home/hudson/hudson/jobs/Karaf/modules/org.apache.karaf.jaas$org.apache.karaf.jaas.modules/builds/2010-11-08_10-09-36/archive/org.apache.karaf.jaas/org.apache.karaf.jaas.modules/2.1.99-SNAPSHOT/pom.xml
[HUDSON] Archiving <https://hudson.apache.org/hudson/job/Karaf/ws/karaf/jaas/modules/target/org.apache.karaf.jaas.modules-2.1.99-SNAPSHOT.jar>
to /home/hudson/hudson/jobs/Karaf/modules/org.apache.karaf.jaas$org.apache.karaf.jaas.modules/builds/2010-11-08_10-09-36/archive/org.apache.karaf.jaas/org.apache.karaf.jaas.modules/2.1.99-SNAPSHOT/org.apache.karaf.jaas.modules-2.1.99-SNAPSHOT.jar
[INFO] ------------------------------------------------------------------------
[INFO] Building Apache Karaf :: JAAS :: Jasypt Encryption
[INFO]    task-segment: [clean, install]
[INFO] ------------------------------------------------------------------------
[INFO] [clean:clean {execution: default-clean}]
[INFO] [bundle:cleanVersions {execution: cleanVersions}]
[INFO] [remote-resources:process {execution: default}]
[INFO] snapshot org.apache.servicemix.bundles:org.apache.servicemix.bundles.jasypt:1.7_1-SNAPSHOT:
checking for updates from apache-snapshots
[INFO] snapshot org.apache.servicemix.bundles:org.apache.servicemix.bundles.jasypt:1.7_1-SNAPSHOT:
checking for updates from sonatype
[INFO] snapshot org.apache.servicemix.bundles:org.apache.servicemix.bundles.jasypt:1.7_1-SNAPSHOT:
checking for updates from fusesource.snapshots
[INFO] snapshot org.apache.servicemix.bundles:org.apache.servicemix.bundles.jasypt:1.7_1-SNAPSHOT:
checking for updates from apache.snapshots
Downloading: http://repository.apache.org/content/groups/snapshots-group/org/apache/servicemix/bundles/org.apache.servicemix.bundles.jasypt/1.7_1-SNAPSHOT/org.apache.servicemix.bundles.jasypt-1.7_1-SNAPSHOT.pom
[INFO] Unable to find resource 'org.apache.servicemix.bundles:org.apache.servicemix.bundles.jasypt:pom:1.7_1-SNAPSHOT'
in repository apache-snapshots (http://repository.apache.org/content/groups/snapshots-group)
Downloading: http://repository.sonatype.org/content/groups/sonatype-public-grid/org/apache/servicemix/bundles/org.apache.servicemix.bundles.jasypt/1.7_1-SNAPSHOT/org.apache.servicemix.bundles.jasypt-1.7_1-SNAPSHOT.pom
[INFO] Unable to find resource 'org.apache.servicemix.bundles:org.apache.servicemix.bundles.jasypt:pom:1.7_1-SNAPSHOT'
in repository sonatype (http://repository.sonatype.org/content/groups/sonatype-public-grid)
Downloading: http://repo.fusesource.com/nexus/content/repositories/snapshots/org/apache/servicemix/bundles/org.apache.servicemix.bundles.jasypt/1.7_1-SNAPSHOT/org.apache.servicemix.bundles.jasypt-1.7_1-SNAPSHOT.pom
[INFO] Unable to find resource 'org.apache.servicemix.bundles:org.apache.servicemix.bundles.jasypt:pom:1.7_1-SNAPSHOT'
in repository fusesource.snapshots (http://repo.fusesource.com/nexus/content/repositories/snapshots)
Downloading: http://repository.apache.org/snapshots/org/apache/servicemix/bundles/org.apache.servicemix.bundles.jasypt/1.7_1-SNAPSHOT/org.apache.servicemix.bundles.jasypt-1.7_1-SNAPSHOT.pom
[INFO] Unable to find resource 'org.apache.servicemix.bundles:org.apache.servicemix.bundles.jasypt:pom:1.7_1-SNAPSHOT'
in repository apache.snapshots (http://repository.apache.org/snapshots)
Downloading: http://svn.apache.org/repos/asf/servicemix/m2-repo/com/ibm/icu/icu4j/3.4.4/icu4j-3.4.4.pom
[INFO] Unable to find resource 'com.ibm.icu:icu4j:pom:3.4.4' in repository servicemix (http://svn.apache.org/repos/asf/servicemix/m2-repo)
Downloading: http://repo1.maven.org/maven2/com/ibm/icu/icu4j/3.4.4/icu4j-3.4.4.pom

[INFO] snapshot org.apache.karaf.jaas:org.apache.karaf.jaas.modules:2.1.99-SNAPSHOT: checking
for updates from apache-snapshots
Downloading: http://svn.apache.org/repos/asf/servicemix/m2-repo/com/ibm/icu/icu4j/3.4.4/icu4j-3.4.4.jar
Downloading: http://repository.apache.org/content/groups/snapshots-group/org/apache/servicemix/bundles/org.apache.servicemix.bundles.jasypt/1.7_1-SNAPSHOT/org.apache.servicemix.bundles.jasypt-1.7_1-SNAPSHOT.jar
[INFO] Unable to find resource 'org.apache.servicemix.bundles:org.apache.servicemix.bundles.jasypt:jar:1.7_1-SNAPSHOT'
in repository apache-snapshots (http://repository.apache.org/content/groups/snapshots-group)
Downloading: http://repository.sonatype.org/content/groups/sonatype-public-grid/org/apache/servicemix/bundles/org.apache.servicemix.bundles.jasypt/1.7_1-SNAPSHOT/org.apache.servicemix.bundles.jasypt-1.7_1-SNAPSHOT.jar
[INFO] Unable to find resource 'com.ibm.icu:icu4j:jar:3.4.4' in repository servicemix (http://svn.apache.org/repos/asf/servicemix/m2-repo)
Downloading: http://repo1.maven.org/maven2/com/ibm/icu/icu4j/3.4.4/icu4j-3.4.4.jar
[INFO] snapshot org.apache.karaf.jaas:org.apache.karaf.jaas.modules:2.1.99-SNAPSHOT: checking
for updates from sonatype

[INFO] Unable to find resource 'org.apache.servicemix.bundles:org.apache.servicemix.bundles.jasypt:jar:1.7_1-SNAPSHOT'
in repository sonatype (http://repository.sonatype.org/content/groups/sonatype-public-grid)
Downloading: http://repo.fusesource.com/nexus/content/repositories/snapshots/org/apache/servicemix/bundles/org.apache.servicemix.bundles.jasypt/1.7_1-SNAPSHOT/org.apache.servicemix.bundles.jasypt-1.7_1-SNAPSHOT.jar
[INFO] snapshot org.apache.karaf.jaas:org.apache.karaf.jaas.modules:2.1.99-SNAPSHOT: checking
for updates from fusesource.snapshots
[INFO] Unable to find resource 'org.apache.servicemix.bundles:org.apache.servicemix.bundles.jasypt:jar:1.7_1-SNAPSHOT'
in repository fusesource.snapshots (http://repo.fusesource.com/nexus/content/repositories/snapshots)
Downloading: http://repository.apache.org/snapshots/org/apache/servicemix/bundles/org.apache.servicemix.bundles.jasypt/1.7_1-SNAPSHOT/org.apache.servicemix.bundles.jasypt-1.7_1-SNAPSHOT.jar
[INFO] snapshot org.apache.karaf.jaas:org.apache.karaf.jaas.modules:2.1.99-SNAPSHOT: checking
for updates from apache.snapshots
[INFO] Unable to find resource 'org.apache.servicemix.bundles:org.apache.servicemix.bundles.jasypt:jar:1.7_1-SNAPSHOT'
in repository apache.snapshots (http://repository.apache.org/snapshots)
[HUDSON] Archiving <https://hudson.apache.org/hudson/job/Karaf/ws/karaf/jaas/jasypt/pom.xml>
to /home/hudson/hudson/jobs/Karaf/modules/org.apache.karaf.jaas$org.apache.karaf.jaas.jasypt/builds/2010-11-08_10-09-36/archive/org.apache.karaf.jaas/org.apache.karaf.jaas.jasypt/2.1.99-SNAPSHOT/pom.xml
[INFO] ------------------------------------------------------------------------
[ERROR] BUILD ERROR
[INFO] ------------------------------------------------------------------------
[INFO] Failed to resolve artifact.

Missing:
----------
1) org.apache.servicemix.bundles:org.apache.servicemix.bundles.jasypt:jar:1.7_1-SNAPSHOT

  Try downloading the file manually from the project website.

  Then, install it using the command: 
      mvn install:install-file -DgroupId=org.apache.servicemix.bundles -DartifactId=org.apache.servicemix.bundles.jasypt
-Dversion=1.7_1-SNAPSHOT -Dpackaging=jar -Dfile=/path/to/file

  Alternatively, if you host your own repository you can deploy the file there: 
      mvn deploy:deploy-file -DgroupId=org.apache.servicemix.bundles -DartifactId=org.apache.servicemix.bundles.jasypt
-Dversion=1.7_1-SNAPSHOT -Dpackaging=jar -Dfile=/path/to/file -Durl=[url] -DrepositoryId=[id]

  Path to dependency: 
  	1) org.apache.karaf.jaas:org.apache.karaf.jaas.jasypt:bundle:2.1.99-SNAPSHOT
  	2) org.apache.servicemix.bundles:org.apache.servicemix.bundles.jasypt:jar:1.7_1-SNAPSHOT

----------
1 required artifact is missing.

for artifact: 
  org.apache.karaf.jaas:org.apache.karaf.jaas.jasypt:bundle:2.1.99-SNAPSHOT

from the specified remote repositories:
  central (http://repo1.maven.org/maven2),
  fusesource.snapshots (http://repo.fusesource.com/nexus/content/repositories/snapshots),
  apache-snapshots (http://repository.apache.org/content/groups/snapshots-group),
  Nexus (http://repository.apache.org/snapshots),
  servicemix (http://svn.apache.org/repos/asf/servicemix/m2-repo),
  sonatype (http://repository.sonatype.org/content/groups/sonatype-public-grid)



[INFO] ------------------------------------------------------------------------
[INFO] Trace
org.apache.maven.lifecycle.LifecycleExecutionException: Failed to resolve dependencies for
one or more projects in the reactor. Reason: Missing:
----------
1) org.apache.servicemix.bundles:org.apache.servicemix.bundles.jasypt:jar:1.7_1-SNAPSHOT

  Try downloading the file manually from the project website.

  Then, install it using the command: 
      mvn install:install-file -DgroupId=org.apache.servicemix.bundles -DartifactId=org.apache.servicemix.bundles.jasypt
-Dversion=1.7_1-SNAPSHOT -Dpackaging=jar -Dfile=/path/to/file

  Alternatively, if you host your own repository you can deploy the file there: 
      mvn deploy:deploy-file -DgroupId=org.apache.servicemix.bundles -DartifactId=org.apache.servicemix.bundles.jasypt
-Dversion=1.7_1-SNAPSHOT -Dpackaging=jar -Dfile=/path/to/file -Durl=[url] -DrepositoryId=[id]

  Path to dependency: 
  	1) org.apache.karaf.jaas:org.apache.karaf.jaas.jasypt:bundle:2.1.99-SNAPSHOT
  	2) org.apache.servicemix.bundles:org.apache.servicemix.bundles.jasypt:jar:1.7_1-SNAPSHOT

----------
1 required artifact is missing.

for artifact: 
  org.apache.karaf.jaas:org.apache.karaf.jaas.jasypt:bundle:2.1.99-SNAPSHOT

from the specified remote repositories:
  central (http://repo1.maven.org/maven2),
  fusesource.snapshots (http://repo.fusesource.com/nexus/content/repositories/snapshots),
  apache-snapshots (http://repository.apache.org/content/groups/snapshots-group),
  Nexus (http://repository.apache.org/snapshots),
  servicemix (http://svn.apache.org/repos/asf/servicemix/m2-repo),
  sonatype (http://repository.sonatype.org/content/groups/sonatype-public-grid)


	at org.apache.maven.lifecycle.DefaultLifecycleExecutor.executeGoals(DefaultLifecycleExecutor.java:719)
	at org.apache.maven.lifecycle.DefaultLifecycleExecutor.executeGoalWithLifecycle(DefaultLifecycleExecutor.java:556)
	at org.apache.maven.lifecycle.DefaultLifecycleExecutor.executeGoal(DefaultLifecycleExecutor.java:535)
	at org.apache.maven.lifecycle.DefaultLifecycleExecutor.executeGoalAndHandleFailures(DefaultLifecycleExecutor.java:387)
	at org.apache.maven.lifecycle.DefaultLifecycleExecutor.executeTaskSegments(DefaultLifecycleExecutor.java:348)
	at org.apache.maven.lifecycle.DefaultLifecycleExecutor.execute(DefaultLifecycleExecutor.java:180)
	at org.apache.maven.lifecycle.LifecycleExecutorInterceptor.execute(LifecycleExecutorInterceptor.java:65)
	at org.apache.maven.DefaultMaven.doExecute(DefaultMaven.java:328)
	at org.apache.maven.DefaultMaven.execute(DefaultMaven.java:138)
	at org.apache.maven.cli.MavenCli.main(MavenCli.java:362)
	at sun.reflect.NativeMethodAccessorImpl.invoke0(Native Method)
	at sun.reflect.NativeMethodAccessorImpl.invoke(NativeMethodAccessorImpl.java:39)
	at sun.reflect.DelegatingMethodAccessorImpl.invoke(DelegatingMethodAccessorImpl.java:25)
	at java.lang.reflect.Method.invoke(Method.java:592)
	at org.codehaus.classworlds.Launcher.launchEnhanced(Launcher.java:315)
	at org.codehaus.classworlds.Launcher.launch(Launcher.java:255)
	at hudson.maven.agent.Main.launch(Main.java:165)
	at hudson.maven.MavenBuilder.call(MavenBuilder.java:165)
	at hudson.maven.MavenModuleSetBuild$Builder.call(MavenModuleSetBuild.java:750)
	at hudson.maven.MavenModuleSetBuild$Builder.call(MavenModuleSetBuild.java:694)
	at hudson.remoting.UserRequest.perform(UserRequest.java:114)
	at hudson.remoting.UserRequest.perform(UserRequest.java:48)
	at hudson.remoting.Request$2.run(Request.java:270)
	at java.util.concurrent.Executors$RunnableAdapter.call(Executors.java:417)
	at java.util.concurrent.FutureTask$Sync.innerRun(FutureTask.java:269)
	at java.util.concurrent.FutureTask.run(FutureTask.java:123)
	at java.util.concurrent.ThreadPoolExecutor$Worker.runTask(ThreadPoolExecutor.java:651)
	at java.util.concurrent.ThreadPoolExecutor$Worker.run(ThreadPoolExecutor.java:676)
	at java.lang.Thread.run(Thread.java:595)
Caused by: org.apache.maven.plugin.MojoExecutionException: Failed to resolve dependencies
for one or more projects in the reactor. Reason: Missing:
----------
1) org.apache.servicemix.bundles:org.apache.servicemix.bundles.jasypt:jar:1.7_1-SNAPSHOT

  Try downloading the file manually from the project website.

  Then, install it using the command: 
      mvn install:install-file -DgroupId=org.apache.servicemix.bundles -DartifactId=org.apache.servicemix.bundles.jasypt
-Dversion=1.7_1-SNAPSHOT -Dpackaging=jar -Dfile=/path/to/file

  Alternatively, if you host your own repository you can deploy the file there: 
      mvn deploy:deploy-file -DgroupId=org.apache.servicemix.bundles -DartifactId=org.apache.servicemix.bundles.jasypt
-Dversion=1.7_1-SNAPSHOT -Dpackaging=jar -Dfile=/path/to/file -Durl=[url] -DrepositoryId=[id]

  Path to dependency: 
  	1) org.apache.karaf.jaas:org.apache.karaf.jaas.jasypt:bundle:2.1.99-SNAPSHOT
  	2) org.apache.servicemix.bundles:org.apache.servicemix.bundles.jasypt:jar:1.7_1-SNAPSHOT

----------
1 required artifact is missing.

for artifact: 
  org.apache.karaf.jaas:org.apache.karaf.jaas.jasypt:bundle:2.1.99-SNAPSHOT

from the specified remote repositories:
  central (http://repo1.maven.org/maven2),
  fusesource.snapshots (http://repo.fusesource.com/nexus/content/repositories/snapshots),
  apache-snapshots (http://repository.apache.org/content/groups/snapshots-group),
  Nexus (http://repository.apache.org/snapshots),
  servicemix (http://svn.apache.org/repos/asf/servicemix/m2-repo),
  sonatype (http://repository.sonatype.org/content/groups/sonatype-public-grid)


	at org.apache.maven.plugin.resources.remote.ProcessRemoteResourcesMojo.resolveProjectArtifacts(ProcessRemoteResourcesMojo.java:702)
	at org.apache.maven.plugin.resources.remote.ProcessRemoteResourcesMojo.getProjects(ProcessRemoteResourcesMojo.java:602)
	at org.apache.maven.plugin.resources.remote.ProcessRemoteResourcesMojo.configureVelocityContext(ProcessRemoteResourcesMojo.java:969)
	at org.apache.maven.plugin.resources.remote.ProcessRemoteResourcesMojo.execute(ProcessRemoteResourcesMojo.java:492)
	at org.apache.maven.plugin.DefaultPluginManager.executeMojo(DefaultPluginManager.java:490)
	at hudson.maven.agent.PluginManagerInterceptor.executeMojo(PluginManagerInterceptor.java:182)
	at org.apache.maven.lifecycle.DefaultLifecycleExecutor.executeGoals(DefaultLifecycleExecutor.java:694)
	... 28 more
Caused by: org.apache.maven.artifact.resolver.MultipleArtifactsNotFoundException: Missing:
----------
1) org.apache.servicemix.bundles:org.apache.servicemix.bundles.jasypt:jar:1.7_1-SNAPSHOT

  Try downloading the file manually from the project website.

  Then, install it using the command: 
      mvn install:install-file -DgroupId=org.apache.servicemix.bundles -DartifactId=org.apache.servicemix.bundles.jasypt
-Dversion=1.7_1-SNAPSHOT -Dpackaging=jar -Dfile=/path/to/file

  Alternatively, if you host your own repository you can deploy the file there: 
      mvn deploy:deploy-file -DgroupId=org.apache.servicemix.bundles -DartifactId=org.apache.servicemix.bundles.jasypt
-Dversion=1.7_1-SNAPSHOT -Dpackaging=jar -Dfile=/path/to/file -Durl=[url] -DrepositoryId=[id]

  Path to dependency: 
  	1) org.apache.karaf.jaas:org.apache.karaf.jaas.jasypt:bundle:2.1.99-SNAPSHOT
  	2) org.apache.servicemix.bundles:org.apache.servicemix.bundles.jasypt:jar:1.7_1-SNAPSHOT

----------
1 required artifact is missing.

for artifact: 
  org.apache.karaf.jaas:org.apache.karaf.jaas.jasypt:bundle:2.1.99-SNAPSHOT

from the specified remote repositories:
  central (http://repo1.maven.org/maven2),
  fusesource.snapshots (http://repo.fusesource.com/nexus/content/repositories/snapshots),
  apache-snapshots (http://repository.apache.org/content/groups/snapshots-group),
  Nexus (http://repository.apache.org/snapshots),
  servicemix (http://svn.apache.org/repos/asf/servicemix/m2-repo),
  sonatype (http://repository.sonatype.org/content/groups/sonatype-public-grid)


	at org.apache.maven.artifact.resolver.DefaultArtifactResolver.resolveTransitively(DefaultArtifactResolver.java:360)
	at org.apache.maven.artifact.resolver.DefaultArtifactResolver.resolveTransitively(DefaultArtifactResolver.java:304)
	at org.apache.maven.shared.artifact.resolver.DefaultProjectDependenciesResolver.resolve(DefaultProjectDependenciesResolver.java:140)
	at org.apache.maven.shared.artifact.resolver.DefaultProjectDependenciesResolver.resolve(DefaultProjectDependenciesResolver.java:187)
	at org.apache.maven.plugin.resources.remote.ProcessRemoteResourcesMojo.resolveProjectArtifacts(ProcessRemoteResourcesMojo.java:697)
	... 34 more
[INFO] ------------------------------------------------------------------------
[INFO] Total time: 10 minutes 50 seconds
[INFO] Finished at: Mon Nov 08 10:20:37 UTC 2010
[INFO] Final Memory: 53M/332M
[INFO] ------------------------------------------------------------------------
Sending e-mails to: commits@karaf.apache.org
channel stopped


Mime
View raw message