karaf-commits mailing list archives

Site index · List index
Message view « Date » · « Thread »
Top « Date » · « Thread »
From Apache Hudson Server <hud...@hudson.zones.apache.org>
Subject Build failed in Hudson: Karaf » Apache Karaf :: Web Console :: Features Plugin #17
Date Fri, 02 Jul 2010 20:11:51 GMT
See <http://hudson.zones.apache.org/hudson/job/Karaf/org.apache.karaf.webconsole$org.apache.karaf.webconsole.features/17/>

------------------------------------------
[INFO] ------------------------------------------------------------------------
[INFO] Building Apache Karaf :: Web Console :: Features Plugin
[INFO]    task-segment: [clean, install]
[INFO] ------------------------------------------------------------------------
[INFO] [clean:clean {execution: default-clean}]
[INFO] [bundle:cleanVersions {execution: cleanVersions}]
[INFO] [remote-resources:process {execution: default}]
Downloading: http://svn.apache.org/repos/asf/servicemix/m2-repo/org/apache/felix/org.apache.felix.webconsole/3.1.0/org.apache.felix.webconsole-3.1.0.pom
[INFO] Unable to find resource 'org.apache.felix:org.apache.felix.webconsole:pom:3.1.0' in
repository servicemix (http://svn.apache.org/repos/asf/servicemix/m2-repo)
Downloading: http://jansi.fusesource.org/repo/release/org/apache/felix/org.apache.felix.webconsole/3.1.0/org.apache.felix.webconsole-3.1.0.pom
[INFO] Unable to find resource 'org.apache.felix:org.apache.felix.webconsole:pom:3.1.0' in
repository jansi.release.m2 (http://jansi.fusesource.org/repo/release)
Downloading: http://repo1.maven.org/maven2/org/apache/felix/org.apache.felix.webconsole/3.1.0/org.apache.felix.webconsole-3.1.0.pom

Downloading: http://svn.apache.org/repos/asf/servicemix/m2-repo/javax/servlet/servlet-api/2.5/servlet-api-2.5.pom
[INFO] Unable to find resource 'javax.servlet:servlet-api:pom:2.5' in repository servicemix
(http://svn.apache.org/repos/asf/servicemix/m2-repo)
Downloading: http://jansi.fusesource.org/repo/release/javax/servlet/servlet-api/2.5/servlet-api-2.5.pom
[INFO] Unable to find resource 'javax.servlet:servlet-api:pom:2.5' in repository jansi.release.m2
(http://jansi.fusesource.org/repo/release)
Downloading: http://repo1.maven.org/maven2/javax/servlet/servlet-api/2.5/servlet-api-2.5.pom

Downloading: http://svn.apache.org/repos/asf/servicemix/m2-repo/org/json/json/20070829/json-20070829.pom
[INFO] Unable to find resource 'org.json:json:pom:20070829' in repository servicemix (http://svn.apache.org/repos/asf/servicemix/m2-repo)
Downloading: http://jansi.fusesource.org/repo/release/org/json/json/20070829/json-20070829.pom
[INFO] Unable to find resource 'org.json:json:pom:20070829' in repository jansi.release.m2
(http://jansi.fusesource.org/repo/release)
Downloading: http://repo1.maven.org/maven2/org/json/json/20070829/json-20070829.pom

Downloading: http://svn.apache.org/repos/asf/servicemix/m2-repo/org/json/json/20070829/json-20070829.jar
Downloading: http://svn.apache.org/repos/asf/servicemix/m2-repo/javax/servlet/servlet-api/2.5/servlet-api-2.5.jar
Downloading: http://svn.apache.org/repos/asf/servicemix/m2-repo/org/apache/felix/org.apache.felix.webconsole/3.1.0/org.apache.felix.webconsole-3.1.0.jar
[INFO] Unable to find resource 'org.json:json:jar:20070829' in repository servicemix (http://svn.apache.org/repos/asf/servicemix/m2-repo)
[INFO] Unable to find resource 'javax.servlet:servlet-api:jar:2.5' in repository servicemix
(http://svn.apache.org/repos/asf/servicemix/m2-repo)
Downloading: http://jansi.fusesource.org/repo/release/org/json/json/20070829/json-20070829.jar
Downloading: http://jansi.fusesource.org/repo/release/javax/servlet/servlet-api/2.5/servlet-api-2.5.jar
[INFO] Unable to find resource 'org.apache.felix:org.apache.felix.webconsole:jar:3.1.0' in
repository servicemix (http://svn.apache.org/repos/asf/servicemix/m2-repo)
Downloading: http://jansi.fusesource.org/repo/release/org/apache/felix/org.apache.felix.webconsole/3.1.0/org.apache.felix.webconsole-3.1.0.jar
[INFO] Unable to find resource 'org.json:json:jar:20070829' in repository jansi.release.m2
(http://jansi.fusesource.org/repo/release)
[INFO] Unable to find resource 'javax.servlet:servlet-api:jar:2.5' in repository jansi.release.m2
(http://jansi.fusesource.org/repo/release)
Downloading: http://repo1.maven.org/maven2/org/json/json/20070829/json-20070829.jar
Downloading: http://repo1.maven.org/maven2/javax/servlet/servlet-api/2.5/servlet-api-2.5.jar
[INFO] Unable to find resource 'org.apache.felix:org.apache.felix.webconsole:jar:3.1.0' in
repository jansi.release.m2 (http://jansi.fusesource.org/repo/release)
Downloading: http://repo1.maven.org/maven2/org/apache/felix/org.apache.felix.webconsole/3.1.0/org.apache.felix.webconsole-3.1.0.jar



[INFO] [antrun:run {execution: copy-notice}]
[INFO] Executing tasks
     [copy] Copying 1 file to <http://hudson.zones.apache.org/hudson/job/Karaf/org.apache.karaf.webconsole$org.apache.karaf.webconsole.features/ws/target/maven-shared-archive-resources/META-INF>
[INFO] Executed tasks
[INFO] [resources:resources {execution: default-resources}]
[INFO] Using 'UTF-8' encoding to copy filtered resources.
[INFO] Copying 2 resources
[INFO] Copying 1 resource to META-INF
[INFO] Copying 3 resources
[INFO] [compiler:compile {execution: default-compile}]
[INFO] Compiling 2 source files to <http://hudson.zones.apache.org/hudson/job/Karaf/org.apache.karaf.webconsole$org.apache.karaf.webconsole.features/ws/target/classes>
[HUDSON] Archiving <http://hudson.zones.apache.org/hudson/job/Karaf/org.apache.karaf.webconsole$org.apache.karaf.webconsole.features/ws/pom.xml>
to /export/home/hudson/hudson/jobs/Karaf/modules/org.apache.karaf.webconsole$org.apache.karaf.webconsole.features/builds/2010-07-02_20-02-35/archive/org.apache.karaf.webconsole/org.apache.karaf.webconsole.features/1.99.0-SNAPSHOT/pom.xml
[INFO] ------------------------------------------------------------------------
[ERROR] BUILD FAILURE
[INFO] ------------------------------------------------------------------------
[INFO] Compilation failure

<http://hudson.zones.apache.org/hudson/job/Karaf/org.apache.karaf.webconsole$org.apache.karaf.webconsole.features/ws/src/main/java/org/apache/karaf/webconsole/features/ExtendedFeature.java>:[29,7]
org.apache.karaf.webconsole.features.ExtendedFeature is not abstract and does not override
abstract method getBundles() in org.apache.karaf.features.Feature

<http://hudson.zones.apache.org/hudson/job/Karaf/org.apache.karaf.webconsole$org.apache.karaf.webconsole.features/ws/src/main/java/org/apache/karaf/webconsole/features/ExtendedFeature.java>:[67,24]
getBundles() in org.apache.karaf.webconsole.features.ExtendedFeature cannot implement getBundles()
in org.apache.karaf.features.Feature; attempting to use incompatible return type
found   : java.util.List<java.lang.String>
required: java.util.List<org.apache.karaf.features.BundleInfo>

<http://hudson.zones.apache.org/hudson/job/Karaf/org.apache.karaf.webconsole$org.apache.karaf.webconsole.features/ws/src/main/java/org/apache/karaf/webconsole/features/ExtendedFeature.java>:[69,38]
incompatible types
found   : java.util.List<org.apache.karaf.features.BundleInfo>
required: java.util.List<java.lang.String>


[INFO] ------------------------------------------------------------------------
[INFO] Trace
org.apache.maven.BuildFailureException: Compilation failure
	at org.apache.maven.lifecycle.DefaultLifecycleExecutor.executeGoals(DefaultLifecycleExecutor.java:715)
	at org.apache.maven.lifecycle.DefaultLifecycleExecutor.executeGoalWithLifecycle(DefaultLifecycleExecutor.java:556)
	at org.apache.maven.lifecycle.DefaultLifecycleExecutor.executeGoal(DefaultLifecycleExecutor.java:535)
	at org.apache.maven.lifecycle.DefaultLifecycleExecutor.executeGoalAndHandleFailures(DefaultLifecycleExecutor.java:387)
	at org.apache.maven.lifecycle.DefaultLifecycleExecutor.executeTaskSegments(DefaultLifecycleExecutor.java:348)
	at org.apache.maven.lifecycle.DefaultLifecycleExecutor.execute(DefaultLifecycleExecutor.java:180)
	at org.apache.maven.lifecycle.LifecycleExecutorInterceptor.execute(LifecycleExecutorInterceptor.java:65)
	at org.apache.maven.DefaultMaven.doExecute(DefaultMaven.java:328)
	at org.apache.maven.DefaultMaven.execute(DefaultMaven.java:138)
	at org.apache.maven.cli.MavenCli.main(MavenCli.java:362)
	at sun.reflect.NativeMethodAccessorImpl.invoke0(Native Method)
	at sun.reflect.NativeMethodAccessorImpl.invoke(NativeMethodAccessorImpl.java:39)
	at sun.reflect.DelegatingMethodAccessorImpl.invoke(DelegatingMethodAccessorImpl.java:25)
	at java.lang.reflect.Method.invoke(Method.java:592)
	at org.codehaus.classworlds.Launcher.launchEnhanced(Launcher.java:315)
	at org.codehaus.classworlds.Launcher.launch(Launcher.java:255)
	at hudson.maven.agent.Main.launch(Main.java:165)
	at hudson.maven.MavenBuilder.call(MavenBuilder.java:165)
	at hudson.maven.MavenModuleSetBuild$Builder.call(MavenModuleSetBuild.java:696)
	at hudson.maven.MavenModuleSetBuild$Builder.call(MavenModuleSetBuild.java:640)
	at hudson.remoting.UserRequest.perform(UserRequest.java:114)
	at hudson.remoting.UserRequest.perform(UserRequest.java:48)
	at hudson.remoting.Request$2.run(Request.java:270)
	at java.util.concurrent.Executors$RunnableAdapter.call(Executors.java:417)
	at java.util.concurrent.FutureTask$Sync.innerRun(FutureTask.java:269)
	at java.util.concurrent.FutureTask.run(FutureTask.java:123)
	at java.util.concurrent.ThreadPoolExecutor$Worker.runTask(ThreadPoolExecutor.java:651)
	at java.util.concurrent.ThreadPoolExecutor$Worker.run(ThreadPoolExecutor.java:676)
	at java.lang.Thread.run(Thread.java:595)
Caused by: org.apache.maven.plugin.CompilationFailureException: Compilation failure
	at org.apache.maven.plugin.AbstractCompilerMojo.execute(AbstractCompilerMojo.java:516)
	at org.apache.maven.plugin.CompilerMojo.execute(CompilerMojo.java:114)
	at org.apache.maven.plugin.DefaultPluginManager.executeMojo(DefaultPluginManager.java:490)
	at hudson.maven.agent.PluginManagerInterceptor.executeMojo(PluginManagerInterceptor.java:182)
	at org.apache.maven.lifecycle.DefaultLifecycleExecutor.executeGoals(DefaultLifecycleExecutor.java:694)
	... 28 more
[INFO] ------------------------------------------------------------------------
[INFO] Total time: 8 minutes 57 seconds
[INFO] Finished at: Fri Jul 02 20:11:42 UTC 2010
[INFO] Final Memory: 40M/327M
[INFO] ------------------------------------------------------------------------
Waiting for Hudson to finish collecting data


Mime
View raw message