karaf-commits mailing list archives

Site index · List index
Message view « Date » · « Thread »
Top « Date » · « Thread »
From Apache Hudson Server <hud...@hudson.zones.apache.org>
Subject Build failed in Hudson: Karaf #15
Date Fri, 02 Jul 2010 16:12:39 GMT
See <http://hudson.zones.apache.org/hudson/job/Karaf/15/changes>

Changes:

[cmoulliard] KARAF-96 : add attribute to define bundle start level + boolean indicating if
the bundle can start or not. OBR module has been disabled

------------------------------------------
[...truncated 4757 lines...]
-------------------------------------------------------
Running org.apache.karaf.jaas.modules.properties.PropertiesConverterTest
Tests run: 3, Failures: 0, Errors: 0, Skipped: 0, Time elapsed: 0.02 sec

Results :

Tests run: 3, Failures: 0, Errors: 0, Skipped: 0

[HUDSON] Recording test results
[INFO] [bundle:bundle {execution: default-bundle}]
[INFO] [install:install {execution: default-install}]
[INFO] Installing <http://hudson.zones.apache.org/hudson/job/Karaf/ws/karaf/jaas/modules/target/org.apache.karaf.jaas.modules-1.99.0-SNAPSHOT.jar>
to <http://hudson.zones.apache.org/hudson/job/Karaf/ws/.repository/org/apache/karaf/jaas/org.apache.karaf.jaas.modules/1.99.0-SNAPSHOT/org.apache.karaf.jaas.modules-1.99.0-SNAPSHOT.jar>
[INFO] [bundle:install {execution: default-install}]
[INFO] Installing org/apache/karaf/jaas/org.apache.karaf.jaas.modules/1.99.0-SNAPSHOT/org.apache.karaf.jaas.modules-1.99.0-SNAPSHOT.jar
[INFO] Writing OBR metadata
[HUDSON] Archiving <http://hudson.zones.apache.org/hudson/job/Karaf/ws/karaf/jaas/modules/pom.xml>
to /export/home/hudson/hudson/jobs/Karaf/modules/org.apache.karaf.jaas$org.apache.karaf.jaas.modules/builds/2010-07-02_16-02-27/archive/org.apache.karaf.jaas/org.apache.karaf.jaas.modules/1.99.0-SNAPSHOT/pom.xml
[HUDSON] Archiving <http://hudson.zones.apache.org/hudson/job/Karaf/ws/karaf/jaas/modules/target/org.apache.karaf.jaas.modules-1.99.0-SNAPSHOT.jar>
to /export/home/hudson/hudson/jobs/Karaf/modules/org.apache.karaf.jaas$org.apache.karaf.jaas.modules/builds/2010-07-02_16-02-27/archive/org.apache.karaf.jaas/org.apache.karaf.jaas.modules/1.99.0-SNAPSHOT/org.apache.karaf.jaas.modules-1.99.0-SNAPSHOT.jar
[INFO] ------------------------------------------------------------------------
[INFO] Building Apache Karaf :: Client
[INFO]    task-segment: [clean, install]
[INFO] ------------------------------------------------------------------------
Downloading: http://repo1.maven.org/maven2/org/apache/maven/plugins/maven-shade-plugin/1.2/maven-shade-plugin-1.2.pom

Downloading: http://repo1.maven.org/maven2/org/apache/maven/plugins/maven-shade-plugin/1.2/maven-shade-plugin-1.2.jar

[INFO] [clean:clean {execution: default-clean}]
[INFO] [bundle:cleanVersions {execution: cleanVersions}]
[INFO] [remote-resources:process {execution: default}]
[INFO] [antrun:run {execution: copy-notice}]
[INFO] Executing tasks
     [copy] Copying 1 file to <http://hudson.zones.apache.org/hudson/job/Karaf/ws/karaf/client/target/maven-shared-archive-resources/META-INF>
[INFO] Executed tasks
[INFO] [resources:resources {execution: default-resources}]
[INFO] Using 'UTF-8' encoding to copy filtered resources.
[INFO] Copying 1 resource
[INFO] Copying 3 resources
[INFO] [compiler:compile {execution: default-compile}]
[INFO] Compiling 2 source files to <http://hudson.zones.apache.org/hudson/job/Karaf/ws/karaf/client/target/classes>
[INFO] [resources:testResources {execution: default-testResources}]
[INFO] Using 'UTF-8' encoding to copy filtered resources.
[INFO] skip non existing resourceDirectory <http://hudson.zones.apache.org/hudson/job/Karaf/ws/karaf/client/src/test/resources>
[INFO] Copying 3 resources
[INFO] [compiler:testCompile {execution: default-testCompile}]
[INFO] No sources to compile
[INFO] [surefire:test {execution: default-test}]
[INFO] Surefire report directory: <http://hudson.zones.apache.org/hudson/job/Karaf/ws/karaf/client/target/surefire-reports>

-------------------------------------------------------
 T E S T S
-------------------------------------------------------
There are no tests to run.

Results :

Tests run: 0, Failures: 0, Errors: 0, Skipped: 0

[HUDSON] Recording test results[INFO] [bundle:bundle {execution: default-bundle}]

[INFO] Expanding: <http://hudson.zones.apache.org/hudson/job/Karaf/ws/karaf/client/target/org.apache.karaf.client-1.99.0-SNAPSHOT.jar>
into <http://hudson.zones.apache.org/hudson/job/Karaf/ws/karaf/client/target/classes>
Downloading: http://repo1.maven.org/maven2/asm/asm/3.1/asm-3.1.pom

Downloading: http://repo1.maven.org/maven2/asm/asm-parent/3.1/asm-parent-3.1.pom

Downloading: http://repo1.maven.org/maven2/asm/asm-util/3.1/asm-util-3.1.pom

Downloading: http://svn.apache.org/repos/asf/servicemix/m2-repo/asm/asm-tree/3.1/asm-tree-3.1.pom
[INFO] Unable to find resource 'asm:asm-tree:pom:3.1' in repository servicemix (http://svn.apache.org/repos/asf/servicemix/m2-repo)
Downloading: http://jansi.fusesource.org/repo/release/asm/asm-tree/3.1/asm-tree-3.1.pom
[INFO] Unable to find resource 'asm:asm-tree:pom:3.1' in repository jansi.release.m2 (http://jansi.fusesource.org/repo/release)
Downloading: http://repo1.maven.org/maven2/asm/asm-tree/3.1/asm-tree-3.1.pom

Downloading: http://repo1.maven.org/maven2/asm/asm-commons/3.1/asm-commons-3.1.pom

Downloading: http://repo1.maven.org/maven2/jdom/jdom/1.0/jdom-1.0.pom

Downloading: http://repo1.maven.org/maven2/org/apache/maven/shared/maven-dependency-tree/1.1/maven-dependency-tree-1.1.pom

Downloading: http://repo1.maven.org/maven2/org/apache/maven/shared/maven-dependency-tree/1.1/maven-dependency-tree-1.1.jar
Downloading: http://repo1.maven.org/maven2/jdom/jdom/1.0/jdom-1.0.jar
Downloading: http://repo1.maven.org/maven2/asm/asm/3.1/asm-3.1.jar



Downloading: http://repo1.maven.org/maven2/asm/asm-util/3.1/asm-util-3.1.jar

Downloading: http://svn.apache.org/repos/asf/servicemix/m2-repo/asm/asm-tree/3.1/asm-tree-3.1.jar
[INFO] Unable to find resource 'asm:asm-tree:jar:3.1' in repository servicemix (http://svn.apache.org/repos/asf/servicemix/m2-repo)
Downloading: http://jansi.fusesource.org/repo/release/asm/asm-tree/3.1/asm-tree-3.1.jar
[INFO] Unable to find resource 'asm:asm-tree:jar:3.1' in repository jansi.release.m2 (http://jansi.fusesource.org/repo/release)
Downloading: http://repo1.maven.org/maven2/asm/asm-tree/3.1/asm-tree-3.1.jar

Downloading: http://repo1.maven.org/maven2/asm/asm-commons/3.1/asm-commons-3.1.jar

[INFO] [shade:shade {execution: default}]
[INFO] Excluding org.apache.sshd:sshd-core:jar:0.4.0 from the shaded jar.
[INFO] Excluding org.apache.mina:mina-core:jar:2.0.0-RC1 from the shaded jar.
[INFO] Including org.slf4j:slf4j-api:jar:1.4.3 in the shaded jar.
[INFO] Excluding org.apache.karaf.shell:org.apache.karaf.shell.console:jar:1.99.0-SNAPSHOT
from the shaded jar.
[INFO] Excluding jline:jline:jar:0.9.95.20100209 from the shaded jar.
[INFO] Excluding org.fusesource.jansi:jansi:jar:1.2 from the shaded jar.
[INFO] Excluding org.apache.aries.blueprint:org.apache.aries.blueprint:jar:0.1-incubating
from the shaded jar.
[INFO] Excluding org.apache.aries:org.apache.aries.util:jar:0.1-incubating from the shaded
jar.
[INFO] Excluding org.apache.felix.gogo:org.apache.felix.gogo.runtime:jar:0.4.0 from the shaded
jar.
[INFO] Excluding org.slf4j:slf4j-simple:jar:1.4.3 from the shaded jar.
[INFO] No artifact matching filter org.slf4j:slf4j-nop
[INFO] Replacing original artifact with shaded artifact.
[INFO] Replacing <http://hudson.zones.apache.org/hudson/job/Karaf/ws/karaf/client/target/org.apache.karaf.client-1.99.0-SNAPSHOT.jar>
with <http://hudson.zones.apache.org/hudson/job/Karaf/ws/karaf/client/target/org.apache.karaf.client-1.99.0-SNAPSHOT-shaded.jar>
[INFO] [install:install {execution: default-install}]
[INFO] Installing <http://hudson.zones.apache.org/hudson/job/Karaf/ws/karaf/client/target/org.apache.karaf.client-1.99.0-SNAPSHOT.jar>
to <http://hudson.zones.apache.org/hudson/job/Karaf/ws/.repository/org/apache/karaf/org.apache.karaf.client/1.99.0-SNAPSHOT/org.apache.karaf.client-1.99.0-SNAPSHOT.jar>
[INFO] [bundle:install {execution: default-install}]
[INFO] Installing org/apache/karaf/org.apache.karaf.client/1.99.0-SNAPSHOT/org.apache.karaf.client-1.99.0-SNAPSHOT.jar
[INFO] Writing OBR metadata
[HUDSON] Archiving <http://hudson.zones.apache.org/hudson/job/Karaf/ws/karaf/client/dependency-reduced-pom.xml>
to /export/home/hudson/hudson/jobs/Karaf/modules/org.apache.karaf$org.apache.karaf.client/builds/2010-07-02_16-02-27/archive/org.apache.karaf/org.apache.karaf.client/1.99.0-SNAPSHOT/dependency-reduced-pom.xml
[HUDSON] Archiving <http://hudson.zones.apache.org/hudson/job/Karaf/ws/karaf/client/target/org.apache.karaf.client-1.99.0-SNAPSHOT.jar>
to /export/home/hudson/hudson/jobs/Karaf/modules/org.apache.karaf$org.apache.karaf.client/builds/2010-07-02_16-02-27/archive/org.apache.karaf/org.apache.karaf.client/1.99.0-SNAPSHOT/org.apache.karaf.client-1.99.0-SNAPSHOT.jar
[INFO] ------------------------------------------------------------------------
[INFO] Building Apache Karaf :: Web Console
[INFO]    task-segment: [clean, install]
[INFO] ------------------------------------------------------------------------
[INFO] [clean:clean {execution: default-clean}]
[INFO] [bundle:cleanVersions {execution: cleanVersions}]
[INFO] [remote-resources:process {execution: default}]
[INFO] [antrun:run {execution: copy-notice}]
[INFO] Executing tasks
     [copy] Warning: Could not find file <http://hudson.zones.apache.org/hudson/job/Karaf/ws/karaf/webconsole/NOTICE>
to copy.
[INFO] Executed tasks
[INFO] [site:attach-descriptor {execution: default-attach-descriptor}]
[INFO] [install:install {execution: default-install}]
[INFO] Installing <http://hudson.zones.apache.org/hudson/job/Karaf/ws/karaf/webconsole/pom.xml>
to <http://hudson.zones.apache.org/hudson/job/Karaf/ws/.repository/org/apache/karaf/webconsole/webconsole/1.99.0-SNAPSHOT/webconsole-1.99.0-SNAPSHOT.pom>
[HUDSON] Archiving <http://hudson.zones.apache.org/hudson/job/Karaf/ws/karaf/webconsole/pom.xml>
to /export/home/hudson/hudson/jobs/Karaf/modules/org.apache.karaf.webconsole$webconsole/builds/2010-07-02_16-02-27/archive/org.apache.karaf.webconsole/webconsole/1.99.0-SNAPSHOT/pom.xml
[HUDSON] Archiving <http://hudson.zones.apache.org/hudson/job/Karaf/ws/.repository/org/apache/karaf/webconsole/webconsole/1.99.0-SNAPSHOT/webconsole-1.99.0-SNAPSHOT.pom>
to /export/home/hudson/hudson/jobs/Karaf/modules/org.apache.karaf.webconsole$webconsole/builds/2010-07-02_16-02-27/archive/org.apache.karaf.webconsole/webconsole/1.99.0-SNAPSHOT/webconsole-1.99.0-SNAPSHOT.pom
[INFO] ------------------------------------------------------------------------
[INFO] Building Apache Karaf :: Web Console :: Features Plugin
[INFO]    task-segment: [clean, install]
[INFO] ------------------------------------------------------------------------
[INFO] [clean:clean {execution: default-clean}]
[INFO] [bundle:cleanVersions {execution: cleanVersions}]
[INFO] [remote-resources:process {execution: default}]
Downloading: http://svn.apache.org/repos/asf/servicemix/m2-repo/org/apache/felix/org.apache.felix.webconsole/3.1.0/org.apache.felix.webconsole-3.1.0.pom
[INFO] Unable to find resource 'org.apache.felix:org.apache.felix.webconsole:pom:3.1.0' in
repository servicemix (http://svn.apache.org/repos/asf/servicemix/m2-repo)
Downloading: http://jansi.fusesource.org/repo/release/org/apache/felix/org.apache.felix.webconsole/3.1.0/org.apache.felix.webconsole-3.1.0.pom
[INFO] Unable to find resource 'org.apache.felix:org.apache.felix.webconsole:pom:3.1.0' in
repository jansi.release.m2 (http://jansi.fusesource.org/repo/release)
Downloading: http://repo1.maven.org/maven2/org/apache/felix/org.apache.felix.webconsole/3.1.0/org.apache.felix.webconsole-3.1.0.pom

Downloading: http://svn.apache.org/repos/asf/servicemix/m2-repo/javax/servlet/servlet-api/2.5/servlet-api-2.5.pom
[INFO] Unable to find resource 'javax.servlet:servlet-api:pom:2.5' in repository servicemix
(http://svn.apache.org/repos/asf/servicemix/m2-repo)
Downloading: http://jansi.fusesource.org/repo/release/javax/servlet/servlet-api/2.5/servlet-api-2.5.pom
[INFO] Unable to find resource 'javax.servlet:servlet-api:pom:2.5' in repository jansi.release.m2
(http://jansi.fusesource.org/repo/release)
Downloading: http://repo1.maven.org/maven2/javax/servlet/servlet-api/2.5/servlet-api-2.5.pom

Downloading: http://svn.apache.org/repos/asf/servicemix/m2-repo/org/json/json/20070829/json-20070829.pom
[INFO] Unable to find resource 'org.json:json:pom:20070829' in repository servicemix (http://svn.apache.org/repos/asf/servicemix/m2-repo)
Downloading: http://jansi.fusesource.org/repo/release/org/json/json/20070829/json-20070829.pom
[INFO] Unable to find resource 'org.json:json:pom:20070829' in repository jansi.release.m2
(http://jansi.fusesource.org/repo/release)
Downloading: http://repo1.maven.org/maven2/org/json/json/20070829/json-20070829.pom

Downloading: http://svn.apache.org/repos/asf/servicemix/m2-repo/org/json/json/20070829/json-20070829.jar
Downloading: http://svn.apache.org/repos/asf/servicemix/m2-repo/javax/servlet/servlet-api/2.5/servlet-api-2.5.jar
Downloading: http://svn.apache.org/repos/asf/servicemix/m2-repo/org/apache/felix/org.apache.felix.webconsole/3.1.0/org.apache.felix.webconsole-3.1.0.jar
[INFO] Unable to find resource 'javax.servlet:servlet-api:jar:2.5' in repository servicemix
(http://svn.apache.org/repos/asf/servicemix/m2-repo)
[INFO] Unable to find resource 'org.json:json:jar:20070829' in repository servicemix (http://svn.apache.org/repos/asf/servicemix/m2-repo)
Downloading: http://jansi.fusesource.org/repo/release/javax/servlet/servlet-api/2.5/servlet-api-2.5.jar
Downloading: http://jansi.fusesource.org/repo/release/org/json/json/20070829/json-20070829.jar
[INFO] Unable to find resource 'org.apache.felix:org.apache.felix.webconsole:jar:3.1.0' in
repository servicemix (http://svn.apache.org/repos/asf/servicemix/m2-repo)
Downloading: http://jansi.fusesource.org/repo/release/org/apache/felix/org.apache.felix.webconsole/3.1.0/org.apache.felix.webconsole-3.1.0.jar
[INFO] Unable to find resource 'org.json:json:jar:20070829' in repository jansi.release.m2
(http://jansi.fusesource.org/repo/release)
Downloading: http://repo1.maven.org/maven2/org/json/json/20070829/json-20070829.jar
[INFO] Unable to find resource 'javax.servlet:servlet-api:jar:2.5' in repository jansi.release.m2
(http://jansi.fusesource.org/repo/release)
Downloading: http://repo1.maven.org/maven2/javax/servlet/servlet-api/2.5/servlet-api-2.5.jar
[INFO] Unable to find resource 'org.apache.felix:org.apache.felix.webconsole:jar:3.1.0' in
repository jansi.release.m2 (http://jansi.fusesource.org/repo/release)
Downloading: http://repo1.maven.org/maven2/org/apache/felix/org.apache.felix.webconsole/3.1.0/org.apache.felix.webconsole-3.1.0.jar



[INFO] [antrun:run {execution: copy-notice}]
[INFO] Executing tasks
     [copy] Copying 1 file to <http://hudson.zones.apache.org/hudson/job/Karaf/ws/karaf/webconsole/features/target/maven-shared-archive-resources/META-INF>
[INFO] Executed tasks
[INFO] [resources:resources {execution: default-resources}]
[INFO] Using 'UTF-8' encoding to copy filtered resources.
[INFO] Copying 2 resources
[INFO] Copying 1 resource to META-INF
[INFO] Copying 3 resources
[INFO] [compiler:compile {execution: default-compile}]
[INFO] Compiling 2 source files to <http://hudson.zones.apache.org/hudson/job/Karaf/ws/karaf/webconsole/features/target/classes>
[HUDSON] Archiving <http://hudson.zones.apache.org/hudson/job/Karaf/ws/karaf/webconsole/features/pom.xml>
to /export/home/hudson/hudson/jobs/Karaf/modules/org.apache.karaf.webconsole$org.apache.karaf.webconsole.features/builds/2010-07-02_16-02-27/archive/org.apache.karaf.webconsole/org.apache.karaf.webconsole.features/1.99.0-SNAPSHOT/pom.xml
[INFO] ------------------------------------------------------------------------
[ERROR] BUILD FAILURE
[INFO] ------------------------------------------------------------------------
[INFO] Compilation failure

<http://hudson.zones.apache.org/hudson/job/Karaf/ws/karaf/webconsole/features/src/main/java/org/apache/karaf/webconsole/features/ExtendedFeature.java>:[29,7]
org.apache.karaf.webconsole.features.ExtendedFeature is not abstract and does not override
abstract method getBundles() in org.apache.karaf.features.Feature

<http://hudson.zones.apache.org/hudson/job/Karaf/ws/karaf/webconsole/features/src/main/java/org/apache/karaf/webconsole/features/ExtendedFeature.java>:[67,24]
getBundles() in org.apache.karaf.webconsole.features.ExtendedFeature cannot implement getBundles()
in org.apache.karaf.features.Feature; attempting to use incompatible return type
found   : java.util.List<java.lang.String>
required: java.util.List<org.apache.karaf.features.BundleInfo>

<http://hudson.zones.apache.org/hudson/job/Karaf/ws/karaf/webconsole/features/src/main/java/org/apache/karaf/webconsole/features/ExtendedFeature.java>:[69,38]
incompatible types
found   : java.util.List<org.apache.karaf.features.BundleInfo>
required: java.util.List<java.lang.String>


[INFO] ------------------------------------------------------------------------
[INFO] Trace
org.apache.maven.BuildFailureException: Compilation failure
	at org.apache.maven.lifecycle.DefaultLifecycleExecutor.executeGoals(DefaultLifecycleExecutor.java:715)
	at org.apache.maven.lifecycle.DefaultLifecycleExecutor.executeGoalWithLifecycle(DefaultLifecycleExecutor.java:556)
	at org.apache.maven.lifecycle.DefaultLifecycleExecutor.executeGoal(DefaultLifecycleExecutor.java:535)
	at org.apache.maven.lifecycle.DefaultLifecycleExecutor.executeGoalAndHandleFailures(DefaultLifecycleExecutor.java:387)
	at org.apache.maven.lifecycle.DefaultLifecycleExecutor.executeTaskSegments(DefaultLifecycleExecutor.java:348)
	at org.apache.maven.lifecycle.DefaultLifecycleExecutor.execute(DefaultLifecycleExecutor.java:180)
	at org.apache.maven.lifecycle.LifecycleExecutorInterceptor.execute(LifecycleExecutorInterceptor.java:65)
	at org.apache.maven.DefaultMaven.doExecute(DefaultMaven.java:328)
	at org.apache.maven.DefaultMaven.execute(DefaultMaven.java:138)
	at org.apache.maven.cli.MavenCli.main(MavenCli.java:362)
	at sun.reflect.NativeMethodAccessorImpl.invoke0(Native Method)
	at sun.reflect.NativeMethodAccessorImpl.invoke(NativeMethodAccessorImpl.java:39)
	at sun.reflect.DelegatingMethodAccessorImpl.invoke(DelegatingMethodAccessorImpl.java:25)
	at java.lang.reflect.Method.invoke(Method.java:592)
	at org.codehaus.classworlds.Launcher.launchEnhanced(Launcher.java:315)
	at org.codehaus.classworlds.Launcher.launch(Launcher.java:255)
	at hudson.maven.agent.Main.launch(Main.java:165)
	at hudson.maven.MavenBuilder.call(MavenBuilder.java:165)
	at hudson.maven.MavenModuleSetBuild$Builder.call(MavenModuleSetBuild.java:696)
	at hudson.maven.MavenModuleSetBuild$Builder.call(MavenModuleSetBuild.java:640)
	at hudson.remoting.UserRequest.perform(UserRequest.java:114)
	at hudson.remoting.UserRequest.perform(UserRequest.java:48)
	at hudson.remoting.Request$2.run(Request.java:270)
	at java.util.concurrent.Executors$RunnableAdapter.call(Executors.java:417)
	at java.util.concurrent.FutureTask$Sync.innerRun(FutureTask.java:269)
	at java.util.concurrent.FutureTask.run(FutureTask.java:123)
	at java.util.concurrent.ThreadPoolExecutor$Worker.runTask(ThreadPoolExecutor.java:651)
	at java.util.concurrent.ThreadPoolExecutor$Worker.run(ThreadPoolExecutor.java:676)
	at java.lang.Thread.run(Thread.java:595)
Caused by: org.apache.maven.plugin.CompilationFailureException: Compilation failure
	at org.apache.maven.plugin.AbstractCompilerMojo.execute(AbstractCompilerMojo.java:516)
	at org.apache.maven.plugin.CompilerMojo.execute(CompilerMojo.java:114)
	at org.apache.maven.plugin.DefaultPluginManager.executeMojo(DefaultPluginManager.java:490)
	at hudson.maven.agent.PluginManagerInterceptor.executeMojo(PluginManagerInterceptor.java:182)
	at org.apache.maven.lifecycle.DefaultLifecycleExecutor.executeGoals(DefaultLifecycleExecutor.java:694)
	... 28 more
[INFO] ------------------------------------------------------------------------
[INFO] Total time: 9 minutes 57 seconds
[INFO] Finished at: Fri Jul 02 16:12:32 UTC 2010
[INFO] Final Memory: 40M/300M
[INFO] ------------------------------------------------------------------------
Waiting for Hudson to finish collecting data
Sending e-mails to: commits@karaf.apache.org
Sending e-mails to: commits@karaf.apache.org
channel stopped


Mime
View raw message