kafka-dev mailing list archives

Site index · List index
Message view « Date » · « Thread »
Top « Date » · « Thread »
From Apache Jenkins Server <jenk...@builds.apache.org>
Subject Build failed in Jenkins: Kafka » kafka-trunk-jdk15 #628
Date Mon, 15 Mar 2021 17:26:32 GMT
See <https://ci-builds.apache.org/job/Kafka/job/kafka-trunk-jdk15/628/display/redirect?page=changes>

Changes:

[github] KAFKA-10348: Share client channel between forwarding and auto creation manager (#10135)


------------------------------------------
[...truncated 3.68 MB...]
AclAuthorizerTest > testAuthorizeByResourceTypeWildcardResourceDenyDominate() STARTED

AclAuthorizerTest > testAuthorizeByResourceTypeWildcardResourceDenyDominate() PASSED

AclAuthorizerTest > testEmptyAclThrowsException() STARTED

AclAuthorizerTest > testEmptyAclThrowsException() PASSED

AclAuthorizerTest > testAuthorizeByResourceTypeNoAclFoundOverride() STARTED

AclAuthorizerTest > testAuthorizeByResourceTypeNoAclFoundOverride() PASSED

AclAuthorizerTest > testSuperUserWithCustomPrincipalHasAccess() STARTED

AclAuthorizerTest > testSuperUserWithCustomPrincipalHasAccess() PASSED

AclAuthorizerTest > testAuthorizeByResourceTypeWithAllOperationAce() STARTED

AclAuthorizerTest > testAuthorizeByResourceTypeWithAllOperationAce() PASSED

AclAuthorizerTest > testAllowAccessWithCustomPrincipal() STARTED

AclAuthorizerTest > testAllowAccessWithCustomPrincipal() PASSED

AclAuthorizerTest > testDeleteAclOnWildcardResource() STARTED

AclAuthorizerTest > testDeleteAclOnWildcardResource() PASSED

AclAuthorizerTest > testAuthorizerZkConfigFromKafkaConfig() STARTED

AclAuthorizerTest > testAuthorizerZkConfigFromKafkaConfig() PASSED

AclAuthorizerTest > testChangeListenerTiming() STARTED

AclAuthorizerTest > testChangeListenerTiming() PASSED

AclAuthorizerTest > testWritesLiteralWritesLiteralAclChangeEventWhenInterBrokerProtocolLessThanKafkaV2eralAclChangesForOlderProtocolVersions()
STARTED

AclAuthorizerTest > testWritesLiteralWritesLiteralAclChangeEventWhenInterBrokerProtocolLessThanKafkaV2eralAclChangesForOlderProtocolVersions()
PASSED

AclAuthorizerTest > testAuthorzeByResourceTypeSuperUserHasAccess() STARTED

AclAuthorizerTest > testAuthorzeByResourceTypeSuperUserHasAccess() PASSED

AclAuthorizerTest > testAuthorizeByResourceTypePrefixedResourceDenyDominate() STARTED

AclAuthorizerTest > testAuthorizeByResourceTypePrefixedResourceDenyDominate() PASSED

AclAuthorizerTest > testAuthorizeByResourceTypeMultipleAddAndRemove() STARTED

AclAuthorizerTest > testAuthorizeByResourceTypeMultipleAddAndRemove() PASSED

AclAuthorizerTest > testThrowsOnAddPrefixedAclIfInterBrokerProtocolVersionTooLow() STARTED

AclAuthorizerTest > testThrowsOnAddPrefixedAclIfInterBrokerProtocolVersionTooLow() PASSED

AclAuthorizerTest > testAccessAllowedIfAllowAclExistsOnPrefixedResource() STARTED

AclAuthorizerTest > testAccessAllowedIfAllowAclExistsOnPrefixedResource() PASSED

AclAuthorizerTest > testAuthorizeByResourceTypeDenyTakesPrecedence() STARTED

AclAuthorizerTest > testAuthorizeByResourceTypeDenyTakesPrecedence() PASSED

AclAuthorizerTest > testHighConcurrencyModificationOfResourceAcls() STARTED

AclAuthorizerTest > testHighConcurrencyModificationOfResourceAcls() PASSED

AclAuthorizerTest > testAuthorizeByResourceTypeWithAllPrincipalAce() STARTED

AclAuthorizerTest > testAuthorizeByResourceTypeWithAllPrincipalAce() PASSED

AclAuthorizerTest > testAuthorizeWithEmptyResourceName() STARTED

AclAuthorizerTest > testAuthorizeWithEmptyResourceName() PASSED

AclAuthorizerTest > testAuthorizeThrowsOnNonLiteralResource() STARTED

AclAuthorizerTest > testAuthorizeThrowsOnNonLiteralResource() PASSED

AclAuthorizerTest > testDeleteAllAclOnPrefixedResource() STARTED

AclAuthorizerTest > testDeleteAllAclOnPrefixedResource() PASSED

AclAuthorizerTest > testAddAclsOnLiteralResource() STARTED

AclAuthorizerTest > testAddAclsOnLiteralResource() PASSED

AclAuthorizerTest > testGetAclsPrincipal() STARTED

AclAuthorizerTest > testGetAclsPrincipal() PASSED

AclAuthorizerTest > testWritesExtendedAclChangeEventIfInterBrokerProtocolNotSet() STARTED

AclAuthorizerTest > testWritesExtendedAclChangeEventIfInterBrokerProtocolNotSet() PASSED

AclAuthorizerTest > testAccessAllowedIfAllowAclExistsOnWildcardResource() STARTED

AclAuthorizerTest > testAccessAllowedIfAllowAclExistsOnWildcardResource() PASSED

AclAuthorizerTest > testLoadCache() STARTED

AclAuthorizerTest > testLoadCache() PASSED

AuthorizerInterfaceDefaultTest > testAuthorizeByResourceTypeWithAllHostAce() STARTED

AuthorizerInterfaceDefaultTest > testAuthorizeByResourceTypeWithAllHostAce() PASSED

AuthorizerInterfaceDefaultTest > testAuthorizeByResourceTypeIsolationUnrelatedDenyWontDominateAllow()
STARTED

AuthorizerInterfaceDefaultTest > testAuthorizeByResourceTypeIsolationUnrelatedDenyWontDominateAllow()
PASSED

AuthorizerInterfaceDefaultTest > testAuthorizeByResourceTypeWildcardResourceDenyDominate()
STARTED

AuthorizerInterfaceDefaultTest > testAuthorizeByResourceTypeWildcardResourceDenyDominate()
PASSED

AuthorizerInterfaceDefaultTest > testAuthorizeByResourceTypeWithAllOperationAce() STARTED

AuthorizerInterfaceDefaultTest > testAuthorizeByResourceTypeWithAllOperationAce() PASSED

AuthorizerInterfaceDefaultTest > testAuthorzeByResourceTypeSuperUserHasAccess() STARTED

AuthorizerInterfaceDefaultTest > testAuthorzeByResourceTypeSuperUserHasAccess() PASSED

AuthorizerInterfaceDefaultTest > testAuthorizeByResourceTypePrefixedResourceDenyDominate()
STARTED

AuthorizerInterfaceDefaultTest > testAuthorizeByResourceTypePrefixedResourceDenyDominate()
PASSED

AuthorizerInterfaceDefaultTest > testAuthorizeByResourceTypeMultipleAddAndRemove() STARTED

AuthorizerInterfaceDefaultTest > testAuthorizeByResourceTypeMultipleAddAndRemove() PASSED

AuthorizerInterfaceDefaultTest > testAuthorizeByResourceTypeDenyTakesPrecedence() STARTED

AuthorizerInterfaceDefaultTest > testAuthorizeByResourceTypeDenyTakesPrecedence() PASSED

AuthorizerInterfaceDefaultTest > testAuthorizeByResourceTypeWithAllPrincipalAce() STARTED

AuthorizerInterfaceDefaultTest > testAuthorizeByResourceTypeWithAllPrincipalAce() PASSED

AclEntryTest > testAclJsonConversion() STARTED

AclEntryTest > testAclJsonConversion() PASSED

AuthorizerWrapperTest > testAuthorizeByResourceTypeDisableAllowEveryoneOverride() STARTED

AuthorizerWrapperTest > testAuthorizeByResourceTypeDisableAllowEveryoneOverride() PASSED

AuthorizerWrapperTest > testAuthorizeByResourceTypeWithAllHostAce() STARTED

AuthorizerWrapperTest > testAuthorizeByResourceTypeWithAllHostAce() PASSED

AuthorizerWrapperTest > testAuthorizeByResourceTypeIsolationUnrelatedDenyWontDominateAllow()
STARTED

AuthorizerWrapperTest > testAuthorizeByResourceTypeIsolationUnrelatedDenyWontDominateAllow()
PASSED

AuthorizerWrapperTest > testAuthorizeByResourceTypeWildcardResourceDenyDominate() STARTED

AuthorizerWrapperTest > testAuthorizeByResourceTypeWildcardResourceDenyDominate() PASSED

AuthorizerWrapperTest > testAuthorizeByResourceTypeEnableAllowEveryOne() STARTED

AuthorizerWrapperTest > testAuthorizeByResourceTypeEnableAllowEveryOne() PASSED

AuthorizerWrapperTest > testAuthorizeByResourceTypeWithAllOperationAce() STARTED

AuthorizerWrapperTest > testAuthorizeByResourceTypeWithAllOperationAce() PASSED

AuthorizerWrapperTest > testAuthorzeByResourceTypeSuperUserHasAccess() STARTED

AuthorizerWrapperTest > testAuthorzeByResourceTypeSuperUserHasAccess() PASSED

AuthorizerWrapperTest > testAuthorizeByResourceTypePrefixedResourceDenyDominate() STARTED

AuthorizerWrapperTest > testAuthorizeByResourceTypePrefixedResourceDenyDominate() PASSED

AuthorizerWrapperTest > testAuthorizeByResourceTypeMultipleAddAndRemove() STARTED

AuthorizerWrapperTest > testAuthorizeByResourceTypeMultipleAddAndRemove() PASSED

AuthorizerWrapperTest > testAuthorizeByResourceTypeDenyTakesPrecedence() STARTED

AuthorizerWrapperTest > testAuthorizeByResourceTypeDenyTakesPrecedence() PASSED

AuthorizerWrapperTest > testAuthorizeByResourceTypeWithAllPrincipalAce() STARTED

AuthorizerWrapperTest > testAuthorizeByResourceTypeWithAllPrincipalAce() PASSED

ControllerContextTest > testPartitionFullReplicaAssignmentReturnsEmptyAssignmentIfTopicOrPartitionDoesNotExist()
STARTED

ControllerContextTest > testPartitionFullReplicaAssignmentReturnsEmptyAssignmentIfTopicOrPartitionDoesNotExist()
PASSED

ControllerContextTest > testPartitionReplicaAssignmentForTopicReturnsEmptyMapIfTopicDoesNotExist()
STARTED

ControllerContextTest > testPartitionReplicaAssignmentForTopicReturnsEmptyMapIfTopicDoesNotExist()
PASSED

ControllerContextTest > testPreferredReplicaImbalanceMetric() STARTED

ControllerContextTest > testPreferredReplicaImbalanceMetric() PASSED

ControllerContextTest > testPartitionReplicaAssignmentForTopicReturnsExpectedReplicaAssignments()
STARTED

ControllerContextTest > testPartitionReplicaAssignmentForTopicReturnsExpectedReplicaAssignments()
PASSED

ControllerContextTest > testReassignTo() STARTED

ControllerContextTest > testReassignTo() PASSED

ControllerContextTest > testPartitionReplicaAssignment() STARTED

ControllerContextTest > testPartitionReplicaAssignment() PASSED

ControllerContextTest > testUpdatePartitionFullReplicaAssignmentUpdatesReplicaAssignment()
STARTED

ControllerContextTest > testUpdatePartitionFullReplicaAssignmentUpdatesReplicaAssignment()
PASSED

ControllerContextTest > testReassignToIdempotence() STARTED

ControllerContextTest > testReassignToIdempotence() PASSED

ControllerContextTest > testPartitionReplicaAssignmentReturnsEmptySeqIfTopicOrPartitionDoesNotExist()
STARTED

ControllerContextTest > testPartitionReplicaAssignmentReturnsEmptySeqIfTopicOrPartitionDoesNotExist()
PASSED

3476 tests completed, 1 failed, 7 skipped

> Task :core:test FAILED

FAILURE: Build failed with an exception.

* What went wrong:
Execution failed for task ':core:test'.
> There were failing tests. See the report at: file://<https://ci-builds.apache.org/job/Kafka/job/kafka-trunk-jdk15/ws/core/build/reports/tests/test/index.html>

* Try:
Run with --stacktrace option to get the stack trace. Run with --info or --debug option to
get more log output. Run with --scan to get full insights.

* Get more help at https://help.gradle.org

Deprecated Gradle features were used in this build, making it incompatible with Gradle 7.0.
Use '--warning-mode all' to show the individual deprecation warnings.
See https://docs.gradle.org/6.8.3/userguide/command_line_interface.html#sec:command_line_warnings

BUILD FAILED in 1h 32m 22s
257 actionable tasks: 220 executed, 37 up-to-date
Build step 'Execute shell' marked build as failure
Recording test results
[Checks API] No suitable checks publisher found.
Not sending mail to unregistered user github@hugo-hirsch.de

Mime
View raw message