kafka-dev mailing list archives

Site index · List index
Message view « Date » · « Thread »
Top « Date » · « Thread »
From Apache Jenkins Server <jenk...@builds.apache.org>
Subject Build failed in Jenkins: Kafka » kafka-2.8-jdk8 #38
Date Thu, 25 Feb 2021 23:37:25 GMT
See <https://ci-builds.apache.org/job/Kafka/job/kafka-2.8-jdk8/38/display/redirect?page=changes>

Changes:

[Colin McCabe] MINOR: fix syntax error in upgrade_test.py (#10210)


------------------------------------------
[...truncated 7.22 MB...]
SocketServerTest > testConnectionId() PASSED

SocketServerTest > remoteCloseSendFailure() STARTED

SocketServerTest > remoteCloseSendFailure() PASSED

SocketServerTest > testBrokerSendAfterChannelClosedUpdatesRequestMetrics() STARTED

SocketServerTest > testBrokerSendAfterChannelClosedUpdatesRequestMetrics() PASSED

SocketServerTest > testControlPlaneTakePrecedenceOverInterBrokerListenerAsPrivilegedListener()
STARTED

SocketServerTest > testControlPlaneTakePrecedenceOverInterBrokerListenerAsPrivilegedListener()
PASSED

SocketServerTest > testNoOpAction() STARTED

SocketServerTest > testNoOpAction() PASSED

SocketServerTest > simpleRequest() STARTED

SocketServerTest > simpleRequest() PASSED

SocketServerTest > testSendActionResponseWithThrottledChannelWhereThrottlingInProgress()
STARTED

SocketServerTest > testSendActionResponseWithThrottledChannelWhereThrottlingInProgress()
PASSED

SocketServerTest > testIdleConnection() STARTED

SocketServerTest > testIdleConnection() PASSED

SocketServerTest > remoteCloseWithoutBufferedReceives() STARTED

SocketServerTest > remoteCloseWithoutBufferedReceives() PASSED

SocketServerTest > remoteCloseWithCompleteAndIncompleteBufferedReceives() STARTED

SocketServerTest > remoteCloseWithCompleteAndIncompleteBufferedReceives() PASSED

SocketServerTest > testZeroMaxConnectionsPerIp() STARTED

SocketServerTest > testZeroMaxConnectionsPerIp() PASSED

SocketServerTest > testClientInformationWithLatestApiVersionsRequest() STARTED

SocketServerTest > testClientInformationWithLatestApiVersionsRequest() PASSED

SocketServerTest > testMetricCollectionAfterShutdown() STARTED

SocketServerTest > testMetricCollectionAfterShutdown() PASSED

SocketServerTest > testSessionPrincipal() STARTED

SocketServerTest > testSessionPrincipal() PASSED

SocketServerTest > configureNewConnectionException() STARTED

SocketServerTest > configureNewConnectionException() PASSED

SocketServerTest > testSaslReauthenticationFailureWithKip152SaslAuthenticate() STARTED

SocketServerTest > testSaslReauthenticationFailureWithKip152SaslAuthenticate() PASSED

SocketServerTest > testMaxConnectionsPerIpOverrides() STARTED

SocketServerTest > testMaxConnectionsPerIpOverrides() PASSED

SocketServerTest > processNewResponseException() STARTED

SocketServerTest > processNewResponseException() PASSED

SocketServerTest > remoteCloseWithIncompleteBufferedReceive() STARTED

SocketServerTest > remoteCloseWithIncompleteBufferedReceive() PASSED

SocketServerTest > testStagedListenerShutdownWhenConnectionQueueIsFull() STARTED

SocketServerTest > testStagedListenerShutdownWhenConnectionQueueIsFull() PASSED

SocketServerTest > testStagedListenerStartup() STARTED

SocketServerTest > testStagedListenerStartup() PASSED

SocketServerTest > testConnectionRateLimit() STARTED

SocketServerTest > testConnectionRateLimit() PASSED

SocketServerTest > testConnectionRatePerIp() STARTED

SocketServerTest > testConnectionRatePerIp() PASSED

SocketServerTest > processCompletedSendException() STARTED

SocketServerTest > processCompletedSendException() PASSED

SocketServerTest > processDisconnectedException() STARTED

SocketServerTest > processDisconnectedException() PASSED

SocketServerTest > closingChannelWithBufferedReceives() STARTED

SocketServerTest > closingChannelWithBufferedReceives() PASSED

SocketServerTest > sendCancelledKeyException() STARTED

SocketServerTest > sendCancelledKeyException() PASSED

SocketServerTest > processCompletedReceiveException() STARTED

SocketServerTest > processCompletedReceiveException() PASSED

SocketServerTest > testControlPlaneAsPrivilegedListener() STARTED

SocketServerTest > testControlPlaneAsPrivilegedListener() PASSED

SocketServerTest > closingChannelSendFailure() STARTED

SocketServerTest > closingChannelSendFailure() PASSED

SocketServerTest > idleExpiryWithBufferedReceives() STARTED

SocketServerTest > idleExpiryWithBufferedReceives() PASSED

SocketServerTest > testSocketsCloseOnShutdown() STARTED

SocketServerTest > testSocketsCloseOnShutdown() PASSED

SocketServerTest > testNoOpActionResponseWithThrottledChannelWhereThrottlingAlreadyDone()
STARTED

SocketServerTest > testNoOpActionResponseWithThrottledChannelWhereThrottlingAlreadyDone()
PASSED

SocketServerTest > pollException() STARTED

SocketServerTest > pollException() PASSED

SocketServerTest > closingChannelWithBufferedReceivesFailedSend() STARTED

SocketServerTest > closingChannelWithBufferedReceivesFailedSend() PASSED

SocketServerTest > remoteCloseWithBufferedReceives() STARTED

SocketServerTest > remoteCloseWithBufferedReceives() PASSED

SocketServerTest > testThrottledSocketsClosedOnShutdown() STARTED

SocketServerTest > testThrottledSocketsClosedOnShutdown() PASSED

SocketServerTest > closingChannelWithCompleteAndIncompleteBufferedReceives() STARTED

SocketServerTest > closingChannelWithCompleteAndIncompleteBufferedReceives() PASSED

SocketServerTest > testInterBrokerListenerAsPrivilegedListener() STARTED

SocketServerTest > testInterBrokerListenerAsPrivilegedListener() PASSED

SocketServerTest > testSslSocketServer() STARTED

SocketServerTest > testSslSocketServer() PASSED

SocketServerTest > testDisabledRequestIsRejected() STARTED

SocketServerTest > testDisabledRequestIsRejected() PASSED

SocketServerTest > tooBigRequestIsRejected() STARTED

SocketServerTest > tooBigRequestIsRejected() PASSED

SocketServerTest > testNoOpActionResponseWithThrottledChannelWhereThrottlingInProgress()
STARTED

SocketServerTest > testNoOpActionResponseWithThrottledChannelWhereThrottlingInProgress()
PASSED

DynamicConnectionQuotaTest > testDynamicConnectionQuota() STARTED

DynamicConnectionQuotaTest > testDynamicConnectionQuota() PASSED

DynamicConnectionQuotaTest > testDynamicListenerConnectionQuota() STARTED

DynamicConnectionQuotaTest > testDynamicListenerConnectionQuota() PASSED

DynamicConnectionQuotaTest > testDynamicListenerConnectionCreationRateQuota() STARTED

DynamicConnectionQuotaTest > testDynamicListenerConnectionCreationRateQuota() PASSED

DynamicConnectionQuotaTest > testDynamicIpConnectionRateQuota() STARTED

DynamicConnectionQuotaTest > testDynamicIpConnectionRateQuota() PASSED

ControllerContextTest > testPartitionFullReplicaAssignmentReturnsEmptyAssignmentIfTopicOrPartitionDoesNotExist()
STARTED

ControllerContextTest > testPartitionFullReplicaAssignmentReturnsEmptyAssignmentIfTopicOrPartitionDoesNotExist()
PASSED

ControllerContextTest > testPartitionReplicaAssignmentForTopicReturnsEmptyMapIfTopicDoesNotExist()
STARTED

ControllerContextTest > testPartitionReplicaAssignmentForTopicReturnsEmptyMapIfTopicDoesNotExist()
PASSED

ControllerContextTest > testPreferredReplicaImbalanceMetric() STARTED

ControllerContextTest > testPreferredReplicaImbalanceMetric() PASSED

ControllerContextTest > testPartitionReplicaAssignmentForTopicReturnsExpectedReplicaAssignments()
STARTED

ControllerContextTest > testPartitionReplicaAssignmentForTopicReturnsExpectedReplicaAssignments()
PASSED

ControllerContextTest > testReassignTo() STARTED

ControllerContextTest > testReassignTo() PASSED

ControllerContextTest > testPartitionReplicaAssignment() STARTED

ControllerContextTest > testPartitionReplicaAssignment() PASSED

ControllerContextTest > testUpdatePartitionFullReplicaAssignmentUpdatesReplicaAssignment()
STARTED

ControllerContextTest > testUpdatePartitionFullReplicaAssignmentUpdatesReplicaAssignment()
PASSED

ControllerContextTest > testReassignToIdempotence() STARTED

ControllerContextTest > testReassignToIdempotence() PASSED

ControllerContextTest > testPartitionReplicaAssignmentReturnsEmptySeqIfTopicOrPartitionDoesNotExist()
STARTED

ControllerContextTest > testPartitionReplicaAssignmentReturnsEmptySeqIfTopicOrPartitionDoesNotExist()
PASSED

TransactionsWithMaxInFlightOneTest > testTransactionalProducerSingleBrokerMaxInFlightOne()
STARTED

TransactionsWithMaxInFlightOneTest > testTransactionalProducerSingleBrokerMaxInFlightOne()
PASSED

3386 tests completed, 1 failed, 7 skipped

> Task :core:test FAILED

FAILURE: Build failed with an exception.

* What went wrong:
Execution failed for task ':core:test'.
> There were failing tests. See the report at: file://<https://ci-builds.apache.org/job/Kafka/job/kafka-2.8-jdk8/ws/core/build/reports/tests/test/index.html>

* Try:
Run with --stacktrace option to get the stack trace. Run with --info or --debug option to
get more log output. Run with --scan to get full insights.

* Get more help at https://help.gradle.org

Deprecated Gradle features were used in this build, making it incompatible with Gradle 7.0.
Use '--warning-mode all' to show the individual deprecation warnings.
See https://docs.gradle.org/6.8.1/userguide/command_line_interface.html#sec:command_line_warnings

BUILD FAILED in 1h 17m 24s
257 actionable tasks: 250 executed, 7 up-to-date
Build step 'Execute shell' marked build as failure
Recording test results

Mime
View raw message