kafka-dev mailing list archives

Site index · List index
Message view « Date » · « Thread »
Top « Date » · « Thread »
From Apache Jenkins Server <jenk...@builds.apache.org>
Subject Build failed in Jenkins: Kafka » kafka-2.6-jdk8 #2
Date Wed, 12 Aug 2020 22:30:51 GMT
See <https://ci-builds.apache.org/job/Kafka/job/kafka-2.6-jdk8/2/display/redirect?page=changes>

Changes:

[John Roesler] MINOR: bump 2.5 versions to 2.5.1 (#9165)

[John Roesler] KAFKA-10173: Use SmokeTest for upgrade system tests (#8938)


------------------------------------------
[...truncated 3.15 MB...]
org.apache.kafka.streams.TopologyTestDriverTest > shouldThrowIfPersistentBuiltInStoreIsAccessedWithUntypedMethod[Eos
enabled = false] STARTED

org.apache.kafka.streams.TopologyTestDriverTest > shouldThrowIfPersistentBuiltInStoreIsAccessedWithUntypedMethod[Eos
enabled = false] PASSED

org.apache.kafka.streams.TopologyTestDriverTest > shouldAllowPrePopulatingStatesStoresWithCachingEnabled[Eos
enabled = false] STARTED

org.apache.kafka.streams.TopologyTestDriverTest > shouldAllowPrePopulatingStatesStoresWithCachingEnabled[Eos
enabled = false] PASSED

org.apache.kafka.streams.TopologyTestDriverTest > shouldReturnCorrectPersistentStoreTypeOnly[Eos
enabled = false] STARTED

org.apache.kafka.streams.TopologyTestDriverTest > shouldReturnCorrectPersistentStoreTypeOnly[Eos
enabled = false] PASSED

org.apache.kafka.streams.TopologyTestDriverTest > shouldRespectTaskIdling[Eos enabled =
false] STARTED

org.apache.kafka.streams.TopologyTestDriverTest > shouldRespectTaskIdling[Eos enabled =
false] PASSED

org.apache.kafka.streams.TopologyTestDriverTest > shouldUseSourceSpecificDeserializers[Eos
enabled = false] STARTED

org.apache.kafka.streams.TopologyTestDriverTest > shouldUseSourceSpecificDeserializers[Eos
enabled = false] PASSED

org.apache.kafka.streams.TopologyTestDriverTest > shouldReturnAllStores[Eos enabled = false]
STARTED

org.apache.kafka.streams.TopologyTestDriverTest > shouldReturnAllStores[Eos enabled = false]
PASSED

org.apache.kafka.streams.TopologyTestDriverTest > shouldNotCreateStateDirectoryForStatelessTopology[Eos
enabled = false] STARTED

org.apache.kafka.streams.TopologyTestDriverTest > shouldNotCreateStateDirectoryForStatelessTopology[Eos
enabled = false] PASSED

org.apache.kafka.streams.TopologyTestDriverTest > shouldApplyGlobalUpdatesCorrectlyInRecursiveTopologies[Eos
enabled = false] STARTED

org.apache.kafka.streams.TopologyTestDriverTest > shouldApplyGlobalUpdatesCorrectlyInRecursiveTopologies[Eos
enabled = false] PASSED

org.apache.kafka.streams.TopologyTestDriverTest > shouldReturnAllStoresNames[Eos enabled
= false] STARTED

org.apache.kafka.streams.TopologyTestDriverTest > shouldReturnAllStoresNames[Eos enabled
= false] PASSED

org.apache.kafka.streams.TopologyTestDriverTest > shouldPassRecordHeadersIntoSerializersAndDeserializers[Eos
enabled = false] STARTED

org.apache.kafka.streams.TopologyTestDriverTest > shouldPassRecordHeadersIntoSerializersAndDeserializers[Eos
enabled = false] PASSED

org.apache.kafka.streams.TopologyTestDriverTest > shouldProcessConsumerRecordList[Eos enabled
= false] STARTED

org.apache.kafka.streams.TopologyTestDriverTest > shouldProcessConsumerRecordList[Eos enabled
= false] PASSED

org.apache.kafka.streams.TopologyTestDriverTest > shouldUseSinkSpecificSerializers[Eos
enabled = false] STARTED

org.apache.kafka.streams.TopologyTestDriverTest > shouldUseSinkSpecificSerializers[Eos
enabled = false] PASSED

org.apache.kafka.streams.TopologyTestDriverTest > shouldFlushStoreForFirstInput[Eos enabled
= false] STARTED

org.apache.kafka.streams.TopologyTestDriverTest > shouldFlushStoreForFirstInput[Eos enabled
= false] PASSED

org.apache.kafka.streams.TopologyTestDriverTest > shouldProcessFromSourceThatMatchPattern[Eos
enabled = false] STARTED

org.apache.kafka.streams.TopologyTestDriverTest > shouldProcessFromSourceThatMatchPattern[Eos
enabled = false] PASSED

org.apache.kafka.streams.TopologyTestDriverTest > shouldCaptureSinkTopicNamesIfWrittenInto[Eos
enabled = false] STARTED

org.apache.kafka.streams.TopologyTestDriverTest > shouldCaptureSinkTopicNamesIfWrittenInto[Eos
enabled = false] PASSED

org.apache.kafka.streams.TopologyTestDriverTest > shouldUpdateStoreForNewKey[Eos enabled
= false] STARTED

org.apache.kafka.streams.TopologyTestDriverTest > shouldUpdateStoreForNewKey[Eos enabled
= false] PASSED

org.apache.kafka.streams.TopologyTestDriverTest > shouldSendRecordViaCorrectSourceTopicDeprecated[Eos
enabled = false] STARTED

org.apache.kafka.streams.TopologyTestDriverTest > shouldSendRecordViaCorrectSourceTopicDeprecated[Eos
enabled = false] PASSED

org.apache.kafka.streams.TopologyTestDriverTest > shouldPunctuateOnWallClockTime[Eos enabled
= false] STARTED

org.apache.kafka.streams.TopologyTestDriverTest > shouldPunctuateOnWallClockTime[Eos enabled
= false] PASSED

org.apache.kafka.streams.TopologyTestDriverTest > shouldSetRecordMetadata[Eos enabled =
false] STARTED

org.apache.kafka.streams.TopologyTestDriverTest > shouldSetRecordMetadata[Eos enabled =
false] PASSED

org.apache.kafka.streams.TopologyTestDriverTest > shouldNotUpdateStoreForLargerValue[Eos
enabled = false] STARTED

org.apache.kafka.streams.TopologyTestDriverTest > shouldNotUpdateStoreForLargerValue[Eos
enabled = false] PASSED

org.apache.kafka.streams.TopologyTestDriverTest > shouldReturnCorrectInMemoryStoreTypeOnly[Eos
enabled = false] STARTED

org.apache.kafka.streams.TopologyTestDriverTest > shouldReturnCorrectInMemoryStoreTypeOnly[Eos
enabled = false] PASSED

org.apache.kafka.streams.TopologyTestDriverTest > shouldThrowForMissingTime[Eos enabled
= false] STARTED

org.apache.kafka.streams.TopologyTestDriverTest > shouldThrowForMissingTime[Eos enabled
= false] PASSED

org.apache.kafka.streams.TopologyTestDriverTest > shouldCaptureInternalTopicNamesIfWrittenInto[Eos
enabled = false] STARTED

org.apache.kafka.streams.TopologyTestDriverTest > shouldCaptureInternalTopicNamesIfWrittenInto[Eos
enabled = false] PASSED

org.apache.kafka.streams.TopologyTestDriverTest > shouldPunctuateOnWallClockTimeDeprecated[Eos
enabled = false] STARTED

org.apache.kafka.streams.TopologyTestDriverTest > shouldPunctuateOnWallClockTimeDeprecated[Eos
enabled = false] PASSED

org.apache.kafka.streams.TopologyTestDriverTest > shouldProcessRecordForTopic[Eos enabled
= false] STARTED

org.apache.kafka.streams.TopologyTestDriverTest > shouldProcessRecordForTopic[Eos enabled
= false] PASSED

org.apache.kafka.streams.TopologyTestDriverTest > shouldForwardRecordsFromSubtopologyToSubtopology[Eos
enabled = false] STARTED

org.apache.kafka.streams.TopologyTestDriverTest > shouldForwardRecordsFromSubtopologyToSubtopology[Eos
enabled = false] PASSED

org.apache.kafka.streams.TopologyTestDriverTest > shouldNotUpdateStoreForSmallerValue[Eos
enabled = false] STARTED

org.apache.kafka.streams.TopologyTestDriverTest > shouldNotUpdateStoreForSmallerValue[Eos
enabled = false] PASSED

org.apache.kafka.streams.TopologyTestDriverTest > shouldCreateStateDirectoryForStatefulTopology[Eos
enabled = false] STARTED

org.apache.kafka.streams.TopologyTestDriverTest > shouldCreateStateDirectoryForStatefulTopology[Eos
enabled = false] PASSED

org.apache.kafka.streams.TopologyTestDriverTest > shouldPunctuateIfWallClockTimeAdvances[Eos
enabled = false] STARTED

org.apache.kafka.streams.TopologyTestDriverTest > shouldPunctuateIfWallClockTimeAdvances[Eos
enabled = false] PASSED

> Task :streams:upgrade-system-tests-20:spotbugsMain NO-SOURCE
> Task :streams:upgrade-system-tests-20:test
> Task :streams:upgrade-system-tests-21:compileJava NO-SOURCE
> Task :streams:upgrade-system-tests-21:processResources NO-SOURCE
> Task :streams:upgrade-system-tests-21:classes UP-TO-DATE
> Task :streams:upgrade-system-tests-21:checkstyleMain NO-SOURCE
> Task :streams:upgrade-system-tests-21:compileTestJava
> Task :streams:upgrade-system-tests-21:processTestResources NO-SOURCE
> Task :streams:upgrade-system-tests-21:testClasses
> Task :streams:upgrade-system-tests-21:checkstyleTest
> Task :streams:upgrade-system-tests-21:spotbugsMain NO-SOURCE
> Task :streams:upgrade-system-tests-21:test
> Task :streams:upgrade-system-tests-22:compileJava NO-SOURCE
> Task :streams:upgrade-system-tests-22:processResources NO-SOURCE
> Task :streams:upgrade-system-tests-22:classes UP-TO-DATE
> Task :streams:upgrade-system-tests-22:checkstyleMain NO-SOURCE
> Task :streams:upgrade-system-tests-22:compileTestJava
> Task :streams:upgrade-system-tests-22:processTestResources NO-SOURCE
> Task :streams:upgrade-system-tests-22:testClasses

> Task :streams:upgrade-system-tests-22:checkstyleTest FAILED
[ant:checkstyle] [ERROR] <https://ci-builds.apache.org/job/Kafka/job/kafka-2.6-jdk8/ws/streams/upgrade-system-tests-22/src/test/java/org/apache/kafka/streams/tests/StreamsSmokeTest.java>:43:
Line matches the illegal pattern ''System.exit': Should not directly call System.exit, but
Exit.exit instead.'. [dontUseSystemExit]
[ant:checkstyle] [ERROR] <https://ci-builds.apache.org/job/Kafka/job/kafka-2.6-jdk8/ws/streams/upgrade-system-tests-22/src/test/java/org/apache/kafka/streams/tests/StreamsSmokeTest.java>:56:
Line matches the illegal pattern ''System.exit': Should not directly call System.exit, but
Exit.exit instead.'. [dontUseSystemExit]
[ant:checkstyle] [ERROR] <https://ci-builds.apache.org/job/Kafka/job/kafka-2.6-jdk8/ws/streams/upgrade-system-tests-22/src/test/java/org/apache/kafka/streams/tests/StreamsSmokeTest.java>:66:
Line matches the illegal pattern ''System.exit': Should not directly call System.exit, but
Exit.exit instead.'. [dontUseSystemExit]

> Task :streams:upgrade-system-tests-22:spotbugsMain NO-SOURCE
> Task :streams:upgrade-system-tests-23:compileJava NO-SOURCE
> Task :streams:upgrade-system-tests-23:processResources NO-SOURCE
> Task :streams:upgrade-system-tests-23:classes UP-TO-DATE
> Task :streams:upgrade-system-tests-23:checkstyleMain NO-SOURCE
> Task :streams:upgrade-system-tests-23:compileTestJava
> Task :streams:upgrade-system-tests-23:processTestResources NO-SOURCE
> Task :streams:upgrade-system-tests-23:testClasses

> Task :streams:upgrade-system-tests-23:checkstyleTest FAILED
[ant:checkstyle] [ERROR] <https://ci-builds.apache.org/job/Kafka/job/kafka-2.6-jdk8/ws/streams/upgrade-system-tests-23/src/test/java/org/apache/kafka/streams/tests/StreamsSmokeTest.java>:43:
Line matches the illegal pattern ''System.exit': Should not directly call System.exit, but
Exit.exit instead.'. [dontUseSystemExit]
[ant:checkstyle] [ERROR] <https://ci-builds.apache.org/job/Kafka/job/kafka-2.6-jdk8/ws/streams/upgrade-system-tests-23/src/test/java/org/apache/kafka/streams/tests/StreamsSmokeTest.java>:56:
Line matches the illegal pattern ''System.exit': Should not directly call System.exit, but
Exit.exit instead.'. [dontUseSystemExit]
[ant:checkstyle] [ERROR] <https://ci-builds.apache.org/job/Kafka/job/kafka-2.6-jdk8/ws/streams/upgrade-system-tests-23/src/test/java/org/apache/kafka/streams/tests/StreamsSmokeTest.java>:66:
Line matches the illegal pattern ''System.exit': Should not directly call System.exit, but
Exit.exit instead.'. [dontUseSystemExit]

> Task :streams:upgrade-system-tests-23:spotbugsMain NO-SOURCE
> Task :streams:upgrade-system-tests-24:compileJava NO-SOURCE
> Task :streams:upgrade-system-tests-24:processResources NO-SOURCE
> Task :streams:upgrade-system-tests-24:classes UP-TO-DATE
> Task :streams:upgrade-system-tests-24:checkstyleMain NO-SOURCE
> Task :streams:upgrade-system-tests-24:compileTestJava
> Task :streams:upgrade-system-tests-24:processTestResources NO-SOURCE
> Task :streams:upgrade-system-tests-24:testClasses

> Task :streams:upgrade-system-tests-24:checkstyleTest FAILED
[ant:checkstyle] [ERROR] <https://ci-builds.apache.org/job/Kafka/job/kafka-2.6-jdk8/ws/streams/upgrade-system-tests-24/src/test/java/org/apache/kafka/streams/tests/StreamsSmokeTest.java>:43:
Line matches the illegal pattern ''System.exit': Should not directly call System.exit, but
Exit.exit instead.'. [dontUseSystemExit]
[ant:checkstyle] [ERROR] <https://ci-builds.apache.org/job/Kafka/job/kafka-2.6-jdk8/ws/streams/upgrade-system-tests-24/src/test/java/org/apache/kafka/streams/tests/StreamsSmokeTest.java>:56:
Line matches the illegal pattern ''System.exit': Should not directly call System.exit, but
Exit.exit instead.'. [dontUseSystemExit]
[ant:checkstyle] [ERROR] <https://ci-builds.apache.org/job/Kafka/job/kafka-2.6-jdk8/ws/streams/upgrade-system-tests-24/src/test/java/org/apache/kafka/streams/tests/StreamsSmokeTest.java>:66:
Line matches the illegal pattern ''System.exit': Should not directly call System.exit, but
Exit.exit instead.'. [dontUseSystemExit]

> Task :streams:upgrade-system-tests-24:spotbugsMain NO-SOURCE
> Task :streams:upgrade-system-tests-25:compileJava NO-SOURCE
> Task :streams:upgrade-system-tests-25:processResources NO-SOURCE
> Task :streams:upgrade-system-tests-25:classes UP-TO-DATE
> Task :streams:upgrade-system-tests-25:checkstyleMain NO-SOURCE
> Task :streams:upgrade-system-tests-25:compileTestJava
> Task :streams:upgrade-system-tests-25:processTestResources NO-SOURCE
> Task :streams:upgrade-system-tests-25:testClasses

> Task :streams:upgrade-system-tests-25:checkstyleTest FAILED
[ant:checkstyle] [ERROR] <https://ci-builds.apache.org/job/Kafka/job/kafka-2.6-jdk8/ws/streams/upgrade-system-tests-25/src/test/java/org/apache/kafka/streams/tests/StreamsSmokeTest.java>:43:
Line matches the illegal pattern ''System.exit': Should not directly call System.exit, but
Exit.exit instead.'. [dontUseSystemExit]
[ant:checkstyle] [ERROR] <https://ci-builds.apache.org/job/Kafka/job/kafka-2.6-jdk8/ws/streams/upgrade-system-tests-25/src/test/java/org/apache/kafka/streams/tests/StreamsSmokeTest.java>:56:
Line matches the illegal pattern ''System.exit': Should not directly call System.exit, but
Exit.exit instead.'. [dontUseSystemExit]
[ant:checkstyle] [ERROR] <https://ci-builds.apache.org/job/Kafka/job/kafka-2.6-jdk8/ws/streams/upgrade-system-tests-25/src/test/java/org/apache/kafka/streams/tests/StreamsSmokeTest.java>:66:
Line matches the illegal pattern ''System.exit': Should not directly call System.exit, but
Exit.exit instead.'. [dontUseSystemExit]

> Task :streams:upgrade-system-tests-25:spotbugsMain NO-SOURCE

FAILURE: Build completed with 4 failures.

1: Task failed with an exception.
-----------
* What went wrong:
Execution failed for task ':streams:upgrade-system-tests-22:checkstyleTest'.
> Checkstyle rule violations were found. See the report at: file://<https://ci-builds.apache.org/job/Kafka/job/kafka-2.6-jdk8/ws/streams/upgrade-system-tests-22/build/reports/checkstyle/test.html>
  Checkstyle files with violations: 1
  Checkstyle violations by severity: [error:3]


* Try:
Run with --stacktrace option to get the stack trace. Run with --info or --debug option to
get more log output. Run with --scan to get full insights.
==============================================================================

2: Task failed with an exception.
-----------
* What went wrong:
Execution failed for task ':streams:upgrade-system-tests-23:checkstyleTest'.
> Checkstyle rule violations were found. See the report at: file://<https://ci-builds.apache.org/job/Kafka/job/kafka-2.6-jdk8/ws/streams/upgrade-system-tests-23/build/reports/checkstyle/test.html>
  Checkstyle files with violations: 1
  Checkstyle violations by severity: [error:3]


* Try:
Run with --stacktrace option to get the stack trace. Run with --info or --debug option to
get more log output. Run with --scan to get full insights.
==============================================================================

3: Task failed with an exception.
-----------
* What went wrong:
Execution failed for task ':streams:upgrade-system-tests-24:checkstyleTest'.
> Checkstyle rule violations were found. See the report at: file://<https://ci-builds.apache.org/job/Kafka/job/kafka-2.6-jdk8/ws/streams/upgrade-system-tests-24/build/reports/checkstyle/test.html>
  Checkstyle files with violations: 1
  Checkstyle violations by severity: [error:3]


* Try:
Run with --stacktrace option to get the stack trace. Run with --info or --debug option to
get more log output. Run with --scan to get full insights.
==============================================================================

4: Task failed with an exception.
-----------
* What went wrong:
Execution failed for task ':streams:upgrade-system-tests-25:checkstyleTest'.
> Checkstyle rule violations were found. See the report at: file://<https://ci-builds.apache.org/job/Kafka/job/kafka-2.6-jdk8/ws/streams/upgrade-system-tests-25/build/reports/checkstyle/test.html>
  Checkstyle files with violations: 1
  Checkstyle violations by severity: [error:3]


* Try:
Run with --stacktrace option to get the stack trace. Run with --info or --debug option to
get more log output. Run with --scan to get full insights.
==============================================================================

* Get more help at https://help.gradle.org

Deprecated Gradle features were used in this build, making it incompatible with Gradle 7.0.
Use '--warning-mode all' to show the individual deprecation warnings.
See https://docs.gradle.org/6.5/userguide/command_line_interface.html#sec:command_line_warnings

BUILD FAILED in 1h 58m 16s
211 actionable tasks: 179 executed, 32 up-to-date
Build step 'Execute shell' marked build as failure
Recording test results

Mime
View raw message