kafka-dev mailing list archives

Site index · List index
Message view « Date » · « Thread »
Top « Date » · « Thread »
From Apache Jenkins Server <jenk...@builds.apache.org>
Subject Build failed in Jenkins: kafka-2.4-jdk8 #227
Date Thu, 18 Jun 2020 16:47:39 GMT
See <https://builds.apache.org/job/kafka-2.4-jdk8/227/display/redirect?page=changes>

Changes:

[konstantine] MINOR: Upgrade ducktape to 0.7.8 (#8879)


------------------------------------------
[...truncated 7.79 MB...]
        at org.apache.kafka.test.TestUtils.tempDirectory(TestUtils.java:235)
        at org.apache.kafka.test.TestUtils.tempDirectory(TestUtils.java:245)
        at org.apache.kafka.streams.integration.KTableKTableForeignKeyJoinIntegrationTest.<init>(KTableKTableForeignKeyJoinIntegrationTest.java:78)

org.apache.kafka.streams.integration.KTableKTableForeignKeyJoinIntegrationTest > doJoinFromLeftThenDeleteLeftEntity[leftJoin=false,
optimization=none, materialized=false, rejoin=false] STARTED
org.apache.kafka.streams.integration.KTableKTableForeignKeyJoinIntegrationTest.doJoinFromLeftThenDeleteLeftEntity[leftJoin=false,
optimization=none, materialized=false, rejoin=false] failed, log available in <https://builds.apache.org/job/kafka-2.4-jdk8/ws/streams/build/reports/testOutput/org.apache.kafka.streams.integration.KTableKTableForeignKeyJoinIntegrationTest.doJoinFromLeftThenDeleteLeftEntity[leftJoin=false,>
optimization=none, materialized=false, rejoin=false].test.stdout

org.apache.kafka.streams.integration.KTableKTableForeignKeyJoinIntegrationTest > doJoinFromLeftThenDeleteLeftEntity[leftJoin=false,
optimization=none, materialized=false, rejoin=false] FAILED
    java.lang.IllegalStateException: Shutdown in progress
        at java.lang.ApplicationShutdownHooks.add(ApplicationShutdownHooks.java:66)
        at java.lang.Runtime.addShutdownHook(Runtime.java:211)
        at org.apache.kafka.test.TestUtils.tempDirectory(TestUtils.java:265)
        at org.apache.kafka.test.TestUtils.tempDirectory(TestUtils.java:235)
        at org.apache.kafka.test.TestUtils.tempDirectory(TestUtils.java:245)
        at org.apache.kafka.streams.integration.KTableKTableForeignKeyJoinIntegrationTest.<init>(KTableKTableForeignKeyJoinIntegrationTest.java:78)

org.apache.kafka.streams.integration.KTableKTableForeignKeyJoinIntegrationTest > doJoinFromRightThenDeleteRightEntity[leftJoin=false,
optimization=none, materialized=false, rejoin=false] STARTED
org.apache.kafka.streams.integration.KTableKTableForeignKeyJoinIntegrationTest.doJoinFromRightThenDeleteRightEntity[leftJoin=false,
optimization=none, materialized=false, rejoin=false] failed, log available in <https://builds.apache.org/job/kafka-2.4-jdk8/ws/streams/build/reports/testOutput/org.apache.kafka.streams.integration.KTableKTableForeignKeyJoinIntegrationTest.doJoinFromRightThenDeleteRightEntity[leftJoin=false,>
optimization=none, materialized=false, rejoin=false].test.stdout

org.apache.kafka.streams.integration.KTableKTableForeignKeyJoinIntegrationTest > doJoinFromRightThenDeleteRightEntity[leftJoin=false,
optimization=none, materialized=false, rejoin=false] FAILED
    java.lang.IllegalStateException: Shutdown in progress
        at java.lang.ApplicationShutdownHooks.add(ApplicationShutdownHooks.java:66)
        at java.lang.Runtime.addShutdownHook(Runtime.java:211)
        at org.apache.kafka.test.TestUtils.tempDirectory(TestUtils.java:265)
        at org.apache.kafka.test.TestUtils.tempDirectory(TestUtils.java:235)
        at org.apache.kafka.test.TestUtils.tempDirectory(TestUtils.java:245)
        at org.apache.kafka.streams.integration.KTableKTableForeignKeyJoinIntegrationTest.<init>(KTableKTableForeignKeyJoinIntegrationTest.java:78)

org.apache.kafka.streams.integration.RocksDBMetricsIntegrationTest > classMethod STARTED
org.apache.kafka.streams.integration.RocksDBMetricsIntegrationTest.classMethod failed, log
available in <https://builds.apache.org/job/kafka-2.4-jdk8/ws/streams/build/reports/testOutput/org.apache.kafka.streams.integration.RocksDBMetricsIntegrationTest.classMethod.test.stdout>

org.apache.kafka.streams.integration.RocksDBMetricsIntegrationTest > classMethod FAILED
    java.lang.IllegalStateException: Shutdown in progress

org.apache.kafka.streams.integration.FineGrainedAutoResetIntegrationTest > classMethod
STARTED
org.apache.kafka.streams.integration.FineGrainedAutoResetIntegrationTest.classMethod failed,
log available in <https://builds.apache.org/job/kafka-2.4-jdk8/ws/streams/build/reports/testOutput/org.apache.kafka.streams.integration.FineGrainedAutoResetIntegrationTest.classMethod.test.stdout>

org.apache.kafka.streams.integration.FineGrainedAutoResetIntegrationTest > classMethod
FAILED
    java.lang.IllegalStateException: Shutdown in progress

org.apache.kafka.streams.integration.KStreamTransformIntegrationTest > shouldFlatTransform
STARTED
org.apache.kafka.streams.integration.KStreamTransformIntegrationTest.shouldFlatTransform failed,
log available in <https://builds.apache.org/job/kafka-2.4-jdk8/ws/streams/build/reports/testOutput/org.apache.kafka.streams.integration.KStreamTransformIntegrationTest.shouldFlatTransform.test.stdout>

org.apache.kafka.streams.integration.KStreamTransformIntegrationTest > shouldFlatTransform
FAILED
    java.lang.IllegalStateException: Shutdown in progress
        at java.lang.ApplicationShutdownHooks.add(ApplicationShutdownHooks.java:66)
        at java.lang.Runtime.addShutdownHook(Runtime.java:211)
        at org.apache.kafka.test.TestUtils.tempDirectory(TestUtils.java:265)
        at org.apache.kafka.test.TestUtils.tempDirectory(TestUtils.java:235)
        at org.apache.kafka.test.TestUtils.tempDirectory(TestUtils.java:245)
        at org.apache.kafka.test.StreamsTestUtils.getStreamsConfig(StreamsTestUtils.java:57)
        at org.apache.kafka.test.StreamsTestUtils.getStreamsConfig(StreamsTestUtils.java:65)
        at org.apache.kafka.streams.integration.KStreamTransformIntegrationTest.verifyResult(KStreamTransformIntegrationTest.java:73)
        at org.apache.kafka.streams.integration.KStreamTransformIntegrationTest.shouldFlatTransform(KStreamTransformIntegrationTest.java:173)

org.apache.kafka.streams.integration.KStreamTransformIntegrationTest > shouldFlatTransformValuesWithValueTransformerWithoutKey
STARTED
org.apache.kafka.streams.integration.KStreamTransformIntegrationTest.shouldFlatTransformValuesWithValueTransformerWithoutKey
failed, log available in <https://builds.apache.org/job/kafka-2.4-jdk8/ws/streams/build/reports/testOutput/org.apache.kafka.streams.integration.KStreamTransformIntegrationTest.shouldFlatTransformValuesWithValueTransformerWithoutKey.test.stdout>

org.apache.kafka.streams.integration.KStreamTransformIntegrationTest > shouldFlatTransformValuesWithValueTransformerWithoutKey
FAILED
    java.lang.IllegalStateException: Shutdown in progress
        at java.lang.ApplicationShutdownHooks.add(ApplicationShutdownHooks.java:66)
        at java.lang.Runtime.addShutdownHook(Runtime.java:211)
        at org.apache.kafka.test.TestUtils.tempDirectory(TestUtils.java:265)
        at org.apache.kafka.test.TestUtils.tempDirectory(TestUtils.java:235)
        at org.apache.kafka.test.TestUtils.tempDirectory(TestUtils.java:245)
        at org.apache.kafka.test.StreamsTestUtils.getStreamsConfig(StreamsTestUtils.java:57)
        at org.apache.kafka.test.StreamsTestUtils.getStreamsConfig(StreamsTestUtils.java:65)
        at org.apache.kafka.streams.integration.KStreamTransformIntegrationTest.verifyResult(KStreamTransformIntegrationTest.java:73)
        at org.apache.kafka.streams.integration.KStreamTransformIntegrationTest.shouldFlatTransformValuesWithValueTransformerWithoutKey(KStreamTransformIntegrationTest.java:346)

org.apache.kafka.streams.integration.KStreamTransformIntegrationTest > shouldFlatTransformValuesWithKey
STARTED
org.apache.kafka.streams.integration.KStreamTransformIntegrationTest.shouldFlatTransformValuesWithKey
failed, log available in <https://builds.apache.org/job/kafka-2.4-jdk8/ws/streams/build/reports/testOutput/org.apache.kafka.streams.integration.KStreamTransformIntegrationTest.shouldFlatTransformValuesWithKey.test.stdout>

org.apache.kafka.streams.integration.KStreamTransformIntegrationTest > shouldFlatTransformValuesWithKey
FAILED
    java.lang.IllegalStateException: Shutdown in progress
        at java.lang.ApplicationShutdownHooks.add(ApplicationShutdownHooks.java:66)
        at java.lang.Runtime.addShutdownHook(Runtime.java:211)
        at org.apache.kafka.test.TestUtils.tempDirectory(TestUtils.java:265)
        at org.apache.kafka.test.TestUtils.tempDirectory(TestUtils.java:235)
        at org.apache.kafka.test.TestUtils.tempDirectory(TestUtils.java:245)
        at org.apache.kafka.test.StreamsTestUtils.getStreamsConfig(StreamsTestUtils.java:57)
        at org.apache.kafka.test.StreamsTestUtils.getStreamsConfig(StreamsTestUtils.java:65)
        at org.apache.kafka.streams.integration.KStreamTransformIntegrationTest.verifyResult(KStreamTransformIntegrationTest.java:73)
        at org.apache.kafka.streams.integration.KStreamTransformIntegrationTest.shouldFlatTransformValuesWithKey(KStreamTransformIntegrationTest.java:295)

org.apache.kafka.streams.integration.KStreamTransformIntegrationTest > shouldTransform
STARTED
org.apache.kafka.streams.integration.KStreamTransformIntegrationTest.shouldTransform failed,
log available in <https://builds.apache.org/job/kafka-2.4-jdk8/ws/streams/build/reports/testOutput/org.apache.kafka.streams.integration.KStreamTransformIntegrationTest.shouldTransform.test.stdout>

org.apache.kafka.streams.integration.KStreamTransformIntegrationTest > shouldTransform
FAILED
    java.lang.IllegalStateException: Shutdown in progress
        at java.lang.ApplicationShutdownHooks.add(ApplicationShutdownHooks.java:66)
        at java.lang.Runtime.addShutdownHook(Runtime.java:211)
        at org.apache.kafka.test.TestUtils.tempDirectory(TestUtils.java:265)
        at org.apache.kafka.test.TestUtils.tempDirectory(TestUtils.java:235)
        at org.apache.kafka.test.TestUtils.tempDirectory(TestUtils.java:245)
        at org.apache.kafka.test.StreamsTestUtils.getStreamsConfig(StreamsTestUtils.java:57)
        at org.apache.kafka.test.StreamsTestUtils.getStreamsConfig(StreamsTestUtils.java:65)
        at org.apache.kafka.streams.integration.KStreamTransformIntegrationTest.verifyResult(KStreamTransformIntegrationTest.java:73)
        at org.apache.kafka.streams.integration.KStreamTransformIntegrationTest.shouldTransform(KStreamTransformIntegrationTest.java:121)

org.apache.kafka.streams.integration.KStreamTransformIntegrationTest > shouldTransformValuesWithValueTransformerWithKey
STARTED
org.apache.kafka.streams.integration.KStreamTransformIntegrationTest.shouldTransformValuesWithValueTransformerWithKey
failed, log available in <https://builds.apache.org/job/kafka-2.4-jdk8/ws/streams/build/reports/testOutput/org.apache.kafka.streams.integration.KStreamTransformIntegrationTest.shouldTransformValuesWithValueTransformerWithKey.test.stdout>

org.apache.kafka.streams.integration.KStreamTransformIntegrationTest > shouldTransformValuesWithValueTransformerWithKey
FAILED
    java.lang.IllegalStateException: Shutdown in progress
        at java.lang.ApplicationShutdownHooks.add(ApplicationShutdownHooks.java:66)
        at java.lang.Runtime.addShutdownHook(Runtime.java:211)
        at org.apache.kafka.test.TestUtils.tempDirectory(TestUtils.java:265)
        at org.apache.kafka.test.TestUtils.tempDirectory(TestUtils.java:235)
        at org.apache.kafka.test.TestUtils.tempDirectory(TestUtils.java:245)
        at org.apache.kafka.test.StreamsTestUtils.getStreamsConfig(StreamsTestUtils.java:57)
        at org.apache.kafka.test.StreamsTestUtils.getStreamsConfig(StreamsTestUtils.java:65)
        at org.apache.kafka.streams.integration.KStreamTransformIntegrationTest.verifyResult(KStreamTransformIntegrationTest.java:73)
        at org.apache.kafka.streams.integration.KStreamTransformIntegrationTest.shouldTransformValuesWithValueTransformerWithKey(KStreamTransformIntegrationTest.java:209)

org.apache.kafka.streams.integration.KStreamTransformIntegrationTest > shouldTransformValuesWithValueTransformerWithoutKey
STARTED
org.apache.kafka.streams.integration.KStreamTransformIntegrationTest.shouldTransformValuesWithValueTransformerWithoutKey
failed, log available in <https://builds.apache.org/job/kafka-2.4-jdk8/ws/streams/build/reports/testOutput/org.apache.kafka.streams.integration.KStreamTransformIntegrationTest.shouldTransformValuesWithValueTransformerWithoutKey.test.stdout>

org.apache.kafka.streams.integration.KStreamTransformIntegrationTest > shouldTransformValuesWithValueTransformerWithoutKey
FAILED
    java.lang.IllegalStateException: Shutdown in progress
        at java.lang.ApplicationShutdownHooks.add(ApplicationShutdownHooks.java:66)
        at java.lang.Runtime.addShutdownHook(Runtime.java:211)
        at org.apache.kafka.test.TestUtils.tempDirectory(TestUtils.java:265)
        at org.apache.kafka.test.TestUtils.tempDirectory(TestUtils.java:235)
        at org.apache.kafka.test.TestUtils.tempDirectory(TestUtils.java:245)
        at org.apache.kafka.test.StreamsTestUtils.getStreamsConfig(StreamsTestUtils.java:57)
        at org.apache.kafka.test.StreamsTestUtils.getStreamsConfig(StreamsTestUtils.java:65)
        at org.apache.kafka.streams.integration.KStreamTransformIntegrationTest.verifyResult(KStreamTransformIntegrationTest.java:73)
        at org.apache.kafka.streams.integration.KStreamTransformIntegrationTest.shouldTransformValuesWithValueTransformerWithoutKey(KStreamTransformIntegrationTest.java:244)

org.apache.kafka.streams.integration.GlobalThreadShutDownOrderTest > classMethod STARTED
org.apache.kafka.streams.integration.GlobalThreadShutDownOrderTest.classMethod failed, log
available in <https://builds.apache.org/job/kafka-2.4-jdk8/ws/streams/build/reports/testOutput/org.apache.kafka.streams.integration.GlobalThreadShutDownOrderTest.classMethod.test.stdout>

org.apache.kafka.streams.integration.GlobalThreadShutDownOrderTest > classMethod FAILED
    java.lang.IllegalStateException: Shutdown in progress

org.apache.kafka.streams.integration.KStreamAggregationDedupIntegrationTest > classMethod
STARTED
org.apache.kafka.streams.integration.KStreamAggregationDedupIntegrationTest.classMethod failed,
log available in <https://builds.apache.org/job/kafka-2.4-jdk8/ws/streams/build/reports/testOutput/org.apache.kafka.streams.integration.KStreamAggregationDedupIntegrationTest.classMethod.test.stdout>

org.apache.kafka.streams.integration.KStreamAggregationDedupIntegrationTest > classMethod
FAILED
    java.lang.IllegalStateException: Shutdown in progress

org.apache.kafka.streams.integration.QueryableStateIntegrationTest > classMethod STARTED
org.apache.kafka.streams.integration.QueryableStateIntegrationTest.classMethod failed, log
available in <https://builds.apache.org/job/kafka-2.4-jdk8/ws/streams/build/reports/testOutput/org.apache.kafka.streams.integration.QueryableStateIntegrationTest.classMethod.test.stdout>

org.apache.kafka.streams.integration.QueryableStateIntegrationTest > classMethod FAILED
    java.lang.IllegalStateException: Shutdown in progress

org.apache.kafka.streams.integration.StateRestorationIntegrationTest > classMethod STARTED
org.apache.kafka.streams.integration.StateRestorationIntegrationTest.classMethod failed, log
available in <https://builds.apache.org/job/kafka-2.4-jdk8/ws/streams/build/reports/testOutput/org.apache.kafka.streams.integration.StateRestorationIntegrationTest.classMethod.test.stdout>

org.apache.kafka.streams.integration.StateRestorationIntegrationTest > classMethod FAILED
    java.lang.IllegalStateException: Shutdown in progress

org.apache.kafka.streams.integration.GlobalKTableEOSIntegrationTest > classMethod STARTED
org.apache.kafka.streams.integration.GlobalKTableEOSIntegrationTest.classMethod failed, log
available in <https://builds.apache.org/job/kafka-2.4-jdk8/ws/streams/build/reports/testOutput/org.apache.kafka.streams.integration.GlobalKTableEOSIntegrationTest.classMethod.test.stdout>

org.apache.kafka.streams.integration.GlobalKTableEOSIntegrationTest > classMethod FAILED
    java.lang.IllegalStateException: Shutdown in progress

org.apache.kafka.streams.integration.InternalTopicIntegrationTest > classMethod STARTED
org.apache.kafka.streams.integration.InternalTopicIntegrationTest.classMethod failed, log
available in <https://builds.apache.org/job/kafka-2.4-jdk8/ws/streams/build/reports/testOutput/org.apache.kafka.streams.integration.InternalTopicIntegrationTest.classMethod.test.stdout>

org.apache.kafka.streams.integration.InternalTopicIntegrationTest > classMethod FAILED
    java.lang.IllegalStateException: Shutdown in progress

org.apache.kafka.streams.integration.KTableSourceTopicRestartIntegrationTest > classMethod
STARTED
org.apache.kafka.streams.integration.KTableSourceTopicRestartIntegrationTest.classMethod failed,
log available in <https://builds.apache.org/job/kafka-2.4-jdk8/ws/streams/build/reports/testOutput/org.apache.kafka.streams.integration.KTableSourceTopicRestartIntegrationTest.classMethod.test.stdout>

org.apache.kafka.streams.integration.KTableSourceTopicRestartIntegrationTest > classMethod
FAILED
    java.lang.IllegalStateException: Shutdown in progress

org.apache.kafka.streams.integration.SuppressionDurabilityIntegrationTest > classMethod
STARTED
org.apache.kafka.streams.integration.SuppressionDurabilityIntegrationTest.classMethod failed,
log available in <https://builds.apache.org/job/kafka-2.4-jdk8/ws/streams/build/reports/testOutput/org.apache.kafka.streams.integration.SuppressionDurabilityIntegrationTest.classMethod.test.stdout>

org.apache.kafka.streams.integration.SuppressionDurabilityIntegrationTest > classMethod
FAILED
    java.lang.IllegalStateException: Shutdown in progress

org.apache.kafka.streams.integration.KTableKTableForeignKeyJoinMaterializationIntegrationTest
> shouldEmitTombstoneWhenDeletingNonJoiningRecords[materialized=false, queriable=false]
STARTED
org.apache.kafka.streams.integration.KTableKTableForeignKeyJoinMaterializationIntegrationTest.shouldEmitTombstoneWhenDeletingNonJoiningRecords[materialized=false,
queriable=false] failed, log available in <https://builds.apache.org/job/kafka-2.4-jdk8/ws/streams/build/reports/testOutput/org.apache.kafka.streams.integration.KTableKTableForeignKeyJoinMaterializationIntegrationTest.shouldEmitTombstoneWhenDeletingNonJoiningRecords[materialized=false,>
queriable=false].test.stdout

org.apache.kafka.streams.integration.KTableKTableForeignKeyJoinMaterializationIntegrationTest
> shouldEmitTombstoneWhenDeletingNonJoiningRecords[materialized=false, queriable=false]
FAILED
    java.lang.IllegalStateException: Shutdown in progress
        at java.lang.ApplicationShutdownHooks.add(ApplicationShutdownHooks.java:66)
        at java.lang.Runtime.addShutdownHook(Runtime.java:211)
        at org.apache.kafka.test.TestUtils.tempDirectory(TestUtils.java:265)
        at org.apache.kafka.test.TestUtils.tempDirectory(TestUtils.java:235)
        at org.apache.kafka.test.TestUtils.tempDirectory(TestUtils.java:245)
        at org.apache.kafka.streams.integration.KTableKTableForeignKeyJoinMaterializationIntegrationTest.<init>(KTableKTableForeignKeyJoinMaterializationIntegrationTest.java:70)

org.apache.kafka.streams.integration.KTableKTableForeignKeyJoinMaterializationIntegrationTest
> shouldEmitTombstoneWhenDeletingNonJoiningRecords[materialized=true, queriable=false]
STARTED
org.apache.kafka.streams.integration.KTableKTableForeignKeyJoinMaterializationIntegrationTest.shouldEmitTombstoneWhenDeletingNonJoiningRecords[materialized=true,
queriable=false] failed, log available in <https://builds.apache.org/job/kafka-2.4-jdk8/ws/streams/build/reports/testOutput/org.apache.kafka.streams.integration.KTableKTableForeignKeyJoinMaterializationIntegrationTest.shouldEmitTombstoneWhenDeletingNonJoiningRecords[materialized=true,>
queriable=false].test.stdout

org.apache.kafka.streams.integration.KTableKTableForeignKeyJoinMaterializationIntegrationTest
> shouldEmitTombstoneWhenDeletingNonJoiningRecords[materialized=true, queriable=false]
FAILED
    java.lang.IllegalStateException: Shutdown in progress
        at java.lang.ApplicationShutdownHooks.add(ApplicationShutdownHooks.java:66)
        at java.lang.Runtime.addShutdownHook(Runtime.java:211)
        at org.apache.kafka.test.TestUtils.tempDirectory(TestUtils.java:265)
        at org.apache.kafka.test.TestUtils.tempDirectory(TestUtils.java:235)
        at org.apache.kafka.test.TestUtils.tempDirectory(TestUtils.java:245)
        at org.apache.kafka.streams.integration.KTableKTableForeignKeyJoinMaterializationIntegrationTest.<init>(KTableKTableForeignKeyJoinMaterializationIntegrationTest.java:70)

org.apache.kafka.streams.integration.KTableKTableForeignKeyJoinMaterializationIntegrationTest
> shouldEmitTombstoneWhenDeletingNonJoiningRecords[materialized=true, queriable=true] STARTED
org.apache.kafka.streams.integration.KTableKTableForeignKeyJoinMaterializationIntegrationTest.shouldEmitTombstoneWhenDeletingNonJoiningRecords[materialized=true,
queriable=true] failed, log available in <https://builds.apache.org/job/kafka-2.4-jdk8/ws/streams/build/reports/testOutput/org.apache.kafka.streams.integration.KTableKTableForeignKeyJoinMaterializationIntegrationTest.shouldEmitTombstoneWhenDeletingNonJoiningRecords[materialized=true,>
queriable=true].test.stdout

org.apache.kafka.streams.integration.KTableKTableForeignKeyJoinMaterializationIntegrationTest
> shouldEmitTombstoneWhenDeletingNonJoiningRecords[materialized=true, queriable=true] FAILED
    java.lang.IllegalStateException: Shutdown in progress
        at java.lang.ApplicationShutdownHooks.add(ApplicationShutdownHooks.java:66)
        at java.lang.Runtime.addShutdownHook(Runtime.java:211)
        at org.apache.kafka.test.TestUtils.tempDirectory(TestUtils.java:265)
        at org.apache.kafka.test.TestUtils.tempDirectory(TestUtils.java:235)
        at org.apache.kafka.test.TestUtils.tempDirectory(TestUtils.java:245)
        at org.apache.kafka.streams.integration.KTableKTableForeignKeyJoinMaterializationIntegrationTest.<init>(KTableKTableForeignKeyJoinMaterializationIntegrationTest.java:70)

org.apache.kafka.streams.integration.MetricsIntegrationTest > classMethod STARTED
org.apache.kafka.streams.integration.MetricsIntegrationTest.classMethod failed, log available
in <https://builds.apache.org/job/kafka-2.4-jdk8/ws/streams/build/reports/testOutput/org.apache.kafka.streams.integration.MetricsIntegrationTest.classMethod.test.stdout>

org.apache.kafka.streams.integration.MetricsIntegrationTest > classMethod FAILED
    java.lang.IllegalStateException: Shutdown in progress

org.apache.kafka.streams.integration.StandbyTaskCreationIntegrationTest > classMethod STARTED
org.apache.kafka.streams.integration.StandbyTaskCreationIntegrationTest.classMethod failed,
log available in <https://builds.apache.org/job/kafka-2.4-jdk8/ws/streams/build/reports/testOutput/org.apache.kafka.streams.integration.StandbyTaskCreationIntegrationTest.classMethod.test.stdout>

org.apache.kafka.streams.integration.StandbyTaskCreationIntegrationTest > classMethod FAILED
    java.lang.IllegalStateException: Shutdown in progress

org.apache.kafka.streams.integration.PurgeRepartitionTopicIntegrationTest > classMethod
STARTED
org.apache.kafka.streams.integration.PurgeRepartitionTopicIntegrationTest.classMethod failed,
log available in <https://builds.apache.org/job/kafka-2.4-jdk8/ws/streams/build/reports/testOutput/org.apache.kafka.streams.integration.PurgeRepartitionTopicIntegrationTest.classMethod.test.stdout>

org.apache.kafka.streams.integration.PurgeRepartitionTopicIntegrationTest > classMethod
FAILED
    java.lang.IllegalStateException: Shutdown in progress

org.apache.kafka.streams.integration.KTableKTableForeignKeyInnerJoinMultiIntegrationTest >
classMethod STARTED
org.apache.kafka.streams.integration.KTableKTableForeignKeyInnerJoinMultiIntegrationTest.classMethod
failed, log available in <https://builds.apache.org/job/kafka-2.4-jdk8/ws/streams/build/reports/testOutput/org.apache.kafka.streams.integration.KTableKTableForeignKeyInnerJoinMultiIntegrationTest.classMethod.test.stdout>

org.apache.kafka.streams.integration.KTableKTableForeignKeyInnerJoinMultiIntegrationTest >
classMethod FAILED
    java.lang.IllegalStateException: Shutdown in progress

org.apache.kafka.streams.integration.ResetPartitionTimeIntegrationTest > classMethod STARTED
org.apache.kafka.streams.integration.ResetPartitionTimeIntegrationTest.classMethod failed,
log available in <https://builds.apache.org/job/kafka-2.4-jdk8/ws/streams/build/reports/testOutput/org.apache.kafka.streams.integration.ResetPartitionTimeIntegrationTest.classMethod.test.stdout>

org.apache.kafka.streams.integration.ResetPartitionTimeIntegrationTest > classMethod FAILED
    java.lang.IllegalStateException: Shutdown in progress

1311 tests completed, 41 failed

> Task :streams:test FAILED
Setting GRADLE_4_10_3_HOME=/home/jenkins/tools/gradle/4.10.3
Not sending mail to unregistered user konstantine@confluent.io

Mime
View raw message