kafka-dev mailing list archives

Site index · List index
Message view « Date » · « Thread »
Top « Date » · « Thread »
From Apache Jenkins Server <jenk...@builds.apache.org>
Subject Build failed in Jenkins: kafka-2.3-jdk8 #129
Date Thu, 17 Oct 2019 17:38:32 GMT
See <https://builds.apache.org/job/kafka-2.3-jdk8/129/display/redirect?page=changes>

Changes:

[rajinisivaram] KAKFA-8950: Fix KafkaConsumer Fetcher breaking on concurrent disconnect


------------------------------------------
[...truncated 2.93 MB...]

kafka.log.LogValidatorTest > testRecompressedBatchWithoutRecordsNotAllowed PASSED

kafka.log.LogValidatorTest > testCompressedV1 STARTED

kafka.log.LogValidatorTest > testCompressedV1 PASSED

kafka.log.LogValidatorTest > testCompressedV2 STARTED

kafka.log.LogValidatorTest > testCompressedV2 PASSED

kafka.log.LogValidatorTest > testDownConversionOfIdempotentRecordsNotPermitted STARTED

kafka.log.LogValidatorTest > testDownConversionOfIdempotentRecordsNotPermitted PASSED

kafka.log.LogValidatorTest > testOffsetAssignmentAfterUpConversionV0ToV2NonCompressed STARTED

kafka.log.LogValidatorTest > testOffsetAssignmentAfterUpConversionV0ToV2NonCompressed PASSED

kafka.log.LogValidatorTest > testAbsoluteOffsetAssignmentCompressed STARTED

kafka.log.LogValidatorTest > testAbsoluteOffsetAssignmentCompressed PASSED

kafka.log.LogValidatorTest > testLogAppendTimeWithRecompressionV1 STARTED

kafka.log.LogValidatorTest > testLogAppendTimeWithRecompressionV1 PASSED

kafka.log.LogValidatorTest > testLogAppendTimeWithRecompressionV2 STARTED

kafka.log.LogValidatorTest > testLogAppendTimeWithRecompressionV2 PASSED

kafka.log.LogValidatorTest > testCreateTimeUpConversionV0ToV1 STARTED

kafka.log.LogValidatorTest > testCreateTimeUpConversionV0ToV1 PASSED

kafka.log.LogValidatorTest > testCreateTimeUpConversionV0ToV2 STARTED

kafka.log.LogValidatorTest > testCreateTimeUpConversionV0ToV2 PASSED

kafka.log.LogValidatorTest > testCreateTimeUpConversionV1ToV2 STARTED

kafka.log.LogValidatorTest > testCreateTimeUpConversionV1ToV2 PASSED

kafka.log.LogValidatorTest > testOffsetAssignmentAfterDownConversionV2ToV0Compressed STARTED

kafka.log.LogValidatorTest > testOffsetAssignmentAfterDownConversionV2ToV0Compressed PASSED

kafka.log.LogValidatorTest > testZStdCompressedWithUnavailableIBPVersion STARTED

kafka.log.LogValidatorTest > testZStdCompressedWithUnavailableIBPVersion PASSED

kafka.log.LogValidatorTest > testOffsetAssignmentAfterUpConversionV1ToV2Compressed STARTED

kafka.log.LogValidatorTest > testOffsetAssignmentAfterUpConversionV1ToV2Compressed PASSED

kafka.log.LogValidatorTest > testOffsetAssignmentAfterUpConversionV0ToV1NonCompressed STARTED

kafka.log.LogValidatorTest > testOffsetAssignmentAfterUpConversionV0ToV1NonCompressed PASSED

kafka.log.LogValidatorTest > testDownConversionOfTransactionalRecordsNotPermitted STARTED

kafka.log.LogValidatorTest > testDownConversionOfTransactionalRecordsNotPermitted PASSED

kafka.log.LogValidatorTest > testOffsetAssignmentAfterUpConversionV0ToV1Compressed STARTED

kafka.log.LogValidatorTest > testOffsetAssignmentAfterUpConversionV0ToV1Compressed PASSED

kafka.log.LogValidatorTest > testRelativeOffsetAssignmentNonCompressedV1 STARTED

kafka.log.LogValidatorTest > testRelativeOffsetAssignmentNonCompressedV1 PASSED

kafka.log.LogValidatorTest > testRelativeOffsetAssignmentNonCompressedV2 STARTED

kafka.log.LogValidatorTest > testRelativeOffsetAssignmentNonCompressedV2 PASSED

kafka.log.LogValidatorTest > testControlRecordsNotAllowedFromClients STARTED

kafka.log.LogValidatorTest > testControlRecordsNotAllowedFromClients PASSED

kafka.log.LogValidatorTest > testRelativeOffsetAssignmentCompressedV1 STARTED

kafka.log.LogValidatorTest > testRelativeOffsetAssignmentCompressedV1 PASSED

kafka.log.LogValidatorTest > testRelativeOffsetAssignmentCompressedV2 STARTED

kafka.log.LogValidatorTest > testRelativeOffsetAssignmentCompressedV2 PASSED

kafka.log.LogValidatorTest > testOffsetAssignmentAfterDownConversionV2ToV1NonCompressed
STARTED

kafka.log.LogValidatorTest > testOffsetAssignmentAfterDownConversionV2ToV1NonCompressed
PASSED

kafka.log.LogValidatorTest > testLogAppendTimeNonCompressedV1 STARTED

kafka.log.LogValidatorTest > testLogAppendTimeNonCompressedV1 PASSED

kafka.log.LogValidatorTest > testOffsetAssignmentAfterDownConversionV2ToV0NonCompressed
STARTED

kafka.log.LogValidatorTest > testOffsetAssignmentAfterDownConversionV2ToV0NonCompressed
PASSED

kafka.log.LogValidatorTest > testControlRecordsNotCompressed STARTED

kafka.log.LogValidatorTest > testControlRecordsNotCompressed PASSED

kafka.log.LogValidatorTest > testInvalidCreateTimeNonCompressedV1 STARTED

kafka.log.LogValidatorTest > testInvalidCreateTimeNonCompressedV1 PASSED

kafka.log.LogValidatorTest > testInvalidCreateTimeNonCompressedV2 STARTED

kafka.log.LogValidatorTest > testInvalidCreateTimeNonCompressedV2 PASSED

kafka.log.LogValidatorTest > testCompressedBatchWithoutRecordsNotAllowed STARTED

kafka.log.LogValidatorTest > testCompressedBatchWithoutRecordsNotAllowed PASSED

kafka.log.LogValidatorTest > testInvalidInnerMagicVersion STARTED

kafka.log.LogValidatorTest > testInvalidInnerMagicVersion PASSED

kafka.log.LogValidatorTest > testInvalidOffsetRangeAndRecordCount STARTED

kafka.log.LogValidatorTest > testInvalidOffsetRangeAndRecordCount PASSED

kafka.log.LogValidatorTest > testLogAppendTimeWithoutRecompressionV1 STARTED

kafka.log.LogValidatorTest > testLogAppendTimeWithoutRecompressionV1 PASSED

kafka.log.LogValidatorTest > testLogAppendTimeWithoutRecompressionV2 STARTED

kafka.log.LogValidatorTest > testLogAppendTimeWithoutRecompressionV2 PASSED

kafka.log.LogValidatorTest > testUncompressedBatchWithoutRecordsNotAllowed STARTED

kafka.log.LogValidatorTest > testUncompressedBatchWithoutRecordsNotAllowed PASSED

kafka.log.LogValidatorTest > testOffsetAssignmentAfterDownConversionV1ToV0NonCompressed
STARTED

kafka.log.LogValidatorTest > testOffsetAssignmentAfterDownConversionV1ToV0NonCompressed
PASSED

kafka.log.LogValidatorTest > testAbsoluteOffsetAssignmentNonCompressed STARTED

kafka.log.LogValidatorTest > testAbsoluteOffsetAssignmentNonCompressed PASSED

kafka.log.LogValidatorTest > testOffsetAssignmentAfterDownConversionV2ToV1Compressed STARTED

kafka.log.LogValidatorTest > testOffsetAssignmentAfterDownConversionV2ToV1Compressed PASSED

kafka.log.LogValidatorTest > testOffsetAssignmentAfterDownConversionV1ToV0Compressed STARTED

kafka.log.LogValidatorTest > testOffsetAssignmentAfterDownConversionV1ToV0Compressed PASSED

kafka.log.LogValidatorTest > testOffsetAssignmentAfterUpConversionV0ToV2Compressed STARTED

kafka.log.LogValidatorTest > testOffsetAssignmentAfterUpConversionV0ToV2Compressed PASSED

kafka.log.LogValidatorTest > testNonCompressedV1 STARTED

kafka.log.LogValidatorTest > testNonCompressedV1 PASSED

kafka.log.LogValidatorTest > testNonCompressedV2 STARTED

kafka.log.LogValidatorTest > testNonCompressedV2 PASSED

kafka.log.LogValidatorTest > testOffsetAssignmentAfterUpConversionV1ToV2NonCompressed STARTED

kafka.log.LogValidatorTest > testOffsetAssignmentAfterUpConversionV1ToV2NonCompressed PASSED

kafka.log.LogValidatorTest > testInvalidCreateTimeCompressedV1 STARTED

kafka.log.LogValidatorTest > testInvalidCreateTimeCompressedV1 PASSED

kafka.log.LogValidatorTest > testInvalidCreateTimeCompressedV2 STARTED

kafka.log.LogValidatorTest > testInvalidCreateTimeCompressedV2 PASSED

kafka.log.LogValidatorTest > testRecompressionV1 STARTED

kafka.log.LogValidatorTest > testRecompressionV1 PASSED

kafka.log.LogValidatorTest > testRecompressionV2 STARTED

kafka.log.LogValidatorTest > testRecompressionV2 PASSED

integration.kafka.api.ConsumerTopicCreationTest > testAutoTopicCreation[brokerTopicCreation=true,
consumerTopicCreation=true] STARTED

integration.kafka.api.ConsumerTopicCreationTest > testAutoTopicCreation[brokerTopicCreation=true,
consumerTopicCreation=true] PASSED

integration.kafka.api.ConsumerTopicCreationTest > testAutoTopicCreation[brokerTopicCreation=true,
consumerTopicCreation=false] STARTED

integration.kafka.api.ConsumerTopicCreationTest > testAutoTopicCreation[brokerTopicCreation=true,
consumerTopicCreation=false] PASSED

integration.kafka.api.ConsumerTopicCreationTest > testAutoTopicCreation[brokerTopicCreation=false,
consumerTopicCreation=true] STARTED

integration.kafka.api.ConsumerTopicCreationTest > testAutoTopicCreation[brokerTopicCreation=false,
consumerTopicCreation=true] PASSED

integration.kafka.api.ConsumerTopicCreationTest > testAutoTopicCreation[brokerTopicCreation=false,
consumerTopicCreation=false] STARTED

integration.kafka.api.ConsumerTopicCreationTest > testAutoTopicCreation[brokerTopicCreation=false,
consumerTopicCreation=false] PASSED

2401 tests completed, 2 failed, 2 skipped

> Task :kafka-2.3-jdk8:core:test FAILED
> Task :testScala_2_11 FAILED

FAILURE: Build completed with 2 failures.

1: Task failed with an exception.
-----------
* What went wrong:
Execution failed for task ':kafka-2.3-jdk8:core:test'.
> There were failing tests. See the report at: file://<https://builds.apache.org/job/kafka-2.3-jdk8/ws/core/build/reports/tests/test/index.html>

* Try:
Run with --stacktrace option to get the stack trace. Run with --info or --debug option to
get more log output. Run with --scan to get full insights.
==============================================================================

2: Task failed with an exception.
-----------
* What went wrong:
Execution failed for task ':kafka-2.3-jdk8:core:test'.
> There were failing tests. See the report at: file://<https://builds.apache.org/job/kafka-2.3-jdk8/ws/core/build/reports/tests/test/index.html>

* Try:
Run with --stacktrace option to get the stack trace. Run with --info or --debug option to
get more log output. Run with --scan to get full insights.
==============================================================================

* Get more help at https://help.gradle.org

Deprecated Gradle features were used in this build, making it incompatible with Gradle 6.0.
Use '--warning-mode all' to show the individual deprecation warnings.
See https://docs.gradle.org/5.4.1/userguide/command_line_interface.html#sec:command_line_warnings

BUILD FAILED in 4h 43m 33s
141 actionable tasks: 115 executed, 26 up-to-date
Build step 'Execute shell' marked build as failure
[FINDBUGS] Collecting findbugs analysis files...
Setting GRADLE_4_10_3_HOME=/home/jenkins/tools/gradle/4.10.3
[FINDBUGS] Searching for all files in <https://builds.apache.org/job/kafka-2.3-jdk8/ws/>
that match the pattern **/build/reports/findbugs/*.xml
[FINDBUGS] No files found. Configuration error?
Setting GRADLE_4_10_3_HOME=/home/jenkins/tools/gradle/4.10.3
No credentials specified
Setting GRADLE_4_10_3_HOME=/home/jenkins/tools/gradle/4.10.3
<Git Blamer> Using GitBlamer to create author and commit information for all warnings.
<Git Blamer> GIT_COMMIT=c8676c996ebc4a583c1efade16393ca9a73f16e5, workspace=<https://builds.apache.org/job/kafka-2.3-jdk8/ws/>
[FINDBUGS] Computing warning deltas based on reference build #128
Recording test results
Setting GRADLE_4_10_3_HOME=/home/jenkins/tools/gradle/4.10.3
Setting GRADLE_4_10_3_HOME=/home/jenkins/tools/gradle/4.10.3
Not sending mail to unregistered user rajinisivaram@googlemail.com

Mime
View raw message