kafka-dev mailing list archives

Site index · List index
Message view « Date » · « Thread »
Top « Date » · « Thread »
From Apache Jenkins Server <jenk...@builds.apache.org>
Subject Build failed in Jenkins: kafka-1.0-jdk7 #275
Date Tue, 06 Aug 2019 22:17:08 GMT
See <https://builds.apache.org/job/kafka-1.0-jdk7/275/display/redirect?page=changes>

Changes:

[matthias] KAFKA-8602: Backport bugfix for standby task creation (#7148)

------------------------------------------
[...truncated 295.67 KB...]

kafka.api.SslEndToEndAuthorizationTest > testNoConsumeWithoutDescribeAclViaSubscribe STARTED

kafka.api.SslEndToEndAuthorizationTest > testNoConsumeWithoutDescribeAclViaSubscribe PASSED

kafka.api.SslEndToEndAuthorizationTest > testProduceConsumeViaAssign STARTED

kafka.api.SslEndToEndAuthorizationTest > testProduceConsumeViaAssign PASSED

kafka.api.SslEndToEndAuthorizationTest > testNoConsumeWithDescribeAclViaAssign STARTED

kafka.api.SslEndToEndAuthorizationTest > testNoConsumeWithDescribeAclViaAssign PASSED

kafka.api.SslEndToEndAuthorizationTest > testNoConsumeWithDescribeAclViaSubscribe STARTED

kafka.api.SslEndToEndAuthorizationTest > testNoConsumeWithDescribeAclViaSubscribe PASSED

kafka.api.SslEndToEndAuthorizationTest > testNoConsumeWithoutDescribeAclViaAssign STARTED

kafka.api.SslEndToEndAuthorizationTest > testNoConsumeWithoutDescribeAclViaAssign PASSED

kafka.api.SslEndToEndAuthorizationTest > testNoGroupAcl STARTED

kafka.api.SslEndToEndAuthorizationTest > testNoGroupAcl PASSED

kafka.api.SslEndToEndAuthorizationTest > testNoProduceWithDescribeAcl STARTED

kafka.api.SslEndToEndAuthorizationTest > testNoProduceWithDescribeAcl PASSED

kafka.api.SslEndToEndAuthorizationTest > testProduceConsumeViaSubscribe STARTED

kafka.api.SslEndToEndAuthorizationTest > testProduceConsumeViaSubscribe PASSED

kafka.api.SslEndToEndAuthorizationTest > testNoProduceWithoutDescribeAcl STARTED

kafka.api.SslEndToEndAuthorizationTest > testNoProduceWithoutDescribeAcl PASSED

kafka.api.GroupCoordinatorIntegrationTest > testGroupCoordinatorPropagatesOfffsetsTopicCompressionCodec
STARTED

kafka.api.GroupCoordinatorIntegrationTest > testGroupCoordinatorPropagatesOfffsetsTopicCompressionCodec
PASSED

kafka.api.SaslSslConsumerTest > testCoordinatorFailover STARTED

kafka.api.SaslSslConsumerTest > testCoordinatorFailover PASSED

kafka.api.SaslSslConsumerTest > testSimpleConsumption STARTED

kafka.api.SaslSslConsumerTest > testSimpleConsumption PASSED

kafka.api.ConsumerBounceTest > testCloseDuringRebalance STARTED

kafka.api.ConsumerBounceTest > testCloseDuringRebalance PASSED

kafka.api.ConsumerBounceTest > testClose STARTED

kafka.api.ConsumerBounceTest > testClose PASSED

kafka.api.ConsumerBounceTest > testSeekAndCommitWithBrokerFailures STARTED

kafka.api.ConsumerBounceTest > testSeekAndCommitWithBrokerFailures PASSED

kafka.api.ConsumerBounceTest > testSubscribeWhenTopicUnavailable STARTED

kafka.api.ConsumerBounceTest > testSubscribeWhenTopicUnavailable PASSED

kafka.api.ConsumerBounceTest > testConsumptionWithBrokerFailures STARTED

kafka.api.ConsumerBounceTest > testConsumptionWithBrokerFailures SKIPPED

kafka.api.AdminClientIntegrationTest > testDescribeReplicaLogDirs STARTED

kafka.api.AdminClientIntegrationTest > testDescribeReplicaLogDirs PASSED

kafka.api.AdminClientIntegrationTest > testInvalidAlterConfigs STARTED

kafka.api.AdminClientIntegrationTest > testInvalidAlterConfigs PASSED

kafka.api.AdminClientIntegrationTest > testClose STARTED

kafka.api.AdminClientIntegrationTest > testClose PASSED

kafka.api.AdminClientIntegrationTest > testMinimumRequestTimeouts STARTED

kafka.api.AdminClientIntegrationTest > testMinimumRequestTimeouts PASSED

kafka.api.AdminClientIntegrationTest > testForceClose STARTED

kafka.api.AdminClientIntegrationTest > testForceClose PASSED

kafka.api.AdminClientIntegrationTest > testListNodes STARTED

kafka.api.AdminClientIntegrationTest > testListNodes PASSED

kafka.api.AdminClientIntegrationTest > testDelayedClose STARTED

kafka.api.AdminClientIntegrationTest > testDelayedClose PASSED

kafka.api.AdminClientIntegrationTest > testCreateDeleteTopics STARTED

kafka.api.AdminClientIntegrationTest > testCreateDeleteTopics PASSED

kafka.api.AdminClientIntegrationTest > testAlterReplicaLogDirsBeforeTopicCreation STARTED

kafka.api.AdminClientIntegrationTest > testAlterReplicaLogDirsBeforeTopicCreation PASSED

kafka.api.AdminClientIntegrationTest > testDescribeLogDirs STARTED

kafka.api.AdminClientIntegrationTest > testDescribeLogDirs PASSED

kafka.api.AdminClientIntegrationTest > testAclOperations STARTED

kafka.api.AdminClientIntegrationTest > testAclOperations PASSED

kafka.api.AdminClientIntegrationTest > testDescribeCluster STARTED

kafka.api.AdminClientIntegrationTest > testDescribeCluster PASSED

kafka.api.AdminClientIntegrationTest > testCreatePartitions STARTED

kafka.api.AdminClientIntegrationTest > testCreatePartitions PASSED

kafka.api.AdminClientIntegrationTest > testDescribeNonExistingTopic STARTED

kafka.api.AdminClientIntegrationTest > testDescribeNonExistingTopic PASSED

kafka.api.AdminClientIntegrationTest > testDescribeAndAlterConfigs STARTED

kafka.api.AdminClientIntegrationTest > testDescribeAndAlterConfigs PASSED

kafka.api.AdminClientIntegrationTest > testCallInFlightTimeouts STARTED

kafka.api.AdminClientIntegrationTest > testCallInFlightTimeouts PASSED

kafka.api.PlaintextConsumerTest > testEarliestOrLatestOffsets STARTED

kafka.api.PlaintextConsumerTest > testEarliestOrLatestOffsets PASSED

kafka.api.PlaintextConsumerTest > testPartitionsForAutoCreate STARTED

kafka.api.PlaintextConsumerTest > testPartitionsForAutoCreate PASSED

kafka.api.PlaintextConsumerTest > testShrinkingTopicSubscriptions STARTED

kafka.api.PlaintextConsumerTest > testShrinkingTopicSubscriptions PASSED

kafka.api.PlaintextConsumerTest > testMaxPollIntervalMs STARTED

kafka.api.PlaintextConsumerTest > testMaxPollIntervalMs PASSED

kafka.api.PlaintextConsumerTest > testOffsetsForTimes STARTED

kafka.api.PlaintextConsumerTest > testOffsetsForTimes PASSED

kafka.api.PlaintextConsumerTest > testSubsequentPatternSubscription STARTED

kafka.api.PlaintextConsumerTest > testSubsequentPatternSubscription PASSED

kafka.api.PlaintextConsumerTest > testConsumeMessagesWithCreateTime STARTED

kafka.api.PlaintextConsumerTest > testConsumeMessagesWithCreateTime PASSED

kafka.api.PlaintextConsumerTest > testAsyncCommit STARTED

kafka.api.PlaintextConsumerTest > testAsyncCommit PASSED

kafka.api.PlaintextConsumerTest > testLowMaxFetchSizeForRequestAndPartition STARTED
ERROR: Could not install GRADLE_4_8_1_HOME
java.lang.NullPointerException
ERROR: Could not install GRADLE_4_8_1_HOME
java.lang.NullPointerException
ERROR: Could not install GRADLE_4_8_1_HOME
java.lang.NullPointerException
Build timed out (after 240 minutes). Marking the build as failed.
Build was aborted
[FINDBUGS] Collecting findbugs analysis files...
Setting GRADLE_4_8_1_HOME=/home/jenkins/tools/gradle/4.8.1
[FINDBUGS] Searching for all files in <https://builds.apache.org/job/kafka-1.0-jdk7/ws/>
that match the pattern **/build/reports/findbugs/*.xml
[FINDBUGS] Parsing 1 file in <https://builds.apache.org/job/kafka-1.0-jdk7/ws/>
[FINDBUGS] Successfully parsed file <https://builds.apache.org/job/kafka-1.0-jdk7/ws/core/build/reports/findbugs/main.xml>
with 0 unique warnings and 0 duplicates.
Setting GRADLE_4_8_1_HOME=/home/jenkins/tools/gradle/4.8.1

kafka.api.PlaintextConsumerTest > testLowMaxFetchSizeForRequestAndPartition SKIPPED
No credentials specified
Setting GRADLE_4_8_1_HOME=/home/jenkins/tools/gradle/4.8.1

> Task :kafka-1.0-jdk7:core:test FAILED
> Task :test_core_2_11 FAILED

FAILURE: Build failed with an exception.

* What went wrong:
Execution failed for task ':kafka-1.0-jdk7:core:test'.
> Process 'Gradle Test Executor 3' finished with non-zero exit value 143
  This problem might be caused by incorrect test process configuration.
  Please refer to the test execution section in the user guide at https://docs.gradle.org/4.8.1/userguide/java_plugin.html#sec:test_execution

* Try:
Run with --stacktrace option to get the stack trace. Run with --info or --debug option to
get more log output. Run with --scan to get full insights.

* Get more help at https://help.gradle.org

Deprecated Gradle features were used in this build, making it incompatible with Gradle 5.0.
See https://docs.gradle.org/4.8.1/userguide/command_line_interface.html#sec:command_line_warnings

BUILD FAILED in 3h 59m 37s
20 actionable tasks: 2 executed, 18 up-to-date
<Git Blamer> Using GitBlamer to create author and commit information for all warnings.
Unexpected exception thrown.
org.gradle.internal.remote.internal.MessageIOException: Could not write '/0:0:0:0:0:0:0:1:42874'.
	at org.gradle.internal.remote.internal.inet.SocketConnection.flush(SocketConnection.java:134)
	at org.gradle.internal.remote.internal.hub.MessageHub$ConnectionDispatch.run(MessageHub.java:325)
	at org.gradle.internal.concurrent.ExecutorPolicy$CatchAndRecordFailures.onExecute(ExecutorPolicy.java:63)
	at org.gradle.internal.concurrent.ManagedExecutorImpl$1.run(ManagedExecutorImpl.java:46)
	at java.util.concurrent.ThreadPoolExecutor.runWorker(ThreadPoolExecutor.java:1145)
	at java.util.concurrent.ThreadPoolExecutor$Worker.run(ThreadPoolExecutor.java:615)
	at org.gradle.internal.concurrent.ThreadFactoryImpl$ManagedThreadRunnable.run(ThreadFactoryImpl.java:55)
	at java.lang.Thread.run(Thread.java:745)
Caused by: java.io.IOException: Broken pipe
	at sun.nio.ch.FileDispatcherImpl.write0(Native Method)
	at sun.nio.ch.SocketDispatcher.write(SocketDispatcher.java:47)
	at sun.nio.ch.IOUtil.writeFromNativeBuffer(IOUtil.java:93)
	at sun.nio.ch.IOUtil.write(IOUtil.java:51)
	at sun.nio.ch.SocketChannelImpl.write(SocketChannelImpl.java:492)
	at org.gradle.internal.remote.internal.inet.SocketConnection$SocketOutputStream.writeWithNonBlockingRetry(SocketConnection.java:272)
	at org.gradle.internal.remote.internal.inet.SocketConnection$SocketOutputStream.writeBufferToChannel(SocketConnection.java:260)
	at org.gradle.internal.remote.internal.inet.SocketConnection$SocketOutputStream.flush(SocketConnection.java:254)
	at org.gradle.internal.remote.internal.inet.SocketConnection.flush(SocketConnection.java:132)
	... 7 more

FAILURE: Build failed with an exception.

* What went wrong:
Process 'Gradle Worker Daemon 1' finished with non-zero exit value 143

* Try:
Run with --stacktrace option to get the stack trace. Run with --info or --debug option to
get more log output. Run with --scan to get full insights.

* Get more help at https://help.gradle.org

Deprecated Gradle features were used in this build, making it incompatible with Gradle 5.0.
See https://docs.gradle.org/4.8.1/userguide/command_line_interface.html#sec:command_line_warnings

BUILD FAILED in 3h 59m 37s
<Git Blamer> GIT_COMMIT=3b729ac960392514c68f3e84eff0c51e79a0d06e, workspace=<https://builds.apache.org/job/kafka-1.0-jdk7/ws/>
[FINDBUGS] Computing warning deltas based on reference build #274
Recording test results
Setting GRADLE_4_8_1_HOME=/home/jenkins/tools/gradle/4.8.1
ERROR: Step ?Publish JUnit test result report? failed: No test report files were found. Configuration
error?
Setting GRADLE_4_8_1_HOME=/home/jenkins/tools/gradle/4.8.1

Mime
View raw message