kafka-dev mailing list archives

Site index · List index
Message view « Date » · « Thread »
Top « Date » · « Thread »
From Apache Jenkins Server <jenk...@builds.apache.org>
Subject Build failed in Jenkins: kafka-trunk-jdk11 #779
Date Wed, 28 Aug 2019 06:11:59 GMT
See <https://builds.apache.org/job/kafka-trunk-jdk11/779/display/redirect?page=changes>

Changes:

[wangguoz] KAFKA-8745: DumpLogSegments doesn't show keys, when the message is null

[wangguoz] KAFKA-8179: Part 4, add CooperativeStickyAssignor (#7130)

------------------------------------------
[...truncated 5.95 MB...]

org.apache.kafka.streams.state.StoresTest > shouldThrowIfIPersistentWindowStoreIfNumberOfSegmentsSmallerThanOne
PASSED

org.apache.kafka.streams.state.StoresTest > shouldCreateRocksDbStore STARTED

org.apache.kafka.streams.state.StoresTest > shouldCreateRocksDbStore PASSED

org.apache.kafka.streams.state.StoresTest > shouldThrowIfPersistentTimestampedKeyValueStoreStoreNameIsNull
STARTED

org.apache.kafka.streams.state.StoresTest > shouldThrowIfPersistentTimestampedKeyValueStoreStoreNameIsNull
PASSED

org.apache.kafka.streams.state.StoresTest > shouldBuildTimestampedWindowStore STARTED

org.apache.kafka.streams.state.StoresTest > shouldBuildTimestampedWindowStore PASSED

org.apache.kafka.streams.state.StoresTest > shouldThrowIfIPersistentWindowStoreStoreNameIsNull
STARTED

org.apache.kafka.streams.state.StoresTest > shouldThrowIfIPersistentWindowStoreStoreNameIsNull
PASSED

org.apache.kafka.streams.state.StoresTest > shouldThrowIfPersistentKeyValueStoreStoreNameIsNull
STARTED

org.apache.kafka.streams.state.StoresTest > shouldThrowIfPersistentKeyValueStoreStoreNameIsNull
PASSED

org.apache.kafka.streams.state.StoresTest > shouldCreateRocksDbWindowStore STARTED

org.apache.kafka.streams.state.StoresTest > shouldCreateRocksDbWindowStore PASSED

org.apache.kafka.streams.state.StoresTest > shouldThrowIfILruMapStoreNameIsNull STARTED

org.apache.kafka.streams.state.StoresTest > shouldThrowIfILruMapStoreNameIsNull PASSED

org.apache.kafka.streams.state.StoresTest > shouldThrowIfIPersistentSessionStoreStoreNameIsNull
STARTED

org.apache.kafka.streams.state.StoresTest > shouldThrowIfIPersistentSessionStoreStoreNameIsNull
PASSED

org.apache.kafka.streams.state.StoresTest > shouldBuildTimestampedWindowStoreThatWrapsWindowStore
STARTED

org.apache.kafka.streams.state.StoresTest > shouldBuildTimestampedWindowStoreThatWrapsWindowStore
PASSED
streams-6: SMOKE-TEST-CLIENT-CLOSED
ERROR: Failed to write output for test null.Gradle Test Executor 20
java.lang.NullPointerException: Cannot invoke method write() on null object
	at org.codehaus.groovy.runtime.NullObject.invokeMethod(NullObject.java:91)
	at org.codehaus.groovy.runtime.callsite.PogoMetaClassSite.call(PogoMetaClassSite.java:47)
	at org.codehaus.groovy.runtime.callsite.CallSiteArray.defaultCall(CallSiteArray.java:47)
	at org.codehaus.groovy.runtime.callsite.NullCallSite.call(NullCallSite.java:34)
	at org.codehaus.groovy.runtime.callsite.CallSiteArray.defaultCall(CallSiteArray.java:47)
	at java_io_FileOutputStream$write.call(Unknown Source)
	at build_av7tdo8a1kfk9insmdebvqzp9$_run_closure5$_closure76$_closure109.doCall(<https://builds.apache.org/job/kafka-trunk-jdk11/ws/build.gradle>:244)
	at jdk.internal.reflect.GeneratedMethodAccessor350.invoke(Unknown Source)
	at java.base/jdk.internal.reflect.DelegatingMethodAccessorImpl.invoke(DelegatingMethodAccessorImpl.java:43)
	at java.base/java.lang.reflect.Method.invoke(Method.java:566)
	at org.codehaus.groovy.reflection.CachedMethod.invoke(CachedMethod.java:104)
	at groovy.lang.MetaMethod.doMethodInvoke(MetaMethod.java:326)
	at org.codehaus.groovy.runtime.metaclass.ClosureMetaClass.invokeMethod(ClosureMetaClass.java:264)
	at groovy.lang.MetaClassImpl.invokeMethod(MetaClassImpl.java:1041)
	at groovy.lang.Closure.call(Closure.java:411)
	at org.gradle.listener.ClosureBackedMethodInvocationDispatch.dispatch(ClosureBackedMethodInvocationDispatch.java:40)
	at org.gradle.listener.ClosureBackedMethodInvocationDispatch.dispatch(ClosureBackedMethodInvocationDispatch.java:25)
	at org.gradle.internal.event.AbstractBroadcastDispatch.dispatch(AbstractBroadcastDispatch.java:42)
	at org.gradle.internal.event.BroadcastDispatch$SingletonDispatch.dispatch(BroadcastDispatch.java:230)
	at org.gradle.internal.event.BroadcastDispatch$SingletonDispatch.dispatch(BroadcastDispatch.java:149)
	at org.gradle.internal.event.AbstractBroadcastDispatch.dispatch(AbstractBroadcastDispatch.java:58)
	at org.gradle.internal.event.BroadcastDispatch$CompositeDispatch.dispatch(BroadcastDispatch.java:324)
	at org.gradle.internal.event.BroadcastDispatch$CompositeDispatch.dispatch(BroadcastDispatch.java:234)
	at org.gradle.internal.event.ListenerBroadcast.dispatch(ListenerBroadcast.java:140)
	at org.gradle.internal.event.ListenerBroadcast.dispatch(ListenerBroadcast.java:37)
	at org.gradle.internal.dispatch.ProxyDispatchAdapter$DispatchingInvocationHandler.invoke(ProxyDispatchAdapter.java:93)
	at com.sun.proxy.$Proxy78.onOutput(Unknown Source)
	at org.gradle.api.internal.tasks.testing.results.TestListenerAdapter.output(TestListenerAdapter.java:56)
	at jdk.internal.reflect.GeneratedMethodAccessor347.invoke(Unknown Source)
	at java.base/jdk.internal.reflect.DelegatingMethodAccessorImpl.invoke(DelegatingMethodAccessorImpl.java:43)
	at java.base/java.lang.reflect.Method.invoke(Method.java:566)
	at org.gradle.internal.dispatch.ReflectionDispatch.dispatch(ReflectionDispatch.java:35)
	at org.gradle.internal.dispatch.ReflectionDispatch.dispatch(ReflectionDispatch.java:24)
	at org.gradle.internal.event.AbstractBroadcastDispatch.dispatch(AbstractBroadcastDispatch.java:42)
	at org.gradle.internal.event.BroadcastDispatch$SingletonDispatch.dispatch(BroadcastDispatch.java:230)
	at org.gradle.internal.event.BroadcastDispatch$SingletonDispatch.dispatch(BroadcastDispatch.java:149)
	at org.gradle.internal.event.AbstractBroadcastDispatch.dispatch(AbstractBroadcastDispatch.java:58)
	at org.gradle.internal.event.BroadcastDispatch$CompositeDispatch.dispatch(BroadcastDispatch.java:324)
	at org.gradle.internal.event.BroadcastDispatch$CompositeDispatch.dispatch(BroadcastDispatch.java:234)
	at org.gradle.internal.event.ListenerBroadcast.dispatch(ListenerBroadcast.java:140)
	at org.gradle.internal.event.ListenerBroadcast.dispatch(ListenerBroadcast.java:37)
	at org.gradle.internal.dispatch.ProxyDispatchAdapter$DispatchingInvocationHandler.invoke(ProxyDispatchAdapter.java:93)
	at com.sun.proxy.$Proxy79.output(Unknown Source)
	at org.gradle.api.internal.tasks.testing.results.StateTrackingTestResultProcessor.output(StateTrackingTestResultProcessor.java:112)
	at org.gradle.api.internal.tasks.testing.results.AttachParentTestResultProcessor.output(AttachParentTestResultProcessor.java:48)
	at jdk.internal.reflect.GeneratedMethodAccessor349.invoke(Unknown Source)
	at java.base/jdk.internal.reflect.DelegatingMethodAccessorImpl.invoke(DelegatingMethodAccessorImpl.java:43)
	at java.base/java.lang.reflect.Method.invoke(Method.java:566)
	at org.gradle.internal.dispatch.ReflectionDispatch.dispatch(ReflectionDispatch.java:35)
	at org.gradle.internal.dispatch.ReflectionDispatch.dispatch(ReflectionDispatch.java:24)
	at org.gradle.internal.dispatch.FailureHandlingDispatch.dispatch(FailureHandlingDispatch.java:29)
	at org.gradle.internal.dispatch.AsyncDispatch.dispatchMessages(AsyncDispatch.java:87)
	at org.gradle.internal.dispatch.AsyncDispatch.access$000(AsyncDispatch.java:36)
	at org.gradle.internal.dispatch.AsyncDispatch$1.run(AsyncDispatch.java:71)
	at org.gradle.internal.concurrent.InterruptibleRunnable.run(InterruptibleRunnable.java:42)
	at org.gradle.internal.operations.CurrentBuildOperationPreservingRunnable.run(CurrentBuildOperationPreservingRunnable.java:42)
	at org.gradle.internal.concurrent.ExecutorPolicy$CatchAndRecordFailures.onExecute(ExecutorPolicy.java:63)
	at org.gradle.internal.concurrent.ManagedExecutorImpl$1.run(ManagedExecutorImpl.java:46)
	at java.base/java.util.concurrent.ThreadPoolExecutor.runWorker(ThreadPoolExecutor.java:1128)
	at java.base/java.util.concurrent.ThreadPoolExecutor$Worker.run(ThreadPoolExecutor.java:628)
	at org.gradle.internal.concurrent.ThreadFactoryImpl$ManagedThreadRunnable.run(ThreadFactoryImpl.java:55)
	at java.base/java.lang.Thread.run(Thread.java:834)
ERROR: Failed to write output for test null.Gradle Test Executor 20
java.lang.NullPointerException: Cannot invoke method write() on null object
	at org.codehaus.groovy.runtime.NullObject.invokeMethod(NullObject.java:91)
	at org.codehaus.groovy.runtime.callsite.PogoMetaClassSite.call(PogoMetaClassSite.java:47)
	at org.codehaus.groovy.runtime.callsite.CallSiteArray.defaultCall(CallSiteArray.java:47)
	at org.codehaus.groovy.runtime.callsite.NullCallSite.call(NullCallSite.java:34)
	at org.codehaus.groovy.runtime.callsite.CallSiteArray.defaultCall(CallSiteArray.java:47)
	at org.codehaus.groovy.runtime.callsite.PogoMetaClassSite.call(PogoMetaClassSite.java:56)
	at org.codehaus.groovy.runtime.callsite.AbstractCallSite.call(AbstractCallSite.java:127)
	at build_av7tdo8a1kfk9insmdebvqzp9$_run_closure5$_closure76$_closure109.doCall(<https://builds.apache.org/job/kafka-trunk-jdk11/ws/build.gradle>:244)
	at jdk.internal.reflect.GeneratedMethodAccessor350.invoke(Unknown Source)
	at java.base/jdk.internal.reflect.DelegatingMethodAccessorImpl.invoke(DelegatingMethodAccessorImpl.java:43)
	at java.base/java.lang.reflect.Method.invoke(Method.java:566)
	at org.codehaus.groovy.reflection.CachedMethod.invoke(CachedMethod.java:104)
	at groovy.lang.MetaMethod.doMethodInvoke(MetaMethod.java:326)
	at org.codehaus.groovy.runtime.metaclass.ClosureMetaClass.invokeMethod(ClosureMetaClass.java:264)
	at groovy.lang.MetaClassImpl.invokeMethod(MetaClassImpl.java:1041)
	at groovy.lang.Closure.call(Closure.java:411)
	at org.gradle.listener.ClosureBackedMethodInvocationDispatch.dispatch(ClosureBackedMethodInvocationDispatch.java:40)
	at org.gradle.listener.ClosureBackedMethodInvocationDispatch.dispatch(ClosureBackedMethodInvocationDispatch.java:25)
	at org.gradle.internal.event.AbstractBroadcastDispatch.dispatch(AbstractBroadcastDispatch.java:42)
	at org.gradle.internal.event.BroadcastDispatch$SingletonDispatch.dispatch(BroadcastDispatch.java:230)
	at org.gradle.internal.event.BroadcastDispatch$SingletonDispatch.dispatch(BroadcastDispatch.java:149)
	at org.gradle.internal.event.AbstractBroadcastDispatch.dispatch(AbstractBroadcastDispatch.java:58)
	at org.gradle.internal.event.BroadcastDispatch$CompositeDispatch.dispatch(BroadcastDispatch.java:324)
	at org.gradle.internal.event.BroadcastDispatch$CompositeDispatch.dispatch(BroadcastDispatch.java:234)
	at org.gradle.internal.event.ListenerBroadcast.dispatch(ListenerBroadcast.java:140)
	at org.gradle.internal.event.ListenerBroadcast.dispatch(ListenerBroadcast.java:37)
	at org.gradle.internal.dispatch.ProxyDispatchAdapter$DispatchingInvocationHandler.invoke(ProxyDispatchAdapter.java:93)
	at com.sun.proxy.$Proxy78.onOutput(Unknown Source)
	at org.gradle.api.internal.tasks.testing.results.TestListenerAdapter.output(TestListenerAdapter.java:56)
	at jdk.internal.reflect.GeneratedMethodAccessor347.invoke(Unknown Source)
	at java.base/jdk.internal.reflect.DelegatingMethodAccessorImpl.invoke(DelegatingMethodAccessorImpl.java:43)
	at java.base/java.lang.reflect.Method.invoke(Method.java:566)
	at org.gradle.internal.dispatch.ReflectionDispatch.dispatch(ReflectionDispatch.java:35)
	at org.gradle.internal.dispatch.ReflectionDispatch.dispatch(ReflectionDispatch.java:24)
	at org.gradle.internal.event.AbstractBroadcastDispatch.dispatch(AbstractBroadcastDispatch.java:42)
	at org.gradle.internal.event.BroadcastDispatch$SingletonDispatch.dispatch(BroadcastDispatch.java:230)
	at org.gradle.internal.event.BroadcastDispatch$SingletonDispatch.dispatch(BroadcastDispatch.java:149)
	at org.gradle.internal.event.AbstractBroadcastDispatch.dispatch(AbstractBroadcastDispatch.java:58)
	at org.gradle.internal.event.BroadcastDispatch$CompositeDispatch.dispatch(BroadcastDispatch.java:324)
	at org.gradle.internal.event.BroadcastDispatch$CompositeDispatch.dispatch(BroadcastDispatch.java:234)
	at org.gradle.internal.event.ListenerBroadcast.dispatch(ListenerBroadcast.java:140)
	at org.gradle.internal.event.ListenerBroadcast.dispatch(ListenerBroadcast.java:37)
	at org.gradle.internal.dispatch.ProxyDispatchAdapter$DispatchingInvocationHandler.invoke(ProxyDispatchAdapter.java:93)
	at com.sun.proxy.$Proxy79.output(Unknown Source)
	at org.gradle.api.internal.tasks.testing.results.StateTrackingTestResultProcessor.output(StateTrackingTestResultProcessor.java:112)
	at org.gradle.api.internal.tasks.testing.results.AttachParentTestResultProcessor.output(AttachParentTestResultProcessor.java:48)
	at jdk.internal.reflect.GeneratedMethodAccessor349.invoke(Unknown Source)
	at java.base/jdk.internal.reflect.DelegatingMethodAccessorImpl.invoke(DelegatingMethodAccessorImpl.java:43)
	at java.base/java.lang.reflect.Method.invoke(Method.java:566)
	at org.gradle.internal.dispatch.ReflectionDispatch.dispatch(ReflectionDispatch.java:35)
	at org.gradle.internal.dispatch.ReflectionDispatch.dispatch(ReflectionDispatch.java:24)
	at org.gradle.internal.dispatch.FailureHandlingDispatch.dispatch(FailureHandlingDispatch.java:29)
	at org.gradle.internal.dispatch.AsyncDispatch.dispatchMessages(AsyncDispatch.java:87)
	at org.gradle.internal.dispatch.AsyncDispatch.access$000(AsyncDispatch.java:36)
	at org.gradle.internal.dispatch.AsyncDispatch$1.run(AsyncDispatch.java:71)
	at org.gradle.internal.concurrent.InterruptibleRunnable.run(InterruptibleRunnable.java:42)
	at org.gradle.internal.operations.CurrentBuildOperationPreservingRunnable.run(CurrentBuildOperationPreservingRunnable.java:42)
	at org.gradle.internal.concurrent.ExecutorPolicy$CatchAndRecordFailures.onExecute(ExecutorPolicy.java:63)
	at org.gradle.internal.concurrent.ManagedExecutorImpl$1.run(ManagedExecutorImpl.java:46)
	at java.base/java.util.concurrent.ThreadPoolExecutor.runWorker(ThreadPoolExecutor.java:1128)
	at java.base/java.util.concurrent.ThreadPoolExecutor$Worker.run(ThreadPoolExecutor.java:628)
	at org.gradle.internal.concurrent.ThreadFactoryImpl$ManagedThreadRunnable.run(ThreadFactoryImpl.java:55)
	at java.base/java.lang.Thread.run(Thread.java:834)
streams-1: SMOKE-TEST-CLIENT-CLOSED
streams-3: SMOKE-TEST-CLIENT-CLOSED
streams-2: SMOKE-TEST-CLIENT-CLOSED
streams-5: SMOKE-TEST-CLIENT-CLOSED
streams-0: SMOKE-TEST-CLIENT-CLOSED
streams-4: SMOKE-TEST-CLIENT-CLOSED

> Task :log4j-appender:test

org.apache.kafka.log4jappender.KafkaLog4jAppenderTest > testLog4jAppendsWithSyncSendWithoutIgnoringExceptionsShouldNotThrowException
STARTED

org.apache.kafka.log4jappender.KafkaLog4jAppenderTest > testLog4jAppendsWithSyncSendWithoutIgnoringExceptionsShouldNotThrowException
PASSED

org.apache.kafka.log4jappender.KafkaLog4jAppenderTest > testLog4jAppendsWithRealProducerConfigWithSyncSendAndNotIgnoringExceptionsShouldThrowException
STARTED

org.apache.kafka.log4jappender.KafkaLog4jAppenderTest > testLog4jAppendsWithRealProducerConfigWithSyncSendAndNotIgnoringExceptionsShouldThrowException
PASSED

org.apache.kafka.log4jappender.KafkaLog4jAppenderTest > testLog4jAppends STARTED

org.apache.kafka.log4jappender.KafkaLog4jAppenderTest > testLog4jAppends PASSED

org.apache.kafka.log4jappender.KafkaLog4jAppenderTest > testSetSaslMechanism STARTED

org.apache.kafka.log4jappender.KafkaLog4jAppenderTest > testSetSaslMechanism PASSED

org.apache.kafka.log4jappender.KafkaLog4jAppenderTest > testJaasConfigNotSet STARTED

org.apache.kafka.log4jappender.KafkaLog4jAppenderTest > testJaasConfigNotSet PASSED

org.apache.kafka.log4jappender.KafkaLog4jAppenderTest > testKafkaLog4jConfigs STARTED

org.apache.kafka.log4jappender.KafkaLog4jAppenderTest > testKafkaLog4jConfigs PASSED

org.apache.kafka.log4jappender.KafkaLog4jAppenderTest > testLog4jAppendsWithSyncSendAndSimulateProducerFailShouldThrowException
STARTED

org.apache.kafka.log4jappender.KafkaLog4jAppenderTest > testLog4jAppendsWithSyncSendAndSimulateProducerFailShouldThrowException
PASSED

org.apache.kafka.log4jappender.KafkaLog4jAppenderTest > testLog4jAppendsWithRealProducerConfigWithSyncSendShouldNotThrowException
STARTED

org.apache.kafka.log4jappender.KafkaLog4jAppenderTest > testLog4jAppendsWithRealProducerConfigWithSyncSendShouldNotThrowException
PASSED

org.apache.kafka.log4jappender.KafkaLog4jAppenderTest > testSaslMechanismNotSet STARTED

org.apache.kafka.log4jappender.KafkaLog4jAppenderTest > testSaslMechanismNotSet PASSED

org.apache.kafka.log4jappender.KafkaLog4jAppenderTest > testSetJaasConfig STARTED

org.apache.kafka.log4jappender.KafkaLog4jAppenderTest > testSetJaasConfig PASSED

> Task :jmh-benchmarks:test NO-SOURCE

> Task :streams:examples:test

org.apache.kafka.streams.examples.wordcount.WordCountProcessorTest > test STARTED

org.apache.kafka.streams.examples.wordcount.WordCountProcessorTest > test PASSED

FAILURE: Build failed with an exception.

* What went wrong:
Execution failed for task ':core:test'.
> There were failing tests. See the report at: file://<https://builds.apache.org/job/kafka-trunk-jdk11/ws/core/build/reports/tests/test/index.html>

* Try:
Run with --stacktrace option to get the stack trace. Run with --info or --debug option to
get more log output. Run with --scan to get full insights.

* Get more help at https://help.gradle.org

Deprecated Gradle features were used in this build, making it incompatible with Gradle 6.0.
Use '--warning-mode all' to show the individual deprecation warnings.
See https://docs.gradle.org/5.4.1/userguide/command_line_interface.html#sec:command_line_warnings

BUILD FAILED in 3h 31m 28s
182 actionable tasks: 179 executed, 3 up-to-date
Build step 'Execute shell' marked build as failure
Recording test results
ERROR: No tool found matching GRADLE_4_10_2_HOME
Setting GRADLE_4_10_3_HOME=/home/jenkins/tools/gradle/4.10.3
ERROR: No tool found matching GRADLE_4_10_2_HOME
Setting GRADLE_4_10_3_HOME=/home/jenkins/tools/gradle/4.10.3
Not sending mail to unregistered user wangguoz@gmail.com

Mime
View raw message