kafka-dev mailing list archives

Site index · List index
Message view « Date » · « Thread »
Top « Date » · « Thread »
From Apache Jenkins Server <jenk...@builds.apache.org>
Subject Build failed in Jenkins: kafka-trunk-jdk11 #674
Date Wed, 03 Jul 2019 22:38:38 GMT
See <https://builds.apache.org/job/kafka-trunk-jdk11/674/display/redirect?page=changes>

Changes:

[jason] MINOR: Typo correction in server.properties (#7011)

[jason] MINOR: Improve group metadata unknown key version exception message

[jason] MINOR: Fix static membership documentation link in upgrade notes (#7001)

[jason] MINOR: Remove redundant placeholder in log message (#7016)

[jason] MINOR: Streams tutorial refers to code in the wrong directory (#7012)

------------------------------------------
[...truncated 2.55 MB...]
kafka.cluster.PartitionTest > testMakeLeaderUpdatesEpochCache STARTED

kafka.cluster.PartitionTest > testMakeLeaderUpdatesEpochCache PASSED

kafka.cluster.PartitionTest > testUseCheckpointToInitializeHighWatermark STARTED

kafka.cluster.PartitionTest > testUseCheckpointToInitializeHighWatermark PASSED

kafka.cluster.PartitionTest > testMaybeReplaceCurrentWithFutureReplicaDifferentBaseOffsets
STARTED

kafka.cluster.PartitionTest > testMaybeReplaceCurrentWithFutureReplicaDifferentBaseOffsets
PASSED

kafka.cluster.PartitionTest > testFetchOffsetForTimestampEpochValidationForLeader STARTED

kafka.cluster.PartitionTest > testFetchOffsetForTimestampEpochValidationForLeader PASSED

kafka.cluster.PartitionTest > testShouldNotShrinkIsrIfPreviousFetchIsCaughtUp STARTED

kafka.cluster.PartitionTest > testShouldNotShrinkIsrIfPreviousFetchIsCaughtUp PASSED

kafka.cluster.PartitionTest > testGetReplica STARTED

kafka.cluster.PartitionTest > testGetReplica PASSED

kafka.cluster.PartitionTest > testReadRecordEpochValidationForFollower STARTED

kafka.cluster.PartitionTest > testReadRecordEpochValidationForFollower PASSED

kafka.cluster.PartitionTest > testMaybeReplaceCurrentWithFutureReplica STARTED

kafka.cluster.PartitionTest > testMaybeReplaceCurrentWithFutureReplica PASSED

kafka.cluster.PartitionTest > testUpdateFollowerFetchState STARTED

kafka.cluster.PartitionTest > testUpdateFollowerFetchState PASSED

kafka.cluster.ReplicaTest > testCannotIncrementLogStartOffsetPastHighWatermark STARTED

kafka.cluster.ReplicaTest > testCannotIncrementLogStartOffsetPastHighWatermark PASSED

kafka.cluster.ReplicaTest > testSegmentDeletionWithHighWatermarkInitialization STARTED

kafka.cluster.ReplicaTest > testSegmentDeletionWithHighWatermarkInitialization PASSED

kafka.cluster.ReplicaTest > testCannotDeleteSegmentsAtOrAboveHighWatermark STARTED

kafka.cluster.ReplicaTest > testCannotDeleteSegmentsAtOrAboveHighWatermark PASSED

kafka.common.ZkNodeChangeNotificationListenerTest > testProcessNotification STARTED

kafka.common.ZkNodeChangeNotificationListenerTest > testProcessNotification PASSED

kafka.common.ZkNodeChangeNotificationListenerTest > testSwallowsProcessorException STARTED

kafka.common.ZkNodeChangeNotificationListenerTest > testSwallowsProcessorException PASSED

kafka.common.InterBrokerSendThreadTest > shouldCreateClientRequestAndSendWhenNodeIsReady
STARTED

kafka.common.InterBrokerSendThreadTest > shouldCreateClientRequestAndSendWhenNodeIsReady
PASSED

kafka.common.InterBrokerSendThreadTest > testFailingExpiredRequests STARTED

kafka.common.InterBrokerSendThreadTest > testFailingExpiredRequests PASSED

kafka.common.InterBrokerSendThreadTest > shouldCallCompletionHandlerWithDisconnectedResponseWhenNodeNotReady
STARTED

kafka.common.InterBrokerSendThreadTest > shouldCallCompletionHandlerWithDisconnectedResponseWhenNodeNotReady
PASSED

kafka.common.InterBrokerSendThreadTest > shouldNotSendAnythingWhenNoRequests STARTED

kafka.common.InterBrokerSendThreadTest > shouldNotSendAnythingWhenNoRequests PASSED

kafka.tools.ConsoleConsumerTest > shouldLimitReadsToMaxMessageLimit STARTED

kafka.tools.ConsoleConsumerTest > shouldLimitReadsToMaxMessageLimit PASSED

kafka.tools.ConsoleConsumerTest > shouldParseGroupIdFromBeginningGivenTogether STARTED

kafka.tools.ConsoleConsumerTest > shouldParseGroupIdFromBeginningGivenTogether PASSED

kafka.tools.ConsoleConsumerTest > shouldExitOnOffsetWithoutPartition STARTED

kafka.tools.ConsoleConsumerTest > shouldExitOnOffsetWithoutPartition PASSED

kafka.tools.ConsoleConsumerTest > shouldStopWhenOutputCheckErrorFails STARTED

kafka.tools.ConsoleConsumerTest > shouldStopWhenOutputCheckErrorFails PASSED

kafka.tools.ConsoleConsumerTest > shouldExitOnInvalidConfigWithAutoOffsetResetAndConflictingFromBeginning
STARTED

kafka.tools.ConsoleConsumerTest > shouldExitOnInvalidConfigWithAutoOffsetResetAndConflictingFromBeginning
PASSED

kafka.tools.ConsoleConsumerTest > shouldResetUnConsumedOffsetsBeforeExit STARTED

kafka.tools.ConsoleConsumerTest > shouldResetUnConsumedOffsetsBeforeExit PASSED

kafka.tools.ConsoleConsumerTest > shouldParseConfigsFromFile STARTED

kafka.tools.ConsoleConsumerTest > shouldParseConfigsFromFile PASSED

kafka.tools.ConsoleConsumerTest > shouldParseValidConsumerConfigWithAutoOffsetResetLatest
STARTED

kafka.tools.ConsoleConsumerTest > shouldParseValidConsumerConfigWithAutoOffsetResetLatest
PASSED

kafka.tools.ConsoleConsumerTest > groupIdsProvidedInDifferentPlacesMustMatch STARTED

kafka.tools.ConsoleConsumerTest > groupIdsProvidedInDifferentPlacesMustMatch PASSED

kafka.tools.ConsoleConsumerTest > shouldParseValidConsumerConfigWithAutoOffsetResetAndMatchingFromBeginning
STARTED

kafka.tools.ConsoleConsumerTest > shouldParseValidConsumerConfigWithAutoOffsetResetAndMatchingFromBeginning
PASSED

kafka.tools.ConsoleConsumerTest > shouldExitOnGroupIdAndPartitionGivenTogether STARTED

kafka.tools.ConsoleConsumerTest > shouldExitOnGroupIdAndPartitionGivenTogether PASSED

kafka.tools.ConsoleConsumerTest > shouldExitOnUnrecognizedNewConsumerOption STARTED

kafka.tools.ConsoleConsumerTest > shouldExitOnUnrecognizedNewConsumerOption PASSED

kafka.tools.ConsoleConsumerTest > shouldParseValidSimpleConsumerValidConfigWithNumericOffset
STARTED

kafka.tools.ConsoleConsumerTest > shouldParseValidSimpleConsumerValidConfigWithNumericOffset
PASSED

kafka.tools.ConsoleConsumerTest > shouldParseValidConsumerConfigWithAutoOffsetResetEarliest
STARTED

kafka.tools.ConsoleConsumerTest > shouldParseValidConsumerConfigWithAutoOffsetResetEarliest
PASSED

kafka.tools.ConsoleConsumerTest > shouldParseValidSimpleConsumerValidConfigWithStringOffset
STARTED

kafka.tools.ConsoleConsumerTest > shouldParseValidSimpleConsumerValidConfigWithStringOffset
PASSED

kafka.tools.ConsoleConsumerTest > testCustomPropertyShouldBePassedToConfigureMethod STARTED

kafka.tools.ConsoleConsumerTest > testCustomPropertyShouldBePassedToConfigureMethod PASSED

kafka.tools.ConsoleConsumerTest > shouldParseValidConsumerValidConfig STARTED

kafka.tools.ConsoleConsumerTest > shouldParseValidConsumerValidConfig PASSED

kafka.tools.ConsoleConsumerTest > shouldParseValidConsumerConfigWithNoOffsetReset STARTED

kafka.tools.ConsoleConsumerTest > shouldParseValidConsumerConfigWithNoOffsetReset PASSED

kafka.tools.ReplicaVerificationToolTest > testReplicaBufferVerifyChecksum STARTED

kafka.tools.ReplicaVerificationToolTest > testReplicaBufferVerifyChecksum PASSED

kafka.tools.MirrorMakerIntegrationTest > testCommaSeparatedRegex STARTED

kafka.tools.MirrorMakerIntegrationTest > testCommaSeparatedRegex PASSED

kafka.tools.MirrorMakerIntegrationTest > testCommitOffsetsRemoveNonExistentTopics STARTED

kafka.tools.MirrorMakerIntegrationTest > testCommitOffsetsRemoveNonExistentTopics PASSED

kafka.tools.MirrorMakerIntegrationTest > testCommitOffsetsThrowTimeoutException STARTED

kafka.tools.MirrorMakerIntegrationTest > testCommitOffsetsThrowTimeoutException PASSED

kafka.tools.CustomDeserializerTest > checkDeserializerTopicIsNotNull STARTED

kafka.tools.CustomDeserializerTest > checkDeserializerTopicIsNotNull PASSED

kafka.tools.MirrorMakerTest > testDefaultMirrorMakerMessageHandlerWithNoTimestampInSourceMessage
STARTED

kafka.tools.MirrorMakerTest > testDefaultMirrorMakerMessageHandlerWithNoTimestampInSourceMessage
PASSED

kafka.tools.MirrorMakerTest > testDefaultMirrorMakerMessageHandler STARTED

kafka.tools.MirrorMakerTest > testDefaultMirrorMakerMessageHandler PASSED

kafka.tools.MirrorMakerTest > testDefaultMirrorMakerMessageHandlerWithHeaders STARTED

kafka.tools.MirrorMakerTest > testDefaultMirrorMakerMessageHandlerWithHeaders PASSED

kafka.tools.DumpLogSegmentsTest > testPrintDataLog STARTED

kafka.tools.DumpLogSegmentsTest > testPrintDataLog PASSED

kafka.tools.DumpLogSegmentsTest > testDumpIndexMismatches STARTED

kafka.tools.DumpLogSegmentsTest > testDumpIndexMismatches PASSED

kafka.tools.DumpLogSegmentsTest > testDumpTimeIndexErrors STARTED

kafka.tools.DumpLogSegmentsTest > testDumpTimeIndexErrors PASSED

kafka.tools.ConsoleProducerTest > testParseKeyProp STARTED

kafka.tools.ConsoleProducerTest > testParseKeyProp PASSED

kafka.tools.ConsoleProducerTest > testInvalidConfigs STARTED

kafka.tools.ConsoleProducerTest > testInvalidConfigs PASSED

kafka.tools.ConsoleProducerTest > testValidConfigs STARTED

kafka.tools.ConsoleProducerTest > testValidConfigs PASSED

kafka.tools.ConsumerPerformanceTest > testDetailedHeaderMatchBody STARTED

kafka.tools.ConsumerPerformanceTest > testDetailedHeaderMatchBody PASSED

kafka.tools.ConsumerPerformanceTest > testConfigWithUnrecognizedOption STARTED

kafka.tools.ConsumerPerformanceTest > testConfigWithUnrecognizedOption PASSED

kafka.tools.ConsumerPerformanceTest > testConfig STARTED

kafka.tools.ConsumerPerformanceTest > testConfig PASSED

kafka.tools.ConsumerPerformanceTest > testNonDetailedHeaderMatchBody STARTED

kafka.tools.ConsumerPerformanceTest > testNonDetailedHeaderMatchBody PASSED

unit.kafka.utils.ThrottlerTest > testThrottleDesiredRate STARTED

unit.kafka.utils.ThrottlerTest > testThrottleDesiredRate PASSED

2420 tests completed, 2 failed, 2 skipped

> Task :core:test FAILED

FAILURE: Build failed with an exception.

* What went wrong:
Execution failed for task ':core:test'.
> There were failing tests. See the report at: file://<https://builds.apache.org/job/kafka-trunk-jdk11/ws/core/build/reports/tests/test/index.html>

* Try:
Run with --stacktrace option to get the stack trace. Run with --info or --debug option to
get more log output. Run with --scan to get full insights.

* Get more help at https://help.gradle.org

Deprecated Gradle features were used in this build, making it incompatible with Gradle 6.0.
Use '--warning-mode all' to show the individual deprecation warnings.
See https://docs.gradle.org/5.4.1/userguide/command_line_interface.html#sec:command_line_warnings

BUILD FAILED in 2h 5m 38s
178 actionable tasks: 152 executed, 26 up-to-date
Build step 'Execute shell' marked build as failure
Recording test results
ERROR: No tool found matching GRADLE_4_10_2_HOME
Setting GRADLE_4_10_3_HOME=/home/jenkins/tools/gradle/4.10.3
ERROR: No tool found matching GRADLE_4_10_2_HOME
Setting GRADLE_4_10_3_HOME=/home/jenkins/tools/gradle/4.10.3
Not sending mail to unregistered user noreply@github.com
Not sending mail to unregistered user rajinisivaram@googlemail.com

Mime
View raw message