kafka-dev mailing list archives

Site index · List index
Message view « Date » · « Thread »
Top « Date » · « Thread »
From Apache Jenkins Server <jenk...@builds.apache.org>
Subject Build failed in Jenkins: kafka-2.3-jdk8 #61
Date Sat, 13 Jul 2019 00:30:13 GMT
See <https://builds.apache.org/job/kafka-2.3-jdk8/61/display/redirect?page=changes>

Changes:

[rhauch] KAFKA-6605: Fix NPE in Flatten when optional Struct is null (#5705)

[rhauch] KAFKA-7157: Fix handling of nulls in TimestampConverter (#7070)

[matthias] HOT FIX: close RocksDB objects in correct order (#7076)

------------------------------------------
[...truncated 2.65 MB...]
kafka.admin.DescribeConsumerGroupTest > testDescribeExistingGroups PASSED

kafka.admin.DescribeConsumerGroupTest > testDescribeNonOffsetCommitGroup STARTED

kafka.admin.DescribeConsumerGroupTest > testDescribeNonOffsetCommitGroup PASSED

kafka.admin.DescribeConsumerGroupTest > testDescribeNonExistingGroup STARTED

kafka.admin.DescribeConsumerGroupTest > testDescribeNonExistingGroup PASSED

kafka.admin.DescribeConsumerGroupTest > testDescribeStateWithMultiPartitionTopicAndMultipleConsumers
STARTED

kafka.admin.DescribeConsumerGroupTest > testDescribeStateWithMultiPartitionTopicAndMultipleConsumers
PASSED

kafka.admin.DescribeConsumerGroupTest > testDescribeStateOfExistingGroupWithRoundRobinAssignor
STARTED

kafka.admin.DescribeConsumerGroupTest > testDescribeStateOfExistingGroupWithRoundRobinAssignor
PASSED

kafka.admin.DescribeConsumerGroupTest > testDescribeOffsetsOfNonExistingGroup STARTED

kafka.admin.DescribeConsumerGroupTest > testDescribeOffsetsOfNonExistingGroup PASSED

kafka.admin.DescribeConsumerGroupTest > testDescribeExistingGroupWithNoMembers STARTED

kafka.admin.DescribeConsumerGroupTest > testDescribeExistingGroupWithNoMembers PASSED

kafka.admin.DescribeConsumerGroupTest > testDescribeAllExistingGroups STARTED

kafka.admin.DescribeConsumerGroupTest > testDescribeAllExistingGroups PASSED

kafka.admin.DescribeConsumerGroupTest > testDescribeWithConsumersWithoutAssignedPartitions
STARTED

kafka.admin.DescribeConsumerGroupTest > testDescribeWithConsumersWithoutAssignedPartitions
PASSED

kafka.admin.DescribeConsumerGroupTest > testDescribeGroupWithShortInitializationTimeout
STARTED

kafka.admin.DescribeConsumerGroupTest > testDescribeGroupWithShortInitializationTimeout
PASSED

kafka.admin.DescribeConsumerGroupTest > testDescribeOffsetsWithMultiPartitionTopicAndMultipleConsumers
STARTED

kafka.admin.DescribeConsumerGroupTest > testDescribeOffsetsWithMultiPartitionTopicAndMultipleConsumers
PASSED

kafka.admin.DescribeConsumerGroupTest > testDescribeStateOfExistingGroupWithNoMembers STARTED

kafka.admin.DescribeConsumerGroupTest > testDescribeStateOfExistingGroupWithNoMembers PASSED

kafka.admin.BrokerApiVersionsCommandTest > checkBrokerApiVersionCommandOutput STARTED

kafka.admin.BrokerApiVersionsCommandTest > checkBrokerApiVersionCommandOutput PASSED

kafka.admin.ListConsumerGroupTest > testListWithUnrecognizedNewConsumerOption STARTED

kafka.admin.ListConsumerGroupTest > testListWithUnrecognizedNewConsumerOption PASSED

kafka.admin.ListConsumerGroupTest > testListConsumerGroups STARTED

kafka.admin.ListConsumerGroupTest > testListConsumerGroups PASSED

kafka.admin.TimeConversionTests > testDateTimeFormats STARTED

kafka.admin.TimeConversionTests > testDateTimeFormats PASSED

kafka.admin.ReassignPartitionsCommandArgsTest > shouldFailIfBlankArg STARTED

kafka.admin.ReassignPartitionsCommandArgsTest > shouldFailIfBlankArg PASSED

kafka.admin.ReassignPartitionsCommandArgsTest > shouldNotAllowVerifyWithoutReassignmentOption
STARTED

kafka.admin.ReassignPartitionsCommandArgsTest > shouldNotAllowVerifyWithoutReassignmentOption
PASSED

kafka.admin.ReassignPartitionsCommandArgsTest > shouldNotAllowGenerateWithoutBrokersOption
STARTED

kafka.admin.ReassignPartitionsCommandArgsTest > shouldNotAllowGenerateWithoutBrokersOption
PASSED

kafka.admin.ReassignPartitionsCommandArgsTest > shouldNotAllowTopicsOptionWithVerify STARTED

kafka.admin.ReassignPartitionsCommandArgsTest > shouldNotAllowTopicsOptionWithVerify PASSED

kafka.admin.ReassignPartitionsCommandArgsTest > shouldNotAllowGenerateWithThrottleOption
STARTED

kafka.admin.ReassignPartitionsCommandArgsTest > shouldNotAllowGenerateWithThrottleOption
PASSED

kafka.admin.ReassignPartitionsCommandArgsTest > shouldFailIfNoArgs STARTED

kafka.admin.ReassignPartitionsCommandArgsTest > shouldFailIfNoArgs PASSED

kafka.admin.ReassignPartitionsCommandArgsTest > shouldNotAllowExecuteWithoutReassignmentOption
STARTED

kafka.admin.ReassignPartitionsCommandArgsTest > shouldNotAllowExecuteWithoutReassignmentOption
PASSED

kafka.admin.ReassignPartitionsCommandArgsTest > shouldNotAllowBrokersListWithVerifyOption
STARTED

kafka.admin.ReassignPartitionsCommandArgsTest > shouldNotAllowBrokersListWithVerifyOption
PASSED

kafka.admin.ReassignPartitionsCommandArgsTest > shouldCorrectlyParseValidMinimumExecuteOptions
STARTED

kafka.admin.ReassignPartitionsCommandArgsTest > shouldCorrectlyParseValidMinimumExecuteOptions
PASSED

kafka.admin.ReassignPartitionsCommandArgsTest > shouldNotAllowGenerateWithReassignmentOption
STARTED

kafka.admin.ReassignPartitionsCommandArgsTest > shouldNotAllowGenerateWithReassignmentOption
PASSED

kafka.admin.ReassignPartitionsCommandArgsTest > shouldCorrectlyParseValidMinimumGenerateOptions
STARTED

kafka.admin.ReassignPartitionsCommandArgsTest > shouldCorrectlyParseValidMinimumGenerateOptions
PASSED

kafka.admin.ReassignPartitionsCommandArgsTest > shouldNotAllowGenerateWithoutBrokersAndTopicsOptions
STARTED

kafka.admin.ReassignPartitionsCommandArgsTest > shouldNotAllowGenerateWithoutBrokersAndTopicsOptions
PASSED

kafka.admin.ReassignPartitionsCommandArgsTest > shouldNotAllowThrottleWithVerifyOption
STARTED

kafka.admin.ReassignPartitionsCommandArgsTest > shouldNotAllowThrottleWithVerifyOption
PASSED

kafka.admin.ReassignPartitionsCommandArgsTest > shouldUseDefaultsIfEnabled STARTED

kafka.admin.ReassignPartitionsCommandArgsTest > shouldUseDefaultsIfEnabled PASSED

kafka.admin.ReassignPartitionsCommandArgsTest > shouldAllowThrottleOptionOnExecute STARTED

kafka.admin.ReassignPartitionsCommandArgsTest > shouldAllowThrottleOptionOnExecute PASSED

kafka.admin.ReassignPartitionsCommandArgsTest > shouldNotAllowExecuteWithBrokers STARTED

kafka.admin.ReassignPartitionsCommandArgsTest > shouldNotAllowExecuteWithBrokers PASSED

kafka.admin.ReassignPartitionsCommandArgsTest > shouldNotAllowExecuteWithTopicsOption STARTED

kafka.admin.ReassignPartitionsCommandArgsTest > shouldNotAllowExecuteWithTopicsOption PASSED

kafka.admin.ReassignPartitionsCommandArgsTest > shouldCorrectlyParseValidMinimumVerifyOptions
STARTED

kafka.admin.ReassignPartitionsCommandArgsTest > shouldCorrectlyParseValidMinimumVerifyOptions
PASSED

kafka.admin.ReassignPartitionsCommandArgsTest > shouldNotAllowGenerateWithoutTopicsOption
STARTED

kafka.admin.ReassignPartitionsCommandArgsTest > shouldNotAllowGenerateWithoutTopicsOption
PASSED

kafka.admin.DeleteTopicTest > testDeleteTopicWithCleaner STARTED

kafka.admin.DeleteTopicTest > testDeleteTopicWithCleaner PASSED

kafka.admin.DeleteTopicTest > testResumeDeleteTopicOnControllerFailover STARTED

kafka.admin.DeleteTopicTest > testResumeDeleteTopicOnControllerFailover PASSED

kafka.admin.DeleteTopicTest > testResumeDeleteTopicWithRecoveredFollower STARTED

kafka.admin.DeleteTopicTest > testResumeDeleteTopicWithRecoveredFollower PASSED

kafka.admin.DeleteTopicTest > testDeleteTopicAlreadyMarkedAsDeleted STARTED

kafka.admin.DeleteTopicTest > testDeleteTopicAlreadyMarkedAsDeleted PASSED

kafka.admin.DeleteTopicTest > testIncreasePartitionCountDuringDeleteTopic STARTED

kafka.admin.DeleteTopicTest > testIncreasePartitionCountDuringDeleteTopic PASSED

kafka.admin.DeleteTopicTest > testPartitionReassignmentDuringDeleteTopic STARTED

kafka.admin.DeleteTopicTest > testPartitionReassignmentDuringDeleteTopic PASSED

kafka.admin.DeleteTopicTest > testDeleteNonExistingTopic STARTED

kafka.admin.DeleteTopicTest > testDeleteNonExistingTopic PASSED

kafka.admin.DeleteTopicTest > testRecreateTopicAfterDeletion STARTED

kafka.admin.DeleteTopicTest > testRecreateTopicAfterDeletion PASSED

kafka.admin.DeleteTopicTest > testDisableDeleteTopic STARTED

kafka.admin.DeleteTopicTest > testDisableDeleteTopic PASSED

kafka.admin.DeleteTopicTest > testAddPartitionDuringDeleteTopic STARTED

kafka.admin.DeleteTopicTest > testAddPartitionDuringDeleteTopic PASSED

kafka.admin.DeleteTopicTest > testDeleteTopicWithAllAliveReplicas STARTED

kafka.admin.DeleteTopicTest > testDeleteTopicWithAllAliveReplicas PASSED

kafka.admin.DeleteTopicTest > testDeleteTopicDuringAddPartition STARTED

kafka.admin.DeleteTopicTest > testDeleteTopicDuringAddPartition PASSED

kafka.admin.DeleteTopicTest > testDeletingPartiallyDeletedTopic STARTED

kafka.admin.DeleteTopicTest > testDeletingPartiallyDeletedTopic PASSED

kafka.admin.AddPartitionsTest > testReplicaPlacementAllServers STARTED

kafka.admin.AddPartitionsTest > testReplicaPlacementAllServers PASSED

kafka.admin.AddPartitionsTest > testMissingPartition0 STARTED

kafka.admin.AddPartitionsTest > testMissingPartition0 PASSED

kafka.admin.AddPartitionsTest > testWrongReplicaCount STARTED

kafka.admin.AddPartitionsTest > testWrongReplicaCount PASSED

kafka.admin.AddPartitionsTest > testReplicaPlacementPartialServers STARTED

kafka.admin.AddPartitionsTest > testReplicaPlacementPartialServers PASSED

kafka.admin.AddPartitionsTest > testIncrementPartitions STARTED

kafka.admin.AddPartitionsTest > testIncrementPartitions PASSED

kafka.admin.AddPartitionsTest > testManualAssignmentOfReplicas STARTED

kafka.admin.AddPartitionsTest > testManualAssignmentOfReplicas PASSED

> Task :kafka-2.3-jdk8:core:spotbugsMain FAILED
> Task :testScala_2_11 FAILED

FAILURE: Build failed with an exception.

* What went wrong:
Execution failed for task ':kafka-2.3-jdk8:streams:streams-scala:test'.
> There were failing tests. See the report at: file://<https://builds.apache.org/job/kafka-2.3-jdk8/ws/streams/streams-scala/build/reports/tests/test/index.html>

* Try:
Run with --stacktrace option to get the stack trace. Run with --info or --debug option to
get more log output. Run with --scan to get full insights.

* Get more help at https://help.gradle.org

Deprecated Gradle features were used in this build, making it incompatible with Gradle 6.0.
Use '--warning-mode all' to show the individual deprecation warnings.
See https://docs.gradle.org/5.4.1/userguide/command_line_interface.html#sec:command_line_warnings

BUILD FAILED in 2h 43m 12s
141 actionable tasks: 115 executed, 26 up-to-date
Build step 'Execute shell' marked build as failure
[FINDBUGS] Collecting findbugs analysis files...
Setting GRADLE_4_8_1_HOME=/home/jenkins/tools/gradle/4.8.1
[FINDBUGS] Searching for all files in <https://builds.apache.org/job/kafka-2.3-jdk8/ws/>
that match the pattern **/build/reports/findbugs/*.xml
[FINDBUGS] No files found. Configuration error?
Setting GRADLE_4_8_1_HOME=/home/jenkins/tools/gradle/4.8.1
No credentials specified
Setting GRADLE_4_8_1_HOME=/home/jenkins/tools/gradle/4.8.1
<Git Blamer> Using GitBlamer to create author and commit information for all warnings.
<Git Blamer> GIT_COMMIT=5942700a45363170c914f5a450bba0d9b3ca05d8, workspace=<https://builds.apache.org/job/kafka-2.3-jdk8/ws/>
[FINDBUGS] Computing warning deltas based on reference build #59
Recording test results
Setting GRADLE_4_8_1_HOME=/home/jenkins/tools/gradle/4.8.1
Setting GRADLE_4_8_1_HOME=/home/jenkins/tools/gradle/4.8.1
Not sending mail to unregistered user bill@confluent.io

Mime
View raw message