kafka-dev mailing list archives

Site index · List index
Message view « Date » · « Thread »
Top « Date » · « Thread »
From Apache Jenkins Server <jenk...@builds.apache.org>
Subject Build failed in Jenkins: kafka-trunk-jdk11 #675
Date Thu, 04 Jul 2019 06:40:13 GMT
See <https://builds.apache.org/job/kafka-trunk-jdk11/675/display/redirect?page=changes>

Changes:

[github] MINOR: WorkerUtils#topicDescriptions must unwrap exceptions properly

[cmccabe] MINOR: add useConfiguredPartitioner and skipFlush options for

------------------------------------------
[...truncated 6.42 MB...]
org.apache.kafka.connect.runtime.TransformationConfigTest > testEmbeddedConfigValueToKey
STARTED

org.apache.kafka.connect.runtime.TransformationConfigTest > testEmbeddedConfigValueToKey
PASSED

org.apache.kafka.connect.runtime.TransformationConfigTest > testEmbeddedConfigExtractField
STARTED

org.apache.kafka.connect.runtime.TransformationConfigTest > testEmbeddedConfigExtractField
PASSED

org.apache.kafka.connect.runtime.SourceTaskOffsetCommitterTest > testSchedule STARTED

org.apache.kafka.connect.runtime.SourceTaskOffsetCommitterTest > testSchedule PASSED

org.apache.kafka.connect.runtime.SourceTaskOffsetCommitterTest > testClose STARTED

org.apache.kafka.connect.runtime.SourceTaskOffsetCommitterTest > testClose PASSED

org.apache.kafka.connect.runtime.SourceTaskOffsetCommitterTest > testRemove STARTED

org.apache.kafka.connect.runtime.SourceTaskOffsetCommitterTest > testRemove PASSED

org.apache.kafka.connect.runtime.ConnectorConfigTest > unconfiguredTransform STARTED

org.apache.kafka.connect.runtime.ConnectorConfigTest > unconfiguredTransform PASSED

org.apache.kafka.connect.runtime.ConnectorConfigTest > multipleTransformsOneDangling STARTED

org.apache.kafka.connect.runtime.ConnectorConfigTest > multipleTransformsOneDangling PASSED

org.apache.kafka.connect.runtime.ConnectorConfigTest > misconfiguredTransform STARTED

org.apache.kafka.connect.runtime.ConnectorConfigTest > misconfiguredTransform PASSED

org.apache.kafka.connect.runtime.ConnectorConfigTest > noTransforms STARTED

org.apache.kafka.connect.runtime.ConnectorConfigTest > noTransforms PASSED

org.apache.kafka.connect.runtime.ConnectorConfigTest > danglingTransformAlias STARTED

org.apache.kafka.connect.runtime.ConnectorConfigTest > danglingTransformAlias PASSED

org.apache.kafka.connect.runtime.ConnectorConfigTest > emptyConnectorName STARTED

org.apache.kafka.connect.runtime.ConnectorConfigTest > emptyConnectorName PASSED

org.apache.kafka.connect.runtime.ConnectorConfigTest > multipleTransforms STARTED

org.apache.kafka.connect.runtime.ConnectorConfigTest > multipleTransforms PASSED

org.apache.kafka.connect.runtime.ConnectorConfigTest > singleTransform STARTED

org.apache.kafka.connect.runtime.ConnectorConfigTest > singleTransform PASSED

org.apache.kafka.connect.runtime.ConnectorConfigTest > wrongTransformationType STARTED

org.apache.kafka.connect.runtime.ConnectorConfigTest > wrongTransformationType PASSED

org.apache.kafka.connect.runtime.ConnectMetricsTest > testGettingGroupMultipleTimes STARTED

org.apache.kafka.connect.runtime.ConnectMetricsTest > testGettingGroupMultipleTimes PASSED

org.apache.kafka.connect.runtime.ConnectMetricsTest > testCreatingTags STARTED

org.apache.kafka.connect.runtime.ConnectMetricsTest > testCreatingTags PASSED

org.apache.kafka.connect.runtime.ConnectMetricsTest > testMetricGroupIdWithoutTags STARTED

org.apache.kafka.connect.runtime.ConnectMetricsTest > testMetricGroupIdWithoutTags PASSED

org.apache.kafka.connect.runtime.ConnectMetricsTest > testCreatingTagsWithOddNumberOfTags
STARTED

org.apache.kafka.connect.runtime.ConnectMetricsTest > testCreatingTagsWithOddNumberOfTags
PASSED

org.apache.kafka.connect.runtime.ConnectMetricsTest > testGettingGroupWithOddNumberOfTags
STARTED

org.apache.kafka.connect.runtime.ConnectMetricsTest > testGettingGroupWithOddNumberOfTags
PASSED

org.apache.kafka.connect.runtime.ConnectMetricsTest > testMetricGroupIdIdentity STARTED

org.apache.kafka.connect.runtime.ConnectMetricsTest > testMetricGroupIdIdentity PASSED

org.apache.kafka.connect.runtime.ConnectMetricsTest > testRecreateWithoutClose STARTED

org.apache.kafka.connect.runtime.ConnectMetricsTest > testRecreateWithoutClose PASSED

org.apache.kafka.connect.runtime.ConnectMetricsTest > testGettingGroupWithTags STARTED

org.apache.kafka.connect.runtime.ConnectMetricsTest > testGettingGroupWithTags PASSED

org.apache.kafka.connect.runtime.ConnectMetricsTest > testRecreateWithClose STARTED

org.apache.kafka.connect.runtime.ConnectMetricsTest > testRecreateWithClose PASSED

org.apache.kafka.connect.runtime.ConnectMetricsTest > testKafkaMetricsNotNull STARTED

org.apache.kafka.connect.runtime.ConnectMetricsTest > testKafkaMetricsNotNull PASSED

org.apache.kafka.connect.util.TopicAdminTest > shouldNotCreateTopicWhenItAlreadyExists
STARTED

org.apache.kafka.connect.util.TopicAdminTest > shouldNotCreateTopicWhenItAlreadyExists
PASSED

org.apache.kafka.connect.util.TopicAdminTest > returnNullWithTopicAuthorizationFailure
STARTED

org.apache.kafka.connect.util.TopicAdminTest > returnNullWithTopicAuthorizationFailure
PASSED

org.apache.kafka.connect.util.TopicAdminTest > shouldCreateTopicWhenItDoesNotExist STARTED

org.apache.kafka.connect.util.TopicAdminTest > shouldCreateTopicWhenItDoesNotExist PASSED

org.apache.kafka.connect.util.TopicAdminTest > shouldReturnFalseWhenSuppliedNullTopicDescription
STARTED

org.apache.kafka.connect.util.TopicAdminTest > shouldReturnFalseWhenSuppliedNullTopicDescription
PASSED

org.apache.kafka.connect.util.TopicAdminTest > returnNullWithApiVersionMismatch STARTED

org.apache.kafka.connect.util.TopicAdminTest > returnNullWithApiVersionMismatch PASSED

org.apache.kafka.connect.util.TopicAdminTest > shouldCreateOneTopicWhenProvidedMultipleDefinitionsWithSameTopicName
STARTED

org.apache.kafka.connect.util.TopicAdminTest > shouldCreateOneTopicWhenProvidedMultipleDefinitionsWithSameTopicName
PASSED

org.apache.kafka.connect.util.TopicAdminTest > returnNullWithClusterAuthorizationFailure
STARTED

org.apache.kafka.connect.util.TopicAdminTest > returnNullWithClusterAuthorizationFailure
PASSED

org.apache.kafka.connect.util.ShutdownableThreadTest > testGracefulShutdown STARTED

org.apache.kafka.connect.util.ShutdownableThreadTest > testGracefulShutdown PASSED

org.apache.kafka.connect.util.ShutdownableThreadTest > testForcibleShutdown STARTED

org.apache.kafka.connect.util.ShutdownableThreadTest > testForcibleShutdown PASSED

org.apache.kafka.connect.util.LoggingContextTest > shouldCreateConnectorLoggingContext
STARTED

org.apache.kafka.connect.util.LoggingContextTest > shouldCreateConnectorLoggingContext
PASSED

org.apache.kafka.connect.util.LoggingContextTest > shouldCreateTaskLoggingContext STARTED

org.apache.kafka.connect.util.LoggingContextTest > shouldCreateTaskLoggingContext PASSED

org.apache.kafka.connect.util.LoggingContextTest > shouldNotAllowNullConnectorNameForConnectorContext
STARTED

org.apache.kafka.connect.util.LoggingContextTest > shouldNotAllowNullConnectorNameForConnectorContext
PASSED

org.apache.kafka.connect.util.LoggingContextTest > shouldAllowNestedLoggingContexts STARTED

org.apache.kafka.connect.util.LoggingContextTest > shouldAllowNestedLoggingContexts PASSED

org.apache.kafka.connect.util.LoggingContextTest > shouldNotAllowNullTaskIdForTaskContext
STARTED

org.apache.kafka.connect.util.LoggingContextTest > shouldNotAllowNullTaskIdForTaskContext
PASSED

org.apache.kafka.connect.util.LoggingContextTest > shouldCreateAndCloseLoggingContextEvenWithNullContextMap
STARTED

org.apache.kafka.connect.util.LoggingContextTest > shouldCreateAndCloseLoggingContextEvenWithNullContextMap
PASSED

org.apache.kafka.connect.util.LoggingContextTest > shouldNotAllowNullTaskIdForOffsetContext
STARTED

org.apache.kafka.connect.util.LoggingContextTest > shouldNotAllowNullTaskIdForOffsetContext
PASSED

org.apache.kafka.connect.util.LoggingContextTest > shouldCreateOffsetsLoggingContext STARTED

org.apache.kafka.connect.util.LoggingContextTest > shouldCreateOffsetsLoggingContext PASSED

org.apache.kafka.connect.util.TableTest > basicOperations STARTED

org.apache.kafka.connect.util.TableTest > basicOperations PASSED

org.apache.kafka.connect.util.ConnectUtilsTest > testLookupNullKafkaClusterId STARTED

org.apache.kafka.connect.util.ConnectUtilsTest > testLookupNullKafkaClusterId PASSED

org.apache.kafka.connect.util.ConnectUtilsTest > testLookupKafkaClusterId STARTED

org.apache.kafka.connect.util.ConnectUtilsTest > testLookupKafkaClusterId PASSED

org.apache.kafka.connect.util.ConnectUtilsTest > testLookupKafkaClusterIdTimeout STARTED

org.apache.kafka.connect.util.ConnectUtilsTest > testLookupKafkaClusterIdTimeout PASSED

org.apache.kafka.connect.util.KafkaBasedLogTest > testReloadOnStartWithNoNewRecordsPresent
STARTED

org.apache.kafka.connect.util.KafkaBasedLogTest > testReloadOnStartWithNoNewRecordsPresent
PASSED

org.apache.kafka.connect.util.KafkaBasedLogTest > testSendAndReadToEnd STARTED

org.apache.kafka.connect.util.KafkaBasedLogTest > testSendAndReadToEnd PASSED

org.apache.kafka.connect.util.KafkaBasedLogTest > testStartStop STARTED

org.apache.kafka.connect.util.KafkaBasedLogTest > testStartStop PASSED

org.apache.kafka.connect.util.KafkaBasedLogTest > testConsumerError STARTED

org.apache.kafka.connect.util.KafkaBasedLogTest > testConsumerError PASSED

org.apache.kafka.connect.util.KafkaBasedLogTest > testProducerError STARTED

org.apache.kafka.connect.util.KafkaBasedLogTest > testProducerError PASSED

org.apache.kafka.connect.util.KafkaBasedLogTest > testReloadOnStart STARTED

org.apache.kafka.connect.util.KafkaBasedLogTest > testReloadOnStart PASSED

org.apache.kafka.connect.connector.policy.PrincipalConnectorClientConfigOverridePolicyTest
> testPrincipalPlusOtherConfigs STARTED

org.apache.kafka.connect.connector.policy.PrincipalConnectorClientConfigOverridePolicyTest
> testPrincipalPlusOtherConfigs PASSED

org.apache.kafka.connect.connector.policy.PrincipalConnectorClientConfigOverridePolicyTest
> testPrincipalOnly STARTED

org.apache.kafka.connect.connector.policy.PrincipalConnectorClientConfigOverridePolicyTest
> testPrincipalOnly PASSED

org.apache.kafka.connect.connector.policy.NoneConnectorClientConfigOverridePolicyTest >
testNoOverrides STARTED

org.apache.kafka.connect.connector.policy.NoneConnectorClientConfigOverridePolicyTest >
testNoOverrides PASSED

org.apache.kafka.connect.connector.policy.NoneConnectorClientConfigOverridePolicyTest >
testWithOverrides STARTED

org.apache.kafka.connect.connector.policy.NoneConnectorClientConfigOverridePolicyTest >
testWithOverrides PASSED

470 tests completed, 2 failed

> Task :connect:runtime:test FAILED

FAILURE: Build failed with an exception.

* What went wrong:
Execution failed for task ':connect:runtime:test'.
> There were failing tests. See the report at: file://<https://builds.apache.org/job/kafka-trunk-jdk11/ws/connect/runtime/build/reports/tests/test/index.html>

* Try:
Run with --stacktrace option to get the stack trace. Run with --info or --debug option to
get more log output. Run with --scan to get full insights.

* Get more help at https://help.gradle.org

Deprecated Gradle features were used in this build, making it incompatible with Gradle 6.0.
Use '--warning-mode all' to show the individual deprecation warnings.
See https://docs.gradle.org/5.4.1/userguide/command_line_interface.html#sec:command_line_warnings

BUILD FAILED in 2h 59m 51s
178 actionable tasks: 175 executed, 3 up-to-date
Build step 'Execute shell' marked build as failure
Recording test results
ERROR: No tool found matching GRADLE_4_10_2_HOME
Setting GRADLE_4_10_3_HOME=/home/jenkins/tools/gradle/4.10.3
ERROR: No tool found matching GRADLE_4_10_2_HOME
Setting GRADLE_4_10_3_HOME=/home/jenkins/tools/gradle/4.10.3
Not sending mail to unregistered user noreply@github.com
Not sending mail to unregistered user rajinisivaram@googlemail.com

Mime
View raw message