kafka-dev mailing list archives

Site index · List index
Message view « Date » · « Thread »
Top « Date » · « Thread »
From Apache Jenkins Server <jenk...@builds.apache.org>
Subject Build failed in Jenkins: kafka-trunk-jdk8 #3759
Date Sat, 29 Jun 2019 06:48:44 GMT
See <https://builds.apache.org/job/kafka-trunk-jdk8/3759/display/redirect?page=changes>

Changes:

[bbejeck] remove cs (#6950)

------------------------------------------
[...truncated 2.55 MB...]

org.apache.kafka.connect.util.KafkaBasedLogTest > testReloadOnStartWithNoNewRecordsPresent
STARTED

org.apache.kafka.connect.util.KafkaBasedLogTest > testReloadOnStartWithNoNewRecordsPresent
PASSED

org.apache.kafka.connect.util.KafkaBasedLogTest > testProducerError STARTED

org.apache.kafka.connect.util.KafkaBasedLogTest > testProducerError PASSED

org.apache.kafka.connect.util.KafkaBasedLogTest > testStartStop STARTED

org.apache.kafka.connect.util.KafkaBasedLogTest > testStartStop PASSED

org.apache.kafka.connect.converters.FloatConverterTest > testBytesNullToNumber STARTED

org.apache.kafka.connect.converters.FloatConverterTest > testBytesNullToNumber PASSED

org.apache.kafka.connect.converters.FloatConverterTest > testSerializingIncorrectType STARTED

org.apache.kafka.connect.converters.FloatConverterTest > testSerializingIncorrectType PASSED

org.apache.kafka.connect.converters.FloatConverterTest > testDeserializingHeaderWithTooManyBytes
STARTED

org.apache.kafka.connect.converters.FloatConverterTest > testDeserializingHeaderWithTooManyBytes
PASSED

org.apache.kafka.connect.converters.FloatConverterTest > testNullToBytes STARTED

org.apache.kafka.connect.converters.FloatConverterTest > testNullToBytes PASSED

org.apache.kafka.connect.converters.FloatConverterTest > testSerializingIncorrectHeader
STARTED

org.apache.kafka.connect.converters.FloatConverterTest > testSerializingIncorrectHeader
PASSED

org.apache.kafka.connect.converters.FloatConverterTest > testDeserializingDataWithTooManyBytes
STARTED

org.apache.kafka.connect.converters.FloatConverterTest > testDeserializingDataWithTooManyBytes
PASSED

org.apache.kafka.connect.converters.FloatConverterTest > testConvertingSamplesToAndFromBytes
STARTED

org.apache.kafka.connect.converters.FloatConverterTest > testConvertingSamplesToAndFromBytes
PASSED

org.apache.kafka.connect.converters.IntegerConverterTest > testBytesNullToNumber STARTED

org.apache.kafka.connect.converters.IntegerConverterTest > testBytesNullToNumber PASSED

org.apache.kafka.connect.converters.IntegerConverterTest > testSerializingIncorrectType
STARTED

org.apache.kafka.connect.converters.IntegerConverterTest > testSerializingIncorrectType
PASSED

org.apache.kafka.connect.converters.IntegerConverterTest > testDeserializingHeaderWithTooManyBytes
STARTED

org.apache.kafka.connect.converters.IntegerConverterTest > testDeserializingHeaderWithTooManyBytes
PASSED

org.apache.kafka.connect.converters.IntegerConverterTest > testNullToBytes STARTED

org.apache.kafka.connect.converters.IntegerConverterTest > testNullToBytes PASSED

org.apache.kafka.connect.converters.IntegerConverterTest > testSerializingIncorrectHeader
STARTED

org.apache.kafka.connect.converters.IntegerConverterTest > testSerializingIncorrectHeader
PASSED

org.apache.kafka.connect.converters.IntegerConverterTest > testDeserializingDataWithTooManyBytes
STARTED

org.apache.kafka.connect.converters.IntegerConverterTest > testDeserializingDataWithTooManyBytes
PASSED

org.apache.kafka.connect.converters.IntegerConverterTest > testConvertingSamplesToAndFromBytes
STARTED

org.apache.kafka.connect.converters.IntegerConverterTest > testConvertingSamplesToAndFromBytes
PASSED

org.apache.kafka.connect.converters.ByteArrayConverterTest > testFromConnectSchemaless
STARTED

org.apache.kafka.connect.converters.ByteArrayConverterTest > testFromConnectSchemaless
PASSED

org.apache.kafka.connect.converters.ByteArrayConverterTest > testToConnectNull STARTED

org.apache.kafka.connect.converters.ByteArrayConverterTest > testToConnectNull PASSED

org.apache.kafka.connect.converters.ByteArrayConverterTest > testFromConnectBadSchema STARTED

org.apache.kafka.connect.converters.ByteArrayConverterTest > testFromConnectBadSchema PASSED

org.apache.kafka.connect.converters.ByteArrayConverterTest > testFromConnectNull STARTED

org.apache.kafka.connect.converters.ByteArrayConverterTest > testFromConnectNull PASSED

org.apache.kafka.connect.converters.ByteArrayConverterTest > testToConnect STARTED

org.apache.kafka.connect.converters.ByteArrayConverterTest > testToConnect PASSED

org.apache.kafka.connect.converters.ByteArrayConverterTest > testFromConnect STARTED

org.apache.kafka.connect.converters.ByteArrayConverterTest > testFromConnect PASSED

org.apache.kafka.connect.converters.ByteArrayConverterTest > testFromConnectInvalidValue
STARTED

org.apache.kafka.connect.converters.ByteArrayConverterTest > testFromConnectInvalidValue
PASSED

org.apache.kafka.connect.converters.DoubleConverterTest > testBytesNullToNumber STARTED

org.apache.kafka.connect.converters.DoubleConverterTest > testBytesNullToNumber PASSED

org.apache.kafka.connect.converters.DoubleConverterTest > testSerializingIncorrectType
STARTED

org.apache.kafka.connect.converters.DoubleConverterTest > testSerializingIncorrectType
PASSED

org.apache.kafka.connect.converters.DoubleConverterTest > testDeserializingHeaderWithTooManyBytes
STARTED

org.apache.kafka.connect.converters.DoubleConverterTest > testDeserializingHeaderWithTooManyBytes
PASSED

org.apache.kafka.connect.converters.DoubleConverterTest > testNullToBytes STARTED

org.apache.kafka.connect.converters.DoubleConverterTest > testNullToBytes PASSED

org.apache.kafka.connect.converters.DoubleConverterTest > testSerializingIncorrectHeader
STARTED

org.apache.kafka.connect.converters.DoubleConverterTest > testSerializingIncorrectHeader
PASSED

org.apache.kafka.connect.converters.DoubleConverterTest > testDeserializingDataWithTooManyBytes
STARTED

org.apache.kafka.connect.converters.DoubleConverterTest > testDeserializingDataWithTooManyBytes
PASSED

org.apache.kafka.connect.converters.DoubleConverterTest > testConvertingSamplesToAndFromBytes
STARTED

org.apache.kafka.connect.converters.DoubleConverterTest > testConvertingSamplesToAndFromBytes
PASSED

org.apache.kafka.connect.converters.LongConverterTest > testBytesNullToNumber STARTED

org.apache.kafka.connect.converters.LongConverterTest > testBytesNullToNumber PASSED

org.apache.kafka.connect.converters.LongConverterTest > testSerializingIncorrectType STARTED

org.apache.kafka.connect.converters.LongConverterTest > testSerializingIncorrectType PASSED

org.apache.kafka.connect.converters.LongConverterTest > testDeserializingHeaderWithTooManyBytes
STARTED

org.apache.kafka.connect.converters.LongConverterTest > testDeserializingHeaderWithTooManyBytes
PASSED

org.apache.kafka.connect.converters.LongConverterTest > testNullToBytes STARTED

org.apache.kafka.connect.converters.LongConverterTest > testNullToBytes PASSED

org.apache.kafka.connect.converters.LongConverterTest > testSerializingIncorrectHeader
STARTED

org.apache.kafka.connect.converters.LongConverterTest > testSerializingIncorrectHeader
PASSED

org.apache.kafka.connect.converters.LongConverterTest > testDeserializingDataWithTooManyBytes
STARTED

org.apache.kafka.connect.converters.LongConverterTest > testDeserializingDataWithTooManyBytes
PASSED

org.apache.kafka.connect.converters.LongConverterTest > testConvertingSamplesToAndFromBytes
STARTED

org.apache.kafka.connect.converters.LongConverterTest > testConvertingSamplesToAndFromBytes
PASSED

org.apache.kafka.connect.converters.ShortConverterTest > testBytesNullToNumber STARTED

org.apache.kafka.connect.converters.ShortConverterTest > testBytesNullToNumber PASSED

org.apache.kafka.connect.converters.ShortConverterTest > testSerializingIncorrectType STARTED

org.apache.kafka.connect.converters.ShortConverterTest > testSerializingIncorrectType PASSED

org.apache.kafka.connect.converters.ShortConverterTest > testDeserializingHeaderWithTooManyBytes
STARTED

org.apache.kafka.connect.converters.ShortConverterTest > testDeserializingHeaderWithTooManyBytes
PASSED

org.apache.kafka.connect.converters.ShortConverterTest > testNullToBytes STARTED

org.apache.kafka.connect.converters.ShortConverterTest > testNullToBytes PASSED

org.apache.kafka.connect.converters.ShortConverterTest > testSerializingIncorrectHeader
STARTED

org.apache.kafka.connect.converters.ShortConverterTest > testSerializingIncorrectHeader
PASSED

org.apache.kafka.connect.converters.ShortConverterTest > testDeserializingDataWithTooManyBytes
STARTED

org.apache.kafka.connect.converters.ShortConverterTest > testDeserializingDataWithTooManyBytes
PASSED

org.apache.kafka.connect.converters.ShortConverterTest > testConvertingSamplesToAndFromBytes
STARTED

org.apache.kafka.connect.converters.ShortConverterTest > testConvertingSamplesToAndFromBytes
PASSED

org.apache.kafka.connect.connector.policy.NoneConnectorClientConfigOverridePolicyTest >
testNoOverrides STARTED

org.apache.kafka.connect.connector.policy.NoneConnectorClientConfigOverridePolicyTest >
testNoOverrides PASSED

org.apache.kafka.connect.connector.policy.NoneConnectorClientConfigOverridePolicyTest >
testWithOverrides STARTED

org.apache.kafka.connect.connector.policy.NoneConnectorClientConfigOverridePolicyTest >
testWithOverrides PASSED

org.apache.kafka.connect.connector.policy.PrincipalConnectorClientConfigOverridePolicyTest
> testPrincipalPlusOtherConfigs STARTED

org.apache.kafka.connect.connector.policy.PrincipalConnectorClientConfigOverridePolicyTest
> testPrincipalPlusOtherConfigs PASSED

org.apache.kafka.connect.connector.policy.PrincipalConnectorClientConfigOverridePolicyTest
> testPrincipalOnly STARTED

org.apache.kafka.connect.connector.policy.PrincipalConnectorClientConfigOverridePolicyTest
> testPrincipalOnly PASSED

470 tests completed, 1 failed

> Task :connect:runtime:test FAILED

FAILURE: Build failed with an exception.

* What went wrong:
Execution failed for task ':connect:runtime:test'.
> There were failing tests. See the report at: file://<https://builds.apache.org/job/kafka-trunk-jdk8/ws/connect/runtime/build/reports/tests/test/index.html>

* Try:
Run with --stacktrace option to get the stack trace. Run with --info or --debug option to
get more log output. Run with --scan to get full insights.

* Get more help at https://help.gradle.org

Deprecated Gradle features were used in this build, making it incompatible with Gradle 6.0.
Use '--warning-mode all' to show the individual deprecation warnings.
See https://docs.gradle.org/5.4.1/userguide/command_line_interface.html#sec:command_line_warnings

BUILD FAILED in 2h 50m 25s
178 actionable tasks: 152 executed, 26 up-to-date
Build step 'Execute shell' marked build as failure
[FINDBUGS] Collecting findbugs analysis files...
Setting GRADLE_4_8_1_HOME=/home/jenkins/tools/gradle/4.8.1
[FINDBUGS] Searching for all files in <https://builds.apache.org/job/kafka-trunk-jdk8/ws/>
that match the pattern **/build/reports/*bugs/*.xml
[FINDBUGS] Parsing 17 files in <https://builds.apache.org/job/kafka-trunk-jdk8/ws/>
[FINDBUGS] Successfully parsed file <https://builds.apache.org/job/kafka-trunk-jdk8/ws/clients/build/reports/spotbugs/main.xml>
with 0 unique warnings and 0 duplicates.
[FINDBUGS] Successfully parsed file <https://builds.apache.org/job/kafka-trunk-jdk8/ws/connect/api/build/reports/spotbugs/main.xml>
with 0 unique warnings and 0 duplicates.
[FINDBUGS] Successfully parsed file <https://builds.apache.org/job/kafka-trunk-jdk8/ws/connect/basic-auth-extension/build/reports/spotbugs/main.xml>
with 0 unique warnings and 0 duplicates.
[FINDBUGS] Successfully parsed file <https://builds.apache.org/job/kafka-trunk-jdk8/ws/connect/file/build/reports/spotbugs/main.xml>
with 0 unique warnings and 0 duplicates.
[FINDBUGS] Successfully parsed file <https://builds.apache.org/job/kafka-trunk-jdk8/ws/connect/json/build/reports/spotbugs/main.xml>
with 0 unique warnings and 0 duplicates.
[FINDBUGS] Successfully parsed file <https://builds.apache.org/job/kafka-trunk-jdk8/ws/connect/runtime/build/reports/spotbugs/main.xml>
with 0 unique warnings and 0 duplicates.
[FINDBUGS] Successfully parsed file <https://builds.apache.org/job/kafka-trunk-jdk8/ws/connect/transforms/build/reports/spotbugs/main.xml>
with 0 unique warnings and 0 duplicates.
[FINDBUGS] Successfully parsed file <https://builds.apache.org/job/kafka-trunk-jdk8/ws/core/build/reports/spotbugs/main.xml>
with 0 unique warnings and 0 duplicates.
[FINDBUGS] Successfully parsed file <https://builds.apache.org/job/kafka-trunk-jdk8/ws/examples/build/reports/spotbugs/main.xml>
with 0 unique warnings and 0 duplicates.
[FINDBUGS] Successfully parsed file <https://builds.apache.org/job/kafka-trunk-jdk8/ws/generator/build/reports/spotbugs/main.xml>
with 0 unique warnings and 0 duplicates.
[FINDBUGS] Successfully parsed file <https://builds.apache.org/job/kafka-trunk-jdk8/ws/jmh-benchmarks/build/reports/spotbugs/main.xml>
with 0 unique warnings and 0 duplicates.
[FINDBUGS] Successfully parsed file <https://builds.apache.org/job/kafka-trunk-jdk8/ws/log4j-appender/build/reports/spotbugs/main.xml>
with 0 unique warnings and 0 duplicates.
[FINDBUGS] Successfully parsed file <https://builds.apache.org/job/kafka-trunk-jdk8/ws/streams/build/reports/spotbugs/main.xml>
with 0 unique warnings and 0 duplicates.
[FINDBUGS] Successfully parsed file <https://builds.apache.org/job/kafka-trunk-jdk8/ws/streams/examples/build/reports/spotbugs/main.xml>
with 0 unique warnings and 0 duplicates.
[FINDBUGS] Successfully parsed file <https://builds.apache.org/job/kafka-trunk-jdk8/ws/streams/streams-scala/build/reports/spotbugs/main.xml>
with 0 unique warnings and 0 duplicates.
[FINDBUGS] Successfully parsed file <https://builds.apache.org/job/kafka-trunk-jdk8/ws/streams/test-utils/build/reports/spotbugs/main.xml>
with 0 unique warnings and 0 duplicates.
[FINDBUGS] Successfully parsed file <https://builds.apache.org/job/kafka-trunk-jdk8/ws/tools/build/reports/spotbugs/main.xml>
with 0 unique warnings and 0 duplicates.
Setting GRADLE_4_8_1_HOME=/home/jenkins/tools/gradle/4.8.1
No credentials specified
Setting GRADLE_4_8_1_HOME=/home/jenkins/tools/gradle/4.8.1
<Git Blamer> Using GitBlamer to create author and commit information for all warnings.
<Git Blamer> GIT_COMMIT=b4e20495fa442a4312f946f518541a04fc6efcc9, workspace=<https://builds.apache.org/job/kafka-trunk-jdk8/ws/>
[FINDBUGS] Computing warning deltas based on reference build #3758
Recording test results
Setting GRADLE_4_8_1_HOME=/home/jenkins/tools/gradle/4.8.1
Setting GRADLE_4_8_1_HOME=/home/jenkins/tools/gradle/4.8.1

Mime
View raw message