kafka-dev mailing list archives

Site index · List index
Message view « Date » · « Thread »
Top « Date » · « Thread »
From Apache Jenkins Server <jenk...@builds.apache.org>
Subject Build failed in Jenkins: kafka-trunk-jdk8 #3622
Date Sat, 11 May 2019 13:19:52 GMT
See <https://builds.apache.org/job/kafka-trunk-jdk8/3622/display/redirect?page=changes>

Changes:

[github] MINOR: Align KTableAgg and KTableReduce (#6712)

------------------------------------------
[...truncated 2.02 MB...]
kafka.api.AuthorizerIntegrationTest > testListOffsetsWithNoTopicAccess STARTED

kafka.api.AuthorizerIntegrationTest > testListOffsetsWithNoTopicAccess PASSED

kafka.api.AuthorizerIntegrationTest > testDeleteGroupApiWithDeleteGroupAcl STARTED

kafka.api.AuthorizerIntegrationTest > testDeleteGroupApiWithDeleteGroupAcl PASSED

kafka.api.AuthorizerIntegrationTest > testDeleteRecordsWithWildCardAuth STARTED

kafka.api.AuthorizerIntegrationTest > testDeleteRecordsWithWildCardAuth PASSED

kafka.api.AuthorizerIntegrationTest > testFetchFollowerRequest STARTED

kafka.api.AuthorizerIntegrationTest > testFetchFollowerRequest PASSED

kafka.api.AuthorizerIntegrationTest > testIdempotentProducerNoIdempotentWriteAclInProduce
STARTED

kafka.api.AuthorizerIntegrationTest > testIdempotentProducerNoIdempotentWriteAclInProduce
PASSED

kafka.api.AuthorizerIntegrationTest > testCreatePermissionOnTopicToReadFromNonExistentTopic
STARTED

kafka.api.AuthorizerIntegrationTest > testCreatePermissionOnTopicToReadFromNonExistentTopic
PASSED

kafka.api.AuthorizerIntegrationTest > testPatternSubscriptionMatchingInternalTopicWithDescribeOnlyPermission
STARTED

kafka.api.AuthorizerIntegrationTest > testPatternSubscriptionMatchingInternalTopicWithDescribeOnlyPermission
PASSED

kafka.api.AuthorizerIntegrationTest > testSimpleConsumeWithOffsetLookupAndNoGroupAccess
STARTED

kafka.api.AuthorizerIntegrationTest > testSimpleConsumeWithOffsetLookupAndNoGroupAccess
PASSED

kafka.api.AuthorizerIntegrationTest > testDeleteTopicsWithWildCardAuth STARTED

kafka.api.AuthorizerIntegrationTest > testDeleteTopicsWithWildCardAuth PASSED

kafka.api.AuthorizerIntegrationTest > testConsumeWithTopicDescribe STARTED

kafka.api.AuthorizerIntegrationTest > testConsumeWithTopicDescribe PASSED

kafka.api.AuthorizerIntegrationTest > shouldThrowTransactionalIdAuthorizationExceptionWhenNoTransactionAccessDuringSend
STARTED

kafka.api.AuthorizerIntegrationTest > shouldThrowTransactionalIdAuthorizationExceptionWhenNoTransactionAccessDuringSend
PASSED

kafka.api.AuthorizerIntegrationTest > testOffsetFetchWithNoTopicAccess STARTED

kafka.api.AuthorizerIntegrationTest > testOffsetFetchWithNoTopicAccess PASSED

kafka.api.AuthorizerIntegrationTest > testCreatePermissionOnTopicToWriteToNonExistentTopic
STARTED

kafka.api.AuthorizerIntegrationTest > testCreatePermissionOnTopicToWriteToNonExistentTopic
PASSED

kafka.api.AuthorizerIntegrationTest > testCommitWithNoTopicAccess STARTED

kafka.api.AuthorizerIntegrationTest > testCommitWithNoTopicAccess PASSED

kafka.api.AuthorizerIntegrationTest > testMetadataWithNoTopicAccess STARTED

kafka.api.AuthorizerIntegrationTest > testMetadataWithNoTopicAccess PASSED

kafka.api.AuthorizerIntegrationTest > testProduceWithNoTopicAccess STARTED

kafka.api.AuthorizerIntegrationTest > testProduceWithNoTopicAccess PASSED

kafka.api.AuthorizerIntegrationTest > testProduceWithTopicWrite STARTED

kafka.api.AuthorizerIntegrationTest > testProduceWithTopicWrite PASSED

kafka.api.AuthorizerIntegrationTest > testCreatePartitionsWithWildCardAuth STARTED

kafka.api.AuthorizerIntegrationTest > testCreatePartitionsWithWildCardAuth PASSED

kafka.api.AuthorizerIntegrationTest > testUnauthorizedDeleteTopicsWithoutDescribe STARTED

kafka.api.AuthorizerIntegrationTest > testUnauthorizedDeleteTopicsWithoutDescribe PASSED

kafka.api.AuthorizerIntegrationTest > testDescribeGroupApiWithGroupDescribe STARTED

kafka.api.AuthorizerIntegrationTest > testDescribeGroupApiWithGroupDescribe PASSED

kafka.api.AuthorizerIntegrationTest > testAuthorizationWithTopicNotExisting STARTED

kafka.api.AuthorizerIntegrationTest > testAuthorizationWithTopicNotExisting PASSED

kafka.api.AuthorizerIntegrationTest > testListOffsetsWithTopicDescribe STARTED

kafka.api.AuthorizerIntegrationTest > testListOffsetsWithTopicDescribe PASSED

kafka.api.AuthorizerIntegrationTest > testListGroupApiWithAndWithoutListGroupAcls STARTED

kafka.api.AuthorizerIntegrationTest > testListGroupApiWithAndWithoutListGroupAcls PASSED

kafka.api.AuthorizerIntegrationTest > testCreatePermissionMetadataRequestAutoCreate STARTED

kafka.api.AuthorizerIntegrationTest > testCreatePermissionMetadataRequestAutoCreate PASSED

kafka.api.AuthorizerIntegrationTest > testDeleteGroupApiWithNoDeleteGroupAcl2 STARTED

kafka.api.AuthorizerIntegrationTest > testDeleteGroupApiWithNoDeleteGroupAcl2 PASSED

kafka.api.AuthorizerIntegrationTest > testConsumeWithTopicAndGroupRead STARTED

kafka.api.AuthorizerIntegrationTest > testConsumeWithTopicAndGroupRead PASSED

kafka.api.AuthorizerIntegrationTest > testPatternSubscriptionNotMatchingInternalTopic STARTED

kafka.api.AuthorizerIntegrationTest > testPatternSubscriptionNotMatchingInternalTopic PASSED

kafka.api.AuthorizerIntegrationTest > testFetchAllOffsetsTopicAuthorization STARTED

kafka.api.AuthorizerIntegrationTest > testFetchAllOffsetsTopicAuthorization PASSED

kafka.api.AuthorizerIntegrationTest > shouldSendSuccessfullyWhenIdempotentAndHasCorrectACL
STARTED

kafka.api.AuthorizerIntegrationTest > shouldSendSuccessfullyWhenIdempotentAndHasCorrectACL
PASSED

kafka.api.AuthorizerIntegrationTest > testConsumeWithTopicWrite STARTED

kafka.api.AuthorizerIntegrationTest > testConsumeWithTopicWrite PASSED

kafka.api.AuthorizerIntegrationTest > testOffsetsForLeaderEpochClusterPermission STARTED

kafka.api.AuthorizerIntegrationTest > testOffsetsForLeaderEpochClusterPermission PASSED

kafka.api.AuthorizerIntegrationTest > testTransactionalProducerTopicAuthorizationExceptionInSendCallback
STARTED

kafka.api.AuthorizerIntegrationTest > testTransactionalProducerTopicAuthorizationExceptionInSendCallback
PASSED

kafka.api.AuthorizerIntegrationTest > testTransactionalProducerInitTransactionsNoWriteTransactionalIdAcl
STARTED

kafka.api.AuthorizerIntegrationTest > testTransactionalProducerInitTransactionsNoWriteTransactionalIdAcl
PASSED

kafka.api.AuthorizerIntegrationTest > testOffsetFetchWithNoGroupAccess STARTED

kafka.api.AuthorizerIntegrationTest > testOffsetFetchWithNoGroupAccess PASSED

kafka.api.AuthorizerIntegrationTest > testCommitWithNoAccess STARTED

kafka.api.AuthorizerIntegrationTest > testCommitWithNoAccess PASSED

kafka.api.AuthorizerIntegrationTest > testUnauthorizedCreatePartitions STARTED

kafka.api.AuthorizerIntegrationTest > testUnauthorizedCreatePartitions PASSED

kafka.api.AuthorizerIntegrationTest > testConsumeWithoutTopicDescribeAccess STARTED

kafka.api.AuthorizerIntegrationTest > testConsumeWithoutTopicDescribeAccess PASSED

kafka.api.AuthorizerIntegrationTest > shouldThrowTransactionalIdAuthorizationExceptionWhenNoTransactionAccessOnEndTransaction
STARTED

kafka.api.AuthorizerIntegrationTest > shouldThrowTransactionalIdAuthorizationExceptionWhenNoTransactionAccessOnEndTransaction
PASSED

kafka.api.AuthorizerIntegrationTest > shouldThrowTransactionalIdAuthorizationExceptionWhenNoTransactionAccessOnSendOffsetsToTxn
STARTED

kafka.api.AuthorizerIntegrationTest > shouldThrowTransactionalIdAuthorizationExceptionWhenNoTransactionAccessOnSendOffsetsToTxn
PASSED

kafka.api.AuthorizerIntegrationTest > testCommitWithNoGroupAccess STARTED

kafka.api.AuthorizerIntegrationTest > testCommitWithNoGroupAccess PASSED

kafka.api.AuthorizerIntegrationTest > testTransactionalProducerInitTransactionsNoDescribeTransactionalIdAcl
STARTED

kafka.api.AuthorizerIntegrationTest > testTransactionalProducerInitTransactionsNoDescribeTransactionalIdAcl
PASSED

kafka.api.AuthorizerIntegrationTest > testUnauthorizedDeleteRecordsWithDescribe STARTED

kafka.api.AuthorizerIntegrationTest > testUnauthorizedDeleteRecordsWithDescribe PASSED

kafka.api.AuthorizerIntegrationTest > testCreateTopicAuthorizationWithClusterCreate STARTED

kafka.api.AuthorizerIntegrationTest > testCreateTopicAuthorizationWithClusterCreate PASSED

kafka.api.AuthorizerIntegrationTest > testOffsetFetchWithTopicAndGroupRead STARTED

kafka.api.AuthorizerIntegrationTest > testOffsetFetchWithTopicAndGroupRead PASSED

kafka.api.AuthorizerIntegrationTest > testCommitWithTopicDescribe STARTED

kafka.api.AuthorizerIntegrationTest > testCommitWithTopicDescribe PASSED

kafka.api.AuthorizerIntegrationTest > testAuthorizationWithTopicExisting STARTED
FATAL: command execution failed
java.io.EOFException
	at java.io.ObjectInputStream$PeekInputStream.readFully(ObjectInputStream.java:2681)
	at java.io.ObjectInputStream$BlockDataInputStream.readShort(ObjectInputStream.java:3156)
	at java.io.ObjectInputStream.readStreamHeader(ObjectInputStream.java:862)
	at java.io.ObjectInputStream.<init>(ObjectInputStream.java:358)
	at hudson.remoting.ObjectInputStreamEx.<init>(ObjectInputStreamEx.java:49)
	at hudson.remoting.Command.readFrom(Command.java:140)
	at hudson.remoting.Command.readFrom(Command.java:126)
	at hudson.remoting.AbstractSynchronousByteArrayCommandTransport.read(AbstractSynchronousByteArrayCommandTransport.java:36)
	at hudson.remoting.SynchronousCommandTransport$ReaderThread.run(SynchronousCommandTransport.java:63)
Caused: java.io.IOException: Unexpected termination of the channel
	at hudson.remoting.SynchronousCommandTransport$ReaderThread.run(SynchronousCommandTransport.java:77)
Caused: java.io.IOException: Backing channel 'ubuntu-eu2' is disconnected.
	at hudson.remoting.RemoteInvocationHandler.channelOrFail(RemoteInvocationHandler.java:214)
	at hudson.remoting.RemoteInvocationHandler.invoke(RemoteInvocationHandler.java:283)
	at com.sun.proxy.$Proxy138.isAlive(Unknown Source)
	at hudson.Launcher$RemoteLauncher$ProcImpl.isAlive(Launcher.java:1144)
	at hudson.Launcher$RemoteLauncher$ProcImpl.join(Launcher.java:1136)
	at hudson.tasks.CommandInterpreter.join(CommandInterpreter.java:155)
	at hudson.tasks.CommandInterpreter.perform(CommandInterpreter.java:109)
	at hudson.tasks.CommandInterpreter.perform(CommandInterpreter.java:66)
	at hudson.tasks.BuildStepMonitor$1.perform(BuildStepMonitor.java:20)
	at hudson.model.AbstractBuild$AbstractBuildExecution.perform(AbstractBuild.java:744)
	at hudson.model.Build$BuildExecution.build(Build.java:206)
	at hudson.model.Build$BuildExecution.doRun(Build.java:163)
	at hudson.model.AbstractBuild$AbstractBuildExecution.run(AbstractBuild.java:504)
	at hudson.model.Run.execute(Run.java:1810)
	at hudson.model.FreeStyleBuild.run(FreeStyleBuild.java:43)
	at hudson.model.ResourceController.execute(ResourceController.java:97)
	at hudson.model.Executor.run(Executor.java:429)
FATAL: Unable to delete script file /tmp/jenkins4020928684202156360.sh
java.io.EOFException
	at java.io.ObjectInputStream$PeekInputStream.readFully(ObjectInputStream.java:2681)
	at java.io.ObjectInputStream$BlockDataInputStream.readShort(ObjectInputStream.java:3156)
	at java.io.ObjectInputStream.readStreamHeader(ObjectInputStream.java:862)
	at java.io.ObjectInputStream.<init>(ObjectInputStream.java:358)
	at hudson.remoting.ObjectInputStreamEx.<init>(ObjectInputStreamEx.java:49)
	at hudson.remoting.Command.readFrom(Command.java:140)
	at hudson.remoting.Command.readFrom(Command.java:126)
	at hudson.remoting.AbstractSynchronousByteArrayCommandTransport.read(AbstractSynchronousByteArrayCommandTransport.java:36)
	at hudson.remoting.SynchronousCommandTransport$ReaderThread.run(SynchronousCommandTransport.java:63)
Caused: java.io.IOException: Unexpected termination of the channel
	at hudson.remoting.SynchronousCommandTransport$ReaderThread.run(SynchronousCommandTransport.java:77)
Caused: hudson.remoting.ChannelClosedException: Channel "unknown": Remote call on ubuntu-eu2
failed. The channel is closing down or has closed down
	at hudson.remoting.Channel.call(Channel.java:948)
	at hudson.FilePath.act(FilePath.java:1072)
	at hudson.FilePath.act(FilePath.java:1061)
	at hudson.FilePath.delete(FilePath.java:1565)
	at hudson.tasks.CommandInterpreter.perform(CommandInterpreter.java:123)
	at hudson.tasks.CommandInterpreter.perform(CommandInterpreter.java:66)
	at hudson.tasks.BuildStepMonitor$1.perform(BuildStepMonitor.java:20)
	at hudson.model.AbstractBuild$AbstractBuildExecution.perform(AbstractBuild.java:744)
	at hudson.model.Build$BuildExecution.build(Build.java:206)
	at hudson.model.Build$BuildExecution.doRun(Build.java:163)
	at hudson.model.AbstractBuild$AbstractBuildExecution.run(AbstractBuild.java:504)
	at hudson.model.Run.execute(Run.java:1810)
	at hudson.model.FreeStyleBuild.run(FreeStyleBuild.java:43)
	at hudson.model.ResourceController.execute(ResourceController.java:97)
	at hudson.model.Executor.run(Executor.java:429)
Build step 'Execute shell' marked build as failure
ERROR: Step ‘[Deprecated] Publish FindBugs analysis results’ failed: no workspace for
kafka-trunk-jdk8 #3622
ERROR: Step ‘Publish JUnit test result report’ failed: no workspace for kafka-trunk-jdk8
#3622
ERROR: ubuntu-eu2 is offline; cannot locate JDK 1.8 (latest)
ERROR: ubuntu-eu2 is offline; cannot locate Gradle 4.8.1
Setting GRADLE_4_8_1_HOME=/home/jenkins/tools/gradle/4.8.1
Not sending mail to unregistered user noreply@github.com
Not sending mail to unregistered user cshapi@gmail.com

Mime
View raw message