kafka-dev mailing list archives

Site index · List index
Message view « Date » · « Thread »
Top « Date » · « Thread »
From Apache Jenkins Server <jenk...@builds.apache.org>
Subject Build failed in Jenkins: kafka-2.2-jdk8 #86
Date Thu, 18 Apr 2019 23:47:24 GMT
See <https://builds.apache.org/job/kafka-2.2-jdk8/86/display/redirect?page=changes>

Changes:

[jason] KAFKA-7866; Ensure no duplicate offsets after txn index append failure

------------------------------------------
[...truncated 2.51 MB...]

kafka.controller.PartitionLeaderElectionAlgorithmsTest > testControlledShutdownPartitionLeaderElectionAllIsrSimultaneouslyShutdown
PASSED

kafka.controller.PartitionLeaderElectionAlgorithmsTest > testOfflinePartitionLeaderElectionLastIsrOfflineUncleanLeaderElectionEnabled
STARTED

kafka.controller.PartitionLeaderElectionAlgorithmsTest > testOfflinePartitionLeaderElectionLastIsrOfflineUncleanLeaderElectionEnabled
PASSED

kafka.controller.PartitionLeaderElectionAlgorithmsTest > testPreferredReplicaPartitionLeaderElectionPreferredReplicaNotInIsrNotLive
STARTED

kafka.controller.PartitionLeaderElectionAlgorithmsTest > testPreferredReplicaPartitionLeaderElectionPreferredReplicaNotInIsrNotLive
PASSED

kafka.controller.PartitionLeaderElectionAlgorithmsTest > testOfflinePartitionLeaderElectionLastIsrOfflineUncleanLeaderElectionDisabled
STARTED

kafka.controller.PartitionLeaderElectionAlgorithmsTest > testOfflinePartitionLeaderElectionLastIsrOfflineUncleanLeaderElectionDisabled
PASSED

kafka.controller.PartitionStateMachineTest > testNonexistentPartitionToNewPartitionTransition
STARTED

kafka.controller.PartitionStateMachineTest > testNonexistentPartitionToNewPartitionTransition
PASSED

kafka.controller.PartitionStateMachineTest > testNewPartitionToOnlinePartitionTransitionErrorCodeFromCreateStates
STARTED

kafka.controller.PartitionStateMachineTest > testNewPartitionToOnlinePartitionTransitionErrorCodeFromCreateStates
PASSED

kafka.controller.PartitionStateMachineTest > testOfflinePartitionToNonexistentPartitionTransition
STARTED

kafka.controller.PartitionStateMachineTest > testOfflinePartitionToNonexistentPartitionTransition
PASSED

kafka.controller.PartitionStateMachineTest > testOnlinePartitionToOfflineTransition STARTED

kafka.controller.PartitionStateMachineTest > testOnlinePartitionToOfflineTransition PASSED

kafka.controller.PartitionStateMachineTest > testNewPartitionToOfflinePartitionTransition
STARTED

kafka.controller.PartitionStateMachineTest > testNewPartitionToOfflinePartitionTransition
PASSED

kafka.controller.PartitionStateMachineTest > testUpdatingOfflinePartitionsCount STARTED

kafka.controller.PartitionStateMachineTest > testUpdatingOfflinePartitionsCount PASSED

kafka.controller.PartitionStateMachineTest > testInvalidNonexistentPartitionToOnlinePartitionTransition
STARTED

kafka.controller.PartitionStateMachineTest > testInvalidNonexistentPartitionToOnlinePartitionTransition
PASSED

kafka.controller.PartitionStateMachineTest > testInvalidNonexistentPartitionToOfflinePartitionTransition
STARTED

kafka.controller.PartitionStateMachineTest > testInvalidNonexistentPartitionToOfflinePartitionTransition
PASSED

kafka.controller.PartitionStateMachineTest > testOnlinePartitionToOnlineTransition STARTED

kafka.controller.PartitionStateMachineTest > testOnlinePartitionToOnlineTransition PASSED

kafka.controller.PartitionStateMachineTest > testNewPartitionToOnlinePartitionTransitionZkUtilsExceptionFromCreateStates
STARTED

kafka.controller.PartitionStateMachineTest > testNewPartitionToOnlinePartitionTransitionZkUtilsExceptionFromCreateStates
PASSED

kafka.controller.PartitionStateMachineTest > testInvalidNewPartitionToNonexistentPartitionTransition
STARTED

kafka.controller.PartitionStateMachineTest > testInvalidNewPartitionToNonexistentPartitionTransition
PASSED

kafka.controller.PartitionStateMachineTest > testNewPartitionToOnlinePartitionTransition
STARTED

kafka.controller.PartitionStateMachineTest > testNewPartitionToOnlinePartitionTransition
PASSED

kafka.controller.PartitionStateMachineTest > testInvalidOnlinePartitionToNewPartitionTransition
STARTED

kafka.controller.PartitionStateMachineTest > testInvalidOnlinePartitionToNewPartitionTransition
PASSED

kafka.controller.PartitionStateMachineTest > testUpdatingOfflinePartitionsCountDuringTopicDeletion
STARTED

kafka.controller.PartitionStateMachineTest > testUpdatingOfflinePartitionsCountDuringTopicDeletion
PASSED

kafka.controller.PartitionStateMachineTest > testOfflinePartitionToOnlinePartitionTransitionErrorCodeFromStateLookup
STARTED

kafka.controller.PartitionStateMachineTest > testOfflinePartitionToOnlinePartitionTransitionErrorCodeFromStateLookup
PASSED

kafka.controller.PartitionStateMachineTest > testOnlinePartitionToOnlineTransitionForControlledShutdown
STARTED

kafka.controller.PartitionStateMachineTest > testOnlinePartitionToOnlineTransitionForControlledShutdown
PASSED

kafka.controller.PartitionStateMachineTest > testOfflinePartitionToOnlinePartitionTransitionZkUtilsExceptionFromStateLookup
STARTED

kafka.controller.PartitionStateMachineTest > testOfflinePartitionToOnlinePartitionTransitionZkUtilsExceptionFromStateLookup
PASSED

kafka.controller.PartitionStateMachineTest > testNoOfflinePartitionsChangeForTopicsBeingDeleted
STARTED

kafka.controller.PartitionStateMachineTest > testNoOfflinePartitionsChangeForTopicsBeingDeleted
PASSED

kafka.controller.PartitionStateMachineTest > testInvalidOnlinePartitionToNonexistentPartitionTransition
STARTED

kafka.controller.PartitionStateMachineTest > testInvalidOnlinePartitionToNonexistentPartitionTransition
PASSED

kafka.controller.PartitionStateMachineTest > testInvalidOfflinePartitionToNewPartitionTransition
STARTED

kafka.controller.PartitionStateMachineTest > testInvalidOfflinePartitionToNewPartitionTransition
PASSED

kafka.controller.PartitionStateMachineTest > testOfflinePartitionToOnlinePartitionTransition
STARTED

kafka.controller.PartitionStateMachineTest > testOfflinePartitionToOnlinePartitionTransition
PASSED

kafka.controller.ControllerFailoverTest > testHandleIllegalStateException STARTED

kafka.controller.ControllerFailoverTest > testHandleIllegalStateException PASSED

kafka.controller.ControllerIntegrationTest > testControllerDetectsBouncedBrokers STARTED

kafka.controller.ControllerIntegrationTest > testControllerDetectsBouncedBrokers PASSED

kafka.controller.ControllerIntegrationTest > testControlledShutdown STARTED

kafka.controller.ControllerIntegrationTest > testControlledShutdown PASSED

kafka.controller.ControllerIntegrationTest > testPartitionReassignmentWithOfflineReplicaHaltingProgress
STARTED

kafka.controller.ControllerIntegrationTest > testPartitionReassignmentWithOfflineReplicaHaltingProgress
PASSED

kafka.controller.ControllerIntegrationTest > testControllerEpochPersistsWhenAllBrokersDown
STARTED

kafka.controller.ControllerIntegrationTest > testControllerEpochPersistsWhenAllBrokersDown
PASSED

kafka.controller.ControllerIntegrationTest > testTopicCreationWithOfflineReplica STARTED

kafka.controller.ControllerIntegrationTest > testTopicCreationWithOfflineReplica PASSED

kafka.controller.ControllerIntegrationTest > testPartitionReassignmentResumesAfterReplicaComesOnline
STARTED

kafka.controller.ControllerIntegrationTest > testPartitionReassignmentResumesAfterReplicaComesOnline
PASSED

kafka.controller.ControllerIntegrationTest > testLeaderAndIsrWhenEntireIsrOfflineAndUncleanLeaderElectionDisabled
STARTED

kafka.controller.ControllerIntegrationTest > testLeaderAndIsrWhenEntireIsrOfflineAndUncleanLeaderElectionDisabled
PASSED

kafka.controller.ControllerIntegrationTest > testTopicPartitionExpansionWithOfflineReplica
STARTED

kafka.controller.ControllerIntegrationTest > testTopicPartitionExpansionWithOfflineReplica
PASSED

kafka.controller.ControllerIntegrationTest > testPreferredReplicaLeaderElectionWithOfflinePreferredReplica
STARTED

kafka.controller.ControllerIntegrationTest > testPreferredReplicaLeaderElectionWithOfflinePreferredReplica
PASSED

kafka.controller.ControllerIntegrationTest > testMetadataPropagationOnControlPlane STARTED

kafka.controller.ControllerIntegrationTest > testMetadataPropagationOnControlPlane PASSED

kafka.controller.ControllerIntegrationTest > testAutoPreferredReplicaLeaderElection STARTED

kafka.controller.ControllerIntegrationTest > testAutoPreferredReplicaLeaderElection PASSED

kafka.controller.ControllerIntegrationTest > testTopicCreation STARTED

kafka.controller.ControllerIntegrationTest > testTopicCreation PASSED

kafka.controller.ControllerIntegrationTest > testControllerMoveOnTopicDeletion STARTED

kafka.controller.ControllerIntegrationTest > testControllerMoveOnTopicDeletion PASSED

kafka.controller.ControllerIntegrationTest > testPartitionReassignment STARTED

kafka.controller.ControllerIntegrationTest > testPartitionReassignment PASSED

kafka.controller.ControllerIntegrationTest > testTopicPartitionExpansion STARTED

kafka.controller.ControllerIntegrationTest > testTopicPartitionExpansion PASSED

kafka.controller.ControllerIntegrationTest > testControllerMoveIncrementsControllerEpoch
STARTED

kafka.controller.ControllerIntegrationTest > testControllerMoveIncrementsControllerEpoch
PASSED

kafka.controller.ControllerIntegrationTest > testLeaderAndIsrWhenEntireIsrOfflineAndUncleanLeaderElectionEnabled
STARTED

kafka.controller.ControllerIntegrationTest > testLeaderAndIsrWhenEntireIsrOfflineAndUncleanLeaderElectionEnabled
PASSED

kafka.controller.ControllerIntegrationTest > testControllerMoveOnPartitionReassignment
STARTED

kafka.controller.ControllerIntegrationTest > testControllerMoveOnPartitionReassignment
PASSED

kafka.controller.ControllerIntegrationTest > testControllerMoveOnTopicCreation STARTED

kafka.controller.ControllerIntegrationTest > testControllerMoveOnTopicCreation PASSED

kafka.controller.ControllerIntegrationTest > testControllerRejectControlledShutdownRequestWithStaleBrokerEpoch
STARTED

kafka.controller.ControllerIntegrationTest > testControllerRejectControlledShutdownRequestWithStaleBrokerEpoch
PASSED

kafka.controller.ControllerIntegrationTest > testBackToBackPreferredReplicaLeaderElections
STARTED

kafka.controller.ControllerIntegrationTest > testBackToBackPreferredReplicaLeaderElections
PASSED

kafka.controller.ControllerIntegrationTest > testEmptyCluster STARTED

kafka.controller.ControllerIntegrationTest > testEmptyCluster PASSED

kafka.controller.ControllerIntegrationTest > testControllerMoveOnPreferredReplicaElection
STARTED

kafka.controller.ControllerIntegrationTest > testControllerMoveOnPreferredReplicaElection
PASSED

kafka.controller.ControllerIntegrationTest > testPreferredReplicaLeaderElection STARTED

kafka.controller.ControllerIntegrationTest > testPreferredReplicaLeaderElection PASSED

kafka.controller.ControllerIntegrationTest > testMetadataPropagationOnBrokerChange STARTED

kafka.controller.ControllerIntegrationTest > testMetadataPropagationOnBrokerChange PASSED

kafka.controller.ControllerEventManagerTest > testEventThatThrowsException STARTED

kafka.controller.ControllerEventManagerTest > testEventThatThrowsException PASSED

kafka.controller.ControllerEventManagerTest > testSuccessfulEvent STARTED

kafka.controller.ControllerEventManagerTest > testSuccessfulEvent PASSED

unit.kafka.utils.ThrottlerTest > testThrottleDesiredRate STARTED

unit.kafka.utils.ThrottlerTest > testThrottleDesiredRate PASSED

> Task :testScala_2_11 FAILED

FAILURE: Build failed with an exception.

* What went wrong:
Execution failed for task ':kafka-2.2-jdk8:core:spotbugsMain'.
> A failure occurred while executing com.github.spotbugs.internal.spotbugs.SpotBugsRunner
   > SpotBugs rule violations were found. See the report at: file://<https://builds.apache.org/job/kafka-2.2-jdk8/ws/core/build/reports/spotbugs/main.xml>

* Try:
Run with --stacktrace option to get the stack trace. Run with --info or --debug option to
get more log output. Run with --scan to get full insights.

* Get more help at https://help.gradle.org

Deprecated Gradle features were used in this build, making it incompatible with Gradle 6.0.
Use '--warning-mode all' to show the individual deprecation warnings.
See https://docs.gradle.org/5.1.1/userguide/command_line_interface.html#sec:command_line_warnings

BUILD FAILED in 2h 29m 43s
139 actionable tasks: 114 executed, 25 up-to-date
Build step 'Execute shell' marked build as failure
[FINDBUGS] Collecting findbugs analysis files...
Setting GRADLE_4_8_1_HOME=/home/jenkins/tools/gradle/4.8.1
[FINDBUGS] Searching for all files in <https://builds.apache.org/job/kafka-2.2-jdk8/ws/>
that match the pattern **/build/reports/findbugs/*.xml
[FINDBUGS] No files found. Configuration error?
Setting GRADLE_4_8_1_HOME=/home/jenkins/tools/gradle/4.8.1
No credentials specified
Setting GRADLE_4_8_1_HOME=/home/jenkins/tools/gradle/4.8.1
<Git Blamer> Using GitBlamer to create author and commit information for all warnings.
<Git Blamer> GIT_COMMIT=0bad0a4acbe626ca12305f475009065f97a7b8a4, workspace=<https://builds.apache.org/job/kafka-2.2-jdk8/ws/>
[FINDBUGS] Computing warning deltas based on reference build #85
Recording test results
Setting GRADLE_4_8_1_HOME=/home/jenkins/tools/gradle/4.8.1
Setting GRADLE_4_8_1_HOME=/home/jenkins/tools/gradle/4.8.1

Mime
View raw message