kafka-dev mailing list archives

Site index · List index
Message view « Date » · « Thread »
Top « Date » · « Thread »
From Apache Jenkins Server <jenk...@builds.apache.org>
Subject Build failed in Jenkins: kafka-2.1-jdk8 #128
Date Fri, 15 Feb 2019 13:06:42 GMT
See <https://builds.apache.org/job/kafka-2.1-jdk8/128/display/redirect?page=changes>

Changes:

[cmccabe] Bump version to 2.1.1

[cmccabe] Update versions to 2.1.2-SNAPSHOT

------------------------------------------
[...truncated 1.06 MB...]
org.apache.kafka.connect.runtime.rest.resources.ConnectorsResourceTest > testListConnectorsNotLeader
PASSED

org.apache.kafka.connect.runtime.rest.resources.ConnectorsResourceTest > testListConnectorsNotSynced
STARTED

org.apache.kafka.connect.runtime.rest.resources.ConnectorsResourceTest > testListConnectorsNotSynced
PASSED

org.apache.kafka.connect.runtime.rest.resources.ConnectorsResourceTest > testCreateConnectorNotLeader
STARTED

org.apache.kafka.connect.runtime.rest.resources.ConnectorsResourceTest > testCreateConnectorNotLeader
PASSED

org.apache.kafka.connect.runtime.rest.resources.ConnectorsResourceTest > testCreateConnectorExists
STARTED

org.apache.kafka.connect.runtime.rest.resources.ConnectorsResourceTest > testCreateConnectorExists
PASSED

org.apache.kafka.connect.runtime.rest.resources.ConnectorsResourceTest > testCreateConnectorNameTrimWhitespaces
STARTED

org.apache.kafka.connect.runtime.rest.resources.ConnectorsResourceTest > testCreateConnectorNameTrimWhitespaces
PASSED

org.apache.kafka.connect.runtime.rest.resources.ConnectorsResourceTest > testCreateConnectorNameAllWhitespaces
STARTED

org.apache.kafka.connect.runtime.rest.resources.ConnectorsResourceTest > testCreateConnectorNameAllWhitespaces
PASSED

org.apache.kafka.connect.runtime.rest.resources.ConnectorsResourceTest > testCreateConnectorNoName
STARTED

org.apache.kafka.connect.runtime.rest.resources.ConnectorsResourceTest > testCreateConnectorNoName
PASSED

org.apache.kafka.connect.runtime.rest.resources.ConnectorsResourceTest > testDeleteConnector
STARTED

org.apache.kafka.connect.runtime.rest.resources.ConnectorsResourceTest > testDeleteConnector
PASSED

org.apache.kafka.connect.runtime.rest.resources.ConnectorsResourceTest > testDeleteConnectorNotLeader
STARTED

org.apache.kafka.connect.runtime.rest.resources.ConnectorsResourceTest > testDeleteConnectorNotLeader
PASSED

org.apache.kafka.connect.runtime.rest.resources.ConnectorsResourceTest > testDeleteConnectorNotFound
STARTED

org.apache.kafka.connect.runtime.rest.resources.ConnectorsResourceTest > testDeleteConnectorNotFound
PASSED

org.apache.kafka.connect.runtime.rest.resources.ConnectorsResourceTest > testGetConnector
STARTED

org.apache.kafka.connect.runtime.rest.resources.ConnectorsResourceTest > testGetConnector
PASSED

org.apache.kafka.connect.runtime.rest.resources.ConnectorsResourceTest > testCreateConnector
STARTED

org.apache.kafka.connect.runtime.rest.resources.ConnectorsResourceTest > testCreateConnector
PASSED

org.apache.kafka.connect.runtime.rest.resources.RootResourceTest > testRootGet STARTED

org.apache.kafka.connect.runtime.rest.resources.RootResourceTest > testRootGet PASSED

org.apache.kafka.connect.runtime.isolation.DelegatingClassLoaderTest > testWhiteListedManifestResources
STARTED

org.apache.kafka.connect.runtime.isolation.DelegatingClassLoaderTest > testWhiteListedManifestResources
PASSED

org.apache.kafka.connect.runtime.isolation.DelegatingClassLoaderTest > testOtherResources
STARTED

org.apache.kafka.connect.runtime.isolation.DelegatingClassLoaderTest > testOtherResources
PASSED

org.apache.kafka.connect.runtime.isolation.PluginDescTest > testPluginDescWithNullVersion
STARTED

org.apache.kafka.connect.runtime.isolation.PluginDescTest > testPluginDescWithNullVersion
PASSED

org.apache.kafka.connect.runtime.isolation.PluginDescTest > testPluginDescComparison STARTED

org.apache.kafka.connect.runtime.isolation.PluginDescTest > testPluginDescComparison PASSED

org.apache.kafka.connect.runtime.isolation.PluginDescTest > testRegularPluginDesc STARTED

org.apache.kafka.connect.runtime.isolation.PluginDescTest > testRegularPluginDesc PASSED

org.apache.kafka.connect.runtime.isolation.PluginDescTest > testPluginDescEquality STARTED

org.apache.kafka.connect.runtime.isolation.PluginDescTest > testPluginDescEquality PASSED

org.apache.kafka.connect.runtime.isolation.PluginDescTest > testPluginDescWithSystemClassLoader
STARTED

org.apache.kafka.connect.runtime.isolation.PluginDescTest > testPluginDescWithSystemClassLoader
PASSED

org.apache.kafka.connect.runtime.isolation.PluginsTest > shouldInstantiateAndConfigureConnectRestExtension
STARTED

org.apache.kafka.connect.runtime.isolation.PluginsTest > shouldInstantiateAndConfigureConnectRestExtension
PASSED

org.apache.kafka.connect.runtime.isolation.PluginsTest > shouldInstantiateAndConfigureConverters
STARTED

org.apache.kafka.connect.runtime.isolation.PluginsTest > shouldInstantiateAndConfigureConverters
PASSED

org.apache.kafka.connect.runtime.isolation.PluginsTest > shouldInstantiateAndConfigureInternalConverters
STARTED

org.apache.kafka.connect.runtime.isolation.PluginsTest > shouldInstantiateAndConfigureInternalConverters
PASSED

org.apache.kafka.connect.runtime.isolation.PluginsTest > shouldInstantiateAndConfigureDefaultHeaderConverter
STARTED

org.apache.kafka.connect.runtime.isolation.PluginsTest > shouldInstantiateAndConfigureDefaultHeaderConverter
PASSED

org.apache.kafka.connect.runtime.isolation.PluginsTest > shouldInstantiateAndConfigureExplicitlySetHeaderConverterWithCurrentClassLoader
STARTED

org.apache.kafka.connect.runtime.isolation.PluginsTest > shouldInstantiateAndConfigureExplicitlySetHeaderConverterWithCurrentClassLoader
PASSED

org.apache.kafka.connect.runtime.isolation.PluginUtilsTest > testPluginUrlsWithRelativeSymlinkForwards
STARTED

org.apache.kafka.connect.runtime.isolation.PluginUtilsTest > testPluginUrlsWithRelativeSymlinkForwards
PASSED

org.apache.kafka.connect.runtime.isolation.PluginUtilsTest > testOrderOfPluginUrlsWithJars
STARTED

org.apache.kafka.connect.runtime.isolation.PluginUtilsTest > testOrderOfPluginUrlsWithJars
PASSED

org.apache.kafka.connect.runtime.isolation.PluginUtilsTest > testPluginUrlsWithClasses
STARTED

org.apache.kafka.connect.runtime.isolation.PluginUtilsTest > testPluginUrlsWithClasses
PASSED

org.apache.kafka.connect.runtime.isolation.PluginUtilsTest > testConnectFrameworkClasses
STARTED

org.apache.kafka.connect.runtime.isolation.PluginUtilsTest > testConnectFrameworkClasses
PASSED

org.apache.kafka.connect.runtime.isolation.PluginUtilsTest > testThirdPartyClasses STARTED

org.apache.kafka.connect.runtime.isolation.PluginUtilsTest > testThirdPartyClasses PASSED

org.apache.kafka.connect.runtime.isolation.PluginUtilsTest > testClientConfigProvider STARTED

org.apache.kafka.connect.runtime.isolation.PluginUtilsTest > testClientConfigProvider PASSED

org.apache.kafka.connect.runtime.isolation.PluginUtilsTest > testAllowedConnectFrameworkClasses
STARTED

org.apache.kafka.connect.runtime.isolation.PluginUtilsTest > testAllowedConnectFrameworkClasses
PASSED

org.apache.kafka.connect.runtime.isolation.PluginUtilsTest > testJavaLibraryClasses STARTED

org.apache.kafka.connect.runtime.isolation.PluginUtilsTest > testJavaLibraryClasses PASSED

org.apache.kafka.connect.runtime.isolation.PluginUtilsTest > testEmptyPluginUrls STARTED

org.apache.kafka.connect.runtime.isolation.PluginUtilsTest > testEmptyPluginUrls PASSED

org.apache.kafka.connect.runtime.isolation.PluginUtilsTest > testPluginUrlsWithJars STARTED

org.apache.kafka.connect.runtime.isolation.PluginUtilsTest > testPluginUrlsWithJars PASSED

org.apache.kafka.connect.runtime.isolation.PluginUtilsTest > testPluginUrlsWithZips STARTED

org.apache.kafka.connect.runtime.isolation.PluginUtilsTest > testPluginUrlsWithZips PASSED

org.apache.kafka.connect.runtime.isolation.PluginUtilsTest > testPluginUrlsWithRelativeSymlinkBackwards
STARTED

org.apache.kafka.connect.runtime.isolation.PluginUtilsTest > testPluginUrlsWithRelativeSymlinkBackwards
PASSED

org.apache.kafka.connect.runtime.isolation.PluginUtilsTest > testPluginUrlsWithAbsoluteSymlink
STARTED

org.apache.kafka.connect.runtime.isolation.PluginUtilsTest > testPluginUrlsWithAbsoluteSymlink
PASSED

org.apache.kafka.connect.runtime.isolation.PluginUtilsTest > testEmptyStructurePluginUrls
STARTED

org.apache.kafka.connect.runtime.isolation.PluginUtilsTest > testEmptyStructurePluginUrls
PASSED

org.apache.kafka.connect.runtime.WorkerSinkTaskTest > testStartPaused STARTED

org.apache.kafka.connect.runtime.WorkerSinkTaskTest > testStartPaused PASSED

org.apache.kafka.connect.runtime.WorkerSinkTaskTest > testPause STARTED

org.apache.kafka.connect.runtime.WorkerSinkTaskTest > testPause PASSED

org.apache.kafka.connect.runtime.WorkerSinkTaskTest > testMetricsGroup STARTED

org.apache.kafka.connect.runtime.WorkerSinkTaskTest > testMetricsGroup PASSED

org.apache.kafka.connect.runtime.WorkerSinkTaskTest > testTopicsRegex STARTED

org.apache.kafka.connect.runtime.WorkerSinkTaskTest > testTopicsRegex PASSED

org.apache.kafka.connect.runtime.WorkerSinkTaskTest > testCommitWithOutOfOrderCallback
STARTED

org.apache.kafka.connect.runtime.WorkerSinkTaskTest > testCommitWithOutOfOrderCallback
PASSED

org.apache.kafka.connect.runtime.WorkerSinkTaskTest > testPollRedelivery STARTED

org.apache.kafka.connect.runtime.WorkerSinkTaskTest > testPollRedelivery PASSED

org.apache.kafka.connect.runtime.WorkerSinkTaskTest > testErrorInRebalancePartitionAssignment
STARTED

org.apache.kafka.connect.runtime.WorkerSinkTaskTest > testErrorInRebalancePartitionAssignment
PASSED

org.apache.kafka.connect.runtime.WorkerSinkTaskTest > testDeliveryWithMutatingTransform
STARTED

org.apache.kafka.connect.runtime.WorkerSinkTaskTest > testDeliveryWithMutatingTransform
PASSED

org.apache.kafka.connect.runtime.WorkerSinkTaskTest > testMissingTimestampPropagation STARTED

org.apache.kafka.connect.runtime.WorkerSinkTaskTest > testMissingTimestampPropagation PASSED

org.apache.kafka.connect.runtime.WorkerSinkTaskTest > testTimestampPropagation STARTED

org.apache.kafka.connect.runtime.WorkerSinkTaskTest > testTimestampPropagation PASSED

org.apache.kafka.connect.runtime.WorkerSinkTaskTest > testPreCommit STARTED

org.apache.kafka.connect.runtime.WorkerSinkTaskTest > testPreCommit PASSED

org.apache.kafka.connect.runtime.WorkerSinkTaskTest > testIgnoredCommit STARTED

org.apache.kafka.connect.runtime.WorkerSinkTaskTest > testIgnoredCommit PASSED

org.apache.kafka.connect.runtime.WorkerSinkTaskTest > testLongRunningCommitWithoutTimeout
STARTED

org.apache.kafka.connect.runtime.WorkerSinkTaskTest > testLongRunningCommitWithoutTimeout
PASSED

org.apache.kafka.connect.runtime.WorkerSinkTaskTest > testWakeupInCommitSyncCausesRetry
STARTED

org.apache.kafka.connect.runtime.WorkerSinkTaskTest > testWakeupInCommitSyncCausesRetry
PASSED

org.apache.kafka.connect.runtime.WorkerSinkTaskTest > testRequestCommit STARTED

org.apache.kafka.connect.runtime.WorkerSinkTaskTest > testRequestCommit PASSED

org.apache.kafka.connect.runtime.WorkerSinkTaskTest > testErrorInRebalancePartitionRevocation
STARTED

org.apache.kafka.connect.runtime.WorkerSinkTaskTest > testErrorInRebalancePartitionRevocation
PASSED

380 tests completed, 1 failed

> Task :connect:runtime:test FAILED

FAILURE: Build failed with an exception.

* What went wrong:
Execution failed for task ':connect:runtime:test'.
> There were failing tests. See the report at: file://<https://builds.apache.org/job/kafka-2.1-jdk8/ws/connect/runtime/build/reports/tests/test/index.html>

* Try:
Run with --stacktrace option to get the stack trace. Run with --info or --debug option to
get more log output. Run with --scan to get full insights.

* Get more help at https://help.gradle.org

BUILD FAILED in 3h 52m 3s
127 actionable tasks: 99 executed, 28 up-to-date
Build step 'Execute shell' marked build as failure
[FINDBUGS] Collecting findbugs analysis files...
Setting GRADLE_4_8_1_HOME=/home/jenkins/tools/gradle/4.8.1
[FINDBUGS] Searching for all files in <https://builds.apache.org/job/kafka-2.1-jdk8/ws/>
that match the pattern **/build/reports/findbugs/*.xml
[FINDBUGS] No files found. Configuration error?
Setting GRADLE_4_8_1_HOME=/home/jenkins/tools/gradle/4.8.1
Setting GRADLE_4_8_1_HOME=/home/jenkins/tools/gradle/4.8.1
<Git Blamer> Using GitBlamer to create author and commit information for all warnings.
<Git Blamer> GIT_COMMIT=9729a34f5050d6365ab0493bb7356a8757e97818, workspace=<https://builds.apache.org/job/kafka-2.1-jdk8/ws/>
[FINDBUGS] Computing warning deltas based on reference build #123
Recording test results
Setting GRADLE_4_8_1_HOME=/home/jenkins/tools/gradle/4.8.1
Setting GRADLE_4_8_1_HOME=/home/jenkins/tools/gradle/4.8.1
Not sending mail to unregistered user wangguoz@gmail.com

Mime
View raw message