kafka-dev mailing list archives

Site index · List index
Message view « Date » · « Thread »
Top « Date » · « Thread »
From Apache Jenkins Server <jenk...@builds.apache.org>
Subject Build failed in Jenkins: kafka-2.0-jdk8 #228
Date Thu, 21 Feb 2019 01:21:11 GMT
See <https://builds.apache.org/job/kafka-2.0-jdk8/228/display/redirect?page=changes>

Changes:

[github] MINOR: Add check all topics created check streams broker bounce test

------------------------------------------
[...truncated 436.02 KB...]
kafka.server.ClientQuotaManagerTest > testUserQuotaParsing STARTED

kafka.server.ClientQuotaManagerTest > testUserQuotaParsing PASSED

kafka.server.ClientQuotaManagerTest > testClientIdQuotaParsing STARTED

kafka.server.ClientQuotaManagerTest > testClientIdQuotaParsing PASSED

kafka.server.ClientQuotaManagerTest > testQuotaViolation STARTED

kafka.server.ClientQuotaManagerTest > testQuotaViolation PASSED

kafka.server.ClientQuotaManagerTest > testRequestPercentageQuotaViolation STARTED

kafka.server.ClientQuotaManagerTest > testRequestPercentageQuotaViolation PASSED

kafka.server.ClientQuotaManagerTest > testQuotaConfigPrecedence STARTED

kafka.server.ClientQuotaManagerTest > testQuotaConfigPrecedence PASSED

kafka.server.ClientQuotaManagerTest > testExpireQuotaSensors STARTED

kafka.server.ClientQuotaManagerTest > testExpireQuotaSensors PASSED

kafka.server.ClientQuotaManagerTest > testClientIdNotSanitized STARTED

kafka.server.ClientQuotaManagerTest > testClientIdNotSanitized PASSED

kafka.server.ClientQuotaManagerTest > testExpireThrottleTimeSensor STARTED

kafka.server.ClientQuotaManagerTest > testExpireThrottleTimeSensor PASSED

kafka.server.ClientQuotaManagerTest > testUserClientIdQuotaParsing STARTED

kafka.server.ClientQuotaManagerTest > testUserClientIdQuotaParsing PASSED

kafka.server.ClientQuotaManagerTest > testUserClientQuotaParsingIdWithDefaultClientIdQuota
STARTED

kafka.server.ClientQuotaManagerTest > testUserClientQuotaParsingIdWithDefaultClientIdQuota
PASSED

kafka.server.ReplicaManagerQuotasTest > shouldGetBothMessagesIfQuotasAllow STARTED

kafka.server.ReplicaManagerQuotasTest > shouldGetBothMessagesIfQuotasAllow PASSED

kafka.server.ReplicaManagerQuotasTest > testCompleteInDelayedFetchWithReplicaThrottling
STARTED

kafka.server.ReplicaManagerQuotasTest > testCompleteInDelayedFetchWithReplicaThrottling
PASSED

kafka.server.ReplicaManagerQuotasTest > shouldExcludeSubsequentThrottledPartitions STARTED

kafka.server.ReplicaManagerQuotasTest > shouldExcludeSubsequentThrottledPartitions PASSED

kafka.server.ReplicaManagerQuotasTest > shouldGetNoMessagesIfQuotasExceededOnSubsequentPartitions
STARTED

kafka.server.ReplicaManagerQuotasTest > shouldGetNoMessagesIfQuotasExceededOnSubsequentPartitions
PASSED

kafka.server.ReplicaManagerQuotasTest > shouldIncludeInSyncThrottledReplicas STARTED

kafka.server.ReplicaManagerQuotasTest > shouldIncludeInSyncThrottledReplicas PASSED

kafka.server.DynamicBrokerConfigTest > testPasswordConfigEncryption STARTED

kafka.server.DynamicBrokerConfigTest > testPasswordConfigEncryption PASSED

kafka.server.DynamicBrokerConfigTest > testSecurityConfigs STARTED

kafka.server.DynamicBrokerConfigTest > testSecurityConfigs PASSED

kafka.server.DynamicBrokerConfigTest > testSynonyms STARTED

kafka.server.DynamicBrokerConfigTest > testSynonyms PASSED

kafka.server.DynamicBrokerConfigTest > testDynamicConfigInitializationWithoutConfigsInZK
STARTED

kafka.server.DynamicBrokerConfigTest > testDynamicConfigInitializationWithoutConfigsInZK
PASSED

kafka.server.DynamicBrokerConfigTest > testConfigUpdateWithSomeInvalidConfigs STARTED

kafka.server.DynamicBrokerConfigTest > testConfigUpdateWithSomeInvalidConfigs PASSED

kafka.server.DynamicBrokerConfigTest > testDynamicListenerConfig STARTED

kafka.server.DynamicBrokerConfigTest > testDynamicListenerConfig PASSED

kafka.server.DynamicBrokerConfigTest > testReconfigurableValidation STARTED

kafka.server.DynamicBrokerConfigTest > testReconfigurableValidation PASSED

kafka.server.DynamicBrokerConfigTest > testConfigUpdate STARTED

kafka.server.DynamicBrokerConfigTest > testConfigUpdate PASSED

kafka.server.DynamicBrokerConfigTest > testPasswordConfigEncoderSecretChange STARTED

kafka.server.DynamicBrokerConfigTest > testPasswordConfigEncoderSecretChange PASSED

kafka.server.DynamicBrokerConfigTest > testConfigUpdateWithReconfigurableValidationFailure
STARTED

kafka.server.DynamicBrokerConfigTest > testConfigUpdateWithReconfigurableValidationFailure
PASSED

kafka.server.ThrottledChannelExpirationTest > testThrottledChannelDelay STARTED

kafka.server.ThrottledChannelExpirationTest > testThrottledChannelDelay PASSED

kafka.server.ThrottledChannelExpirationTest > testCallbackInvocationAfterExpiration STARTED

kafka.server.ThrottledChannelExpirationTest > testCallbackInvocationAfterExpiration PASSED

kafka.server.SaslApiVersionsRequestTest > testApiVersionsRequestWithUnsupportedVersion
STARTED

kafka.server.SaslApiVersionsRequestTest > testApiVersionsRequestWithUnsupportedVersion
PASSED

kafka.server.SaslApiVersionsRequestTest > testApiVersionsRequestBeforeSaslHandshakeRequest
STARTED

kafka.server.SaslApiVersionsRequestTest > testApiVersionsRequestBeforeSaslHandshakeRequest
PASSED

kafka.server.SaslApiVersionsRequestTest > testApiVersionsRequestAfterSaslHandshakeRequest
STARTED

kafka.server.SaslApiVersionsRequestTest > testApiVersionsRequestAfterSaslHandshakeRequest
PASSED

kafka.server.HighwatermarkPersistenceTest > testHighWatermarkPersistenceMultiplePartitions
STARTED

kafka.server.HighwatermarkPersistenceTest > testHighWatermarkPersistenceMultiplePartitions
PASSED

kafka.server.HighwatermarkPersistenceTest > testHighWatermarkPersistenceSinglePartition
STARTED

kafka.server.HighwatermarkPersistenceTest > testHighWatermarkPersistenceSinglePartition
PASSED

kafka.server.DescribeLogDirsRequestTest > testDescribeLogDirsRequest STARTED

kafka.server.DescribeLogDirsRequestTest > testDescribeLogDirsRequest PASSED

kafka.server.DelegationTokenRequestsTest > testDelegationTokenRequests STARTED

kafka.server.DelegationTokenRequestsTest > testDelegationTokenRequests PASSED

kafka.server.ServerGenerateBrokerIdTest > testBrokerMetadataOnIdCollision STARTED

kafka.server.ServerGenerateBrokerIdTest > testBrokerMetadataOnIdCollision PASSED

kafka.server.ServerGenerateBrokerIdTest > testAutoGenerateBrokerId STARTED

kafka.server.ServerGenerateBrokerIdTest > testAutoGenerateBrokerId PASSED

kafka.server.ServerGenerateBrokerIdTest > testMultipleLogDirsMetaProps STARTED

kafka.server.ServerGenerateBrokerIdTest > testMultipleLogDirsMetaProps PASSED

kafka.server.ServerGenerateBrokerIdTest > testDisableGeneratedBrokerId STARTED

kafka.server.ServerGenerateBrokerIdTest > testDisableGeneratedBrokerId PASSED

kafka.server.ServerGenerateBrokerIdTest > testUserConfigAndGeneratedBrokerId STARTED

kafka.server.ServerGenerateBrokerIdTest > testUserConfigAndGeneratedBrokerId PASSED

kafka.server.ServerGenerateBrokerIdTest > testConsistentBrokerIdFromUserConfigAndMetaProps
STARTED

kafka.server.ServerGenerateBrokerIdTest > testConsistentBrokerIdFromUserConfigAndMetaProps
PASSED

kafka.server.KafkaServerTest > testAlreadyRegisteredAdvertisedListeners STARTED

kafka.server.KafkaServerTest > testAlreadyRegisteredAdvertisedListeners PASSED

kafka.integration.MetricsDuringTopicCreationDeletionTest > testMetricsDuringTopicCreateDelete
STARTED

kafka.integration.MetricsDuringTopicCreationDeletionTest > testMetricsDuringTopicCreateDelete
PASSED

kafka.integration.UncleanLeaderElectionTest > testUncleanLeaderElectionEnabled STARTED

kafka.integration.UncleanLeaderElectionTest > testUncleanLeaderElectionEnabled PASSED

kafka.integration.UncleanLeaderElectionTest > testCleanLeaderElectionDisabledByTopicOverride
STARTED

kafka.integration.UncleanLeaderElectionTest > testCleanLeaderElectionDisabledByTopicOverride
SKIPPED

kafka.integration.UncleanLeaderElectionTest > testUncleanLeaderElectionDisabled STARTED

kafka.integration.UncleanLeaderElectionTest > testUncleanLeaderElectionDisabled SKIPPED

kafka.integration.UncleanLeaderElectionTest > testUncleanLeaderElectionInvalidTopicOverride
STARTED

kafka.integration.UncleanLeaderElectionTest > testUncleanLeaderElectionInvalidTopicOverride
PASSED

kafka.integration.UncleanLeaderElectionTest > testUncleanLeaderElectionEnabledByTopicOverride
STARTED

kafka.integration.UncleanLeaderElectionTest > testUncleanLeaderElectionEnabledByTopicOverride
PASSED

kafka.integration.MinIsrConfigTest > testDefaultKafkaConfig STARTED

kafka.integration.MinIsrConfigTest > testDefaultKafkaConfig PASSED

kafka.KafkaTest > testGetKafkaConfigFromArgsWrongSetValue STARTED

kafka.KafkaTest > testGetKafkaConfigFromArgsWrongSetValue PASSED

kafka.KafkaTest > testKafkaSslPasswords STARTED

kafka.KafkaTest > testKafkaSslPasswords PASSED

kafka.KafkaTest > testGetKafkaConfigFromArgs STARTED

kafka.KafkaTest > testGetKafkaConfigFromArgs PASSED

kafka.KafkaTest > testGetKafkaConfigFromArgsNonArgsAtTheEnd STARTED

kafka.KafkaTest > testGetKafkaConfigFromArgsNonArgsAtTheEnd PASSED

kafka.KafkaTest > testGetKafkaConfigFromArgsNonArgsOnly STARTED

kafka.KafkaTest > testGetKafkaConfigFromArgsNonArgsOnly PASSED

kafka.KafkaTest > testGetKafkaConfigFromArgsNonArgsAtTheBegging STARTED

kafka.KafkaTest > testGetKafkaConfigFromArgsNonArgsAtTheBegging PASSED

2048 tests completed, 1 failed, 4 skipped

> Task :kafka-2.0-jdk8:core:test FAILED
> Task :testScala_2_11 FAILED

FAILURE: Build failed with an exception.

* What went wrong:
Execution failed for task ':kafka-2.0-jdk8:core:test'.
> There were failing tests. See the report at: file://<https://builds.apache.org/job/kafka-2.0-jdk8/ws/core/build/reports/tests/test/index.html>

* Try:
Run with --stacktrace option to get the stack trace. Run with --info or --debug option to
get more log output. Run with --scan to get full insights.

* Get more help at https://help.gradle.org

BUILD FAILED in 2h 27m 14s
25 actionable tasks: 3 executed, 22 up-to-date
Build step 'Execute shell' marked build as failure
[FINDBUGS] Collecting findbugs analysis files...
Setting GRADLE_4_8_1_HOME=/home/jenkins/tools/gradle/4.8.1
[FINDBUGS] Searching for all files in <https://builds.apache.org/job/kafka-2.0-jdk8/ws/>
that match the pattern **/build/reports/findbugs/*.xml
[FINDBUGS] Parsing 1 file in <https://builds.apache.org/job/kafka-2.0-jdk8/ws/>
[FINDBUGS] Successfully parsed file <https://builds.apache.org/job/kafka-2.0-jdk8/ws/core/build/reports/findbugs/main.xml>
with 0 unique warnings and 0 duplicates.
Setting GRADLE_4_8_1_HOME=/home/jenkins/tools/gradle/4.8.1
Setting GRADLE_4_8_1_HOME=/home/jenkins/tools/gradle/4.8.1
<Git Blamer> Using GitBlamer to create author and commit information for all warnings.
<Git Blamer> GIT_COMMIT=d072db1d67c59436bf65a192245f423e87399eda, workspace=<https://builds.apache.org/job/kafka-2.0-jdk8/ws/>
[FINDBUGS] Computing warning deltas based on reference build #227
Recording test results
Setting GRADLE_4_8_1_HOME=/home/jenkins/tools/gradle/4.8.1
Setting GRADLE_4_8_1_HOME=/home/jenkins/tools/gradle/4.8.1
Not sending mail to unregistered user noreply@github.com

Mime
View raw message