kafka-dev mailing list archives

Site index · List index
Message view « Date » · « Thread »
Top « Date » · « Thread »
From Apache Jenkins Server <jenk...@builds.apache.org>
Subject Build failed in Jenkins: kafka-trunk-jdk11 #247
Date Sat, 26 Jan 2019 07:18:57 GMT
See <https://builds.apache.org/job/kafka-trunk-jdk11/247/display/redirect?page=changes>

Changes:

[junrao] KAFKA-7837: Ensure offline partitions are picked up as soon as possible

[vahid.hashemian] Added quotes around the class path (#4469)

------------------------------------------
[...truncated 2.28 MB...]

org.apache.kafka.connect.runtime.distributed.DistributedHerderTest > testRestartConnector
STARTED

org.apache.kafka.connect.runtime.distributed.DistributedHerderTest > testRestartConnector
PASSED

org.apache.kafka.connect.runtime.distributed.DistributedHerderTest > testRestartTask STARTED

org.apache.kafka.connect.runtime.distributed.DistributedHerderTest > testRestartTask PASSED

org.apache.kafka.connect.runtime.distributed.DistributedHerderTest > testAccessors STARTED

org.apache.kafka.connect.runtime.distributed.DistributedHerderTest > testAccessors PASSED

org.apache.kafka.connect.runtime.distributed.DistributedHerderTest > testCreateConnectorFailedBasicValidation
STARTED

org.apache.kafka.connect.runtime.distributed.DistributedHerderTest > testCreateConnectorFailedBasicValidation
PASSED

org.apache.kafka.connect.runtime.distributed.DistributedHerderTest > testCreateConnectorFailedCustomValidation
STARTED

org.apache.kafka.connect.runtime.distributed.DistributedHerderTest > testCreateConnectorFailedCustomValidation
PASSED

org.apache.kafka.connect.runtime.distributed.DistributedHerderTest > testCreateConnectorAlreadyExists
STARTED

org.apache.kafka.connect.runtime.distributed.DistributedHerderTest > testCreateConnectorAlreadyExists
PASSED

org.apache.kafka.connect.runtime.distributed.DistributedHerderTest > testDestroyConnector
STARTED

org.apache.kafka.connect.runtime.distributed.DistributedHerderTest > testDestroyConnector
PASSED

org.apache.kafka.connect.runtime.distributed.DistributedHerderTest > testJoinAssignment
STARTED

org.apache.kafka.connect.runtime.distributed.DistributedHerderTest > testJoinAssignment
PASSED

org.apache.kafka.connect.runtime.distributed.DistributedHerderTest > testRebalance STARTED

org.apache.kafka.connect.runtime.distributed.DistributedHerderTest > testRebalance PASSED

org.apache.kafka.connect.runtime.distributed.DistributedHerderTest > testRebalanceFailedConnector
STARTED

org.apache.kafka.connect.runtime.distributed.DistributedHerderTest > testRebalanceFailedConnector
PASSED

org.apache.kafka.connect.runtime.distributed.DistributedHerderTest > testHaltCleansUpWorker
STARTED

org.apache.kafka.connect.runtime.distributed.DistributedHerderTest > testHaltCleansUpWorker
PASSED

org.apache.kafka.connect.runtime.distributed.DistributedHerderTest > testConnectorNameConflictsWithWorkerGroupId
STARTED

org.apache.kafka.connect.runtime.distributed.DistributedHerderTest > testConnectorNameConflictsWithWorkerGroupId
PASSED

org.apache.kafka.connect.runtime.distributed.DistributedHerderTest > testRestartUnknownConnector
STARTED

org.apache.kafka.connect.runtime.distributed.DistributedHerderTest > testRestartUnknownConnector
PASSED

org.apache.kafka.connect.runtime.distributed.DistributedHerderTest > testRestartConnectorRedirectToLeader
STARTED

org.apache.kafka.connect.runtime.distributed.DistributedHerderTest > testRestartConnectorRedirectToLeader
PASSED

org.apache.kafka.connect.runtime.distributed.DistributedHerderTest > testRestartConnectorRedirectToOwner
STARTED

org.apache.kafka.connect.runtime.distributed.DistributedHerderTest > testRestartConnectorRedirectToOwner
PASSED

org.apache.kafka.connect.runtime.distributed.DistributedHerderTest > testRestartUnknownTask
STARTED

org.apache.kafka.connect.runtime.distributed.DistributedHerderTest > testRestartUnknownTask
PASSED

org.apache.kafka.connect.runtime.distributed.DistributedHerderTest > testRequestProcessingOrder
STARTED

org.apache.kafka.connect.runtime.distributed.DistributedHerderTest > testRequestProcessingOrder
PASSED

org.apache.kafka.connect.runtime.distributed.DistributedHerderTest > testRestartTaskRedirectToLeader
STARTED

org.apache.kafka.connect.runtime.distributed.DistributedHerderTest > testRestartTaskRedirectToLeader
PASSED

org.apache.kafka.connect.runtime.distributed.DistributedHerderTest > testRestartTaskRedirectToOwner
STARTED

org.apache.kafka.connect.runtime.distributed.DistributedHerderTest > testRestartTaskRedirectToOwner
PASSED

org.apache.kafka.connect.runtime.distributed.DistributedHerderTest > testConnectorConfigAdded
STARTED

org.apache.kafka.connect.runtime.distributed.DistributedHerderTest > testConnectorConfigAdded
PASSED

org.apache.kafka.connect.runtime.distributed.DistributedHerderTest > testConnectorConfigUpdate
STARTED

org.apache.kafka.connect.runtime.distributed.DistributedHerderTest > testConnectorConfigUpdate
PASSED

org.apache.kafka.connect.runtime.distributed.DistributedHerderTest > testConnectorPaused
STARTED

org.apache.kafka.connect.runtime.distributed.DistributedHerderTest > testConnectorPaused
PASSED

org.apache.kafka.connect.runtime.distributed.DistributedHerderTest > testConnectorResumed
STARTED

org.apache.kafka.connect.runtime.distributed.DistributedHerderTest > testConnectorResumed
PASSED

org.apache.kafka.connect.runtime.distributed.DistributedHerderTest > testUnknownConnectorPaused
STARTED

org.apache.kafka.connect.runtime.distributed.DistributedHerderTest > testUnknownConnectorPaused
PASSED

org.apache.kafka.connect.runtime.distributed.DistributedHerderTest > testConnectorPausedRunningTaskOnly
STARTED

org.apache.kafka.connect.runtime.distributed.DistributedHerderTest > testConnectorPausedRunningTaskOnly
PASSED

org.apache.kafka.connect.runtime.distributed.DistributedHerderTest > testConnectorResumedRunningTaskOnly
STARTED

org.apache.kafka.connect.runtime.distributed.DistributedHerderTest > testConnectorResumedRunningTaskOnly
PASSED

org.apache.kafka.connect.runtime.distributed.DistributedHerderTest > testTaskConfigAdded
STARTED

org.apache.kafka.connect.runtime.distributed.DistributedHerderTest > testTaskConfigAdded
PASSED

org.apache.kafka.connect.runtime.distributed.DistributedHerderTest > testJoinLeaderCatchUpFails
STARTED

org.apache.kafka.connect.runtime.distributed.DistributedHerderTest > testJoinLeaderCatchUpFails
PASSED

org.apache.kafka.connect.runtime.distributed.DistributedHerderTest > testInconsistentConfigs
STARTED

org.apache.kafka.connect.runtime.distributed.DistributedHerderTest > testInconsistentConfigs
PASSED

org.apache.kafka.connect.runtime.distributed.WorkerCoordinatorTest > testLeaderPerformAssignmentSingleTaskConnectors
STARTED

org.apache.kafka.connect.runtime.distributed.WorkerCoordinatorTest > testLeaderPerformAssignmentSingleTaskConnectors
PASSED

org.apache.kafka.connect.runtime.distributed.WorkerCoordinatorTest > testNormalJoinGroupFollower
STARTED

org.apache.kafka.connect.runtime.distributed.WorkerCoordinatorTest > testNormalJoinGroupFollower
PASSED

org.apache.kafka.connect.runtime.distributed.WorkerCoordinatorTest > testMetadata STARTED

org.apache.kafka.connect.runtime.distributed.WorkerCoordinatorTest > testMetadata PASSED

org.apache.kafka.connect.runtime.distributed.WorkerCoordinatorTest > testLeaderPerformAssignment1
STARTED

org.apache.kafka.connect.runtime.distributed.WorkerCoordinatorTest > testLeaderPerformAssignment1
PASSED

org.apache.kafka.connect.runtime.distributed.WorkerCoordinatorTest > testLeaderPerformAssignment2
STARTED

org.apache.kafka.connect.runtime.distributed.WorkerCoordinatorTest > testLeaderPerformAssignment2
PASSED

org.apache.kafka.connect.runtime.distributed.WorkerCoordinatorTest > testJoinLeaderCannotAssign
STARTED

org.apache.kafka.connect.runtime.distributed.WorkerCoordinatorTest > testJoinLeaderCannotAssign
PASSED

org.apache.kafka.connect.runtime.distributed.WorkerCoordinatorTest > testRejoinGroup STARTED

org.apache.kafka.connect.runtime.distributed.WorkerCoordinatorTest > testRejoinGroup PASSED

org.apache.kafka.connect.runtime.distributed.WorkerCoordinatorTest > testNormalJoinGroupLeader
STARTED

org.apache.kafka.connect.runtime.distributed.WorkerCoordinatorTest > testNormalJoinGroupLeader
PASSED

org.apache.kafka.connect.runtime.WorkerTaskTest > updateMetricsOnListenerEventsForStartupPauseResumeAndShutdown
STARTED

org.apache.kafka.connect.runtime.WorkerTaskTest > updateMetricsOnListenerEventsForStartupPauseResumeAndShutdown
PASSED

org.apache.kafka.connect.runtime.WorkerTaskTest > updateMetricsOnListenerEventsForStartupPauseResumeAndFailure
STARTED

org.apache.kafka.connect.runtime.WorkerTaskTest > updateMetricsOnListenerEventsForStartupPauseResumeAndFailure
PASSED

org.apache.kafka.connect.runtime.WorkerTaskTest > standardStartup STARTED

org.apache.kafka.connect.runtime.WorkerTaskTest > standardStartup PASSED

org.apache.kafka.connect.runtime.WorkerTaskTest > cancelBeforeStopping STARTED

org.apache.kafka.connect.runtime.WorkerTaskTest > cancelBeforeStopping PASSED

org.apache.kafka.connect.runtime.WorkerTaskTest > stopBeforeStarting STARTED

org.apache.kafka.connect.runtime.WorkerTaskTest > stopBeforeStarting PASSED

384 tests completed, 2 failed

> Task :connect:runtime:test FAILED

> Task :connect:basic-auth-extension:test

org.apache.kafka.connect.rest.basic.auth.extension.JaasBasicAuthFilterTest > testSuccess
STARTED
WARNING: An illegal reflective access operation has occurred
WARNING: Illegal reflective access by org.powermock.reflect.internal.WhiteboxImpl (file:/home/jenkins/.gradle/caches/modules-2/files-2.1/org.powermock/powermock-reflect/2.0.0/cd452bc345ec9f88ec5efecd41139de0cb1d4265/powermock-reflect-2.0.0.jar)
to method java.lang.Object.clone()
WARNING: Please consider reporting this to the maintainers of org.powermock.reflect.internal.WhiteboxImpl
WARNING: Use --illegal-access=warn to enable warnings of further illegal reflective access
operations
WARNING: All illegal access operations will be denied in a future release

org.apache.kafka.connect.rest.basic.auth.extension.JaasBasicAuthFilterTest > testSuccess
PASSED

org.apache.kafka.connect.rest.basic.auth.extension.JaasBasicAuthFilterTest > testBadCredential
STARTED

org.apache.kafka.connect.rest.basic.auth.extension.JaasBasicAuthFilterTest > testBadCredential
PASSED

org.apache.kafka.connect.rest.basic.auth.extension.JaasBasicAuthFilterTest > testBadPassword
STARTED

org.apache.kafka.connect.rest.basic.auth.extension.JaasBasicAuthFilterTest > testBadPassword
PASSED

org.apache.kafka.connect.rest.basic.auth.extension.JaasBasicAuthFilterTest > testUnknownBearer
STARTED

org.apache.kafka.connect.rest.basic.auth.extension.JaasBasicAuthFilterTest > testUnknownBearer
PASSED

org.apache.kafka.connect.rest.basic.auth.extension.JaasBasicAuthFilterTest > testUnknownLoginModule
STARTED

org.apache.kafka.connect.rest.basic.auth.extension.JaasBasicAuthFilterTest > testUnknownLoginModule
PASSED

org.apache.kafka.connect.rest.basic.auth.extension.JaasBasicAuthFilterTest > testUnknownCredentialsFile
STARTED

org.apache.kafka.connect.rest.basic.auth.extension.JaasBasicAuthFilterTest > testUnknownCredentialsFile
PASSED

org.apache.kafka.connect.rest.basic.auth.extension.JaasBasicAuthFilterTest > testEmptyCredentialsFile
STARTED

org.apache.kafka.connect.rest.basic.auth.extension.JaasBasicAuthFilterTest > testEmptyCredentialsFile
PASSED

org.apache.kafka.connect.rest.basic.auth.extension.JaasBasicAuthFilterTest > testNoFileOption
STARTED

org.apache.kafka.connect.rest.basic.auth.extension.JaasBasicAuthFilterTest > testNoFileOption
PASSED

FAILURE: Build completed with 2 failures.

1: Task failed with an exception.
-----------
* What went wrong:
Execution failed for task ':core:test'.
> There were failing tests. See the report at: file://<https://builds.apache.org/job/kafka-trunk-jdk11/ws/core/build/reports/tests/test/index.html>

* Try:
Run with --stacktrace option to get the stack trace. Run with --info or --debug option to
get more log output. Run with --scan to get full insights.
==============================================================================

2: Task failed with an exception.
-----------
* What went wrong:
Execution failed for task ':connect:runtime:test'.
> There were failing tests. See the report at: file://<https://builds.apache.org/job/kafka-trunk-jdk11/ws/connect/runtime/build/reports/tests/test/index.html>

* Try:
Run with --stacktrace option to get the stack trace. Run with --info or --debug option to
get more log output. Run with --scan to get full insights.
==============================================================================

* Get more help at https://help.gradle.org

Deprecated Gradle features were used in this build, making it incompatible with Gradle 6.0.
Use '--warning-mode all' to show the individual deprecation warnings.
See https://docs.gradle.org/5.1/userguide/command_line_interface.html#sec:command_line_warnings

BUILD FAILED in 2h 25m 42s
173 actionable tasks: 172 executed, 1 up-to-date
Build step 'Execute shell' marked build as failure
Recording test results
Setting GRADLE_4_10_2_HOME=/home/jenkins/tools/gradle/4.10.2
Setting GRADLE_4_10_2_HOME=/home/jenkins/tools/gradle/4.10.2
Not sending mail to unregistered user wangguoz@gmail.com
Not sending mail to unregistered user vahid.hashemian@gmail.com
Not sending mail to unregistered user noreply@github.com

Mime
View raw message