kafka-dev mailing list archives

Site index · List index
Message view « Date » · « Thread »
Top « Date » · « Thread »
From Apache Jenkins Server <jenk...@builds.apache.org>
Subject Build failed in Jenkins: kafka-2.1-jdk8 #108
Date Sat, 19 Jan 2019 04:57:28 GMT
See <https://builds.apache.org/job/kafka-2.1-jdk8/108/display/redirect?page=changes>

Changes:

[wangguoz] KAFKA-7652: Part I; Fix SessionStore's findSession(single-key) (#6134)

------------------------------------------
[...truncated 914.32 KB...]

kafka.api.GroupAuthorizerIntegrationTest > shouldThrowTransactionalIdAuthorizationExceptionWhenNoTransactionAccessOnSendOffsetsToTxn
STARTED

kafka.api.GroupAuthorizerIntegrationTest > shouldThrowTransactionalIdAuthorizationExceptionWhenNoTransactionAccessOnSendOffsetsToTxn
PASSED

kafka.api.GroupAuthorizerIntegrationTest > testCommitWithNoGroupAccess STARTED

kafka.api.GroupAuthorizerIntegrationTest > testCommitWithNoGroupAccess PASSED

kafka.api.GroupAuthorizerIntegrationTest > testTransactionalProducerInitTransactionsNoDescribeTransactionalIdAcl
STARTED

kafka.api.GroupAuthorizerIntegrationTest > testTransactionalProducerInitTransactionsNoDescribeTransactionalIdAcl
PASSED

kafka.api.GroupAuthorizerIntegrationTest > testUnauthorizedDeleteRecordsWithDescribe STARTED

kafka.api.GroupAuthorizerIntegrationTest > testUnauthorizedDeleteRecordsWithDescribe PASSED

kafka.api.GroupAuthorizerIntegrationTest > testCreateTopicAuthorizationWithClusterCreate
STARTED

kafka.api.GroupAuthorizerIntegrationTest > testCreateTopicAuthorizationWithClusterCreate
PASSED

kafka.api.GroupAuthorizerIntegrationTest > testOffsetFetchWithTopicAndGroupRead STARTED

kafka.api.GroupAuthorizerIntegrationTest > testOffsetFetchWithTopicAndGroupRead PASSED

kafka.api.GroupAuthorizerIntegrationTest > testCommitWithTopicDescribe STARTED

kafka.api.GroupAuthorizerIntegrationTest > testCommitWithTopicDescribe PASSED

kafka.api.GroupAuthorizerIntegrationTest > testAuthorizationWithTopicExisting STARTED

kafka.api.GroupAuthorizerIntegrationTest > testAuthorizationWithTopicExisting PASSED

kafka.api.GroupAuthorizerIntegrationTest > testUnauthorizedDeleteRecordsWithoutDescribe
STARTED

kafka.api.GroupAuthorizerIntegrationTest > testUnauthorizedDeleteRecordsWithoutDescribe
PASSED

kafka.api.GroupAuthorizerIntegrationTest > testMetadataWithTopicDescribe STARTED

kafka.api.GroupAuthorizerIntegrationTest > testMetadataWithTopicDescribe PASSED

kafka.api.GroupAuthorizerIntegrationTest > testProduceWithTopicDescribe STARTED

kafka.api.GroupAuthorizerIntegrationTest > testProduceWithTopicDescribe PASSED

kafka.api.GroupAuthorizerIntegrationTest > testDescribeGroupApiWithNoGroupAcl STARTED

kafka.api.GroupAuthorizerIntegrationTest > testDescribeGroupApiWithNoGroupAcl PASSED

kafka.api.GroupAuthorizerIntegrationTest > testPatternSubscriptionMatchingInternalTopic
STARTED

kafka.api.GroupAuthorizerIntegrationTest > testPatternSubscriptionMatchingInternalTopic
PASSED

kafka.api.GroupAuthorizerIntegrationTest > testSendOffsetsWithNoConsumerGroupDescribeAccess
STARTED

kafka.api.GroupAuthorizerIntegrationTest > testSendOffsetsWithNoConsumerGroupDescribeAccess
PASSED

kafka.api.GroupAuthorizerIntegrationTest > testOffsetFetchTopicDescribe STARTED

kafka.api.GroupAuthorizerIntegrationTest > testOffsetFetchTopicDescribe PASSED

kafka.api.GroupAuthorizerIntegrationTest > testCommitWithTopicAndGroupRead STARTED

kafka.api.GroupAuthorizerIntegrationTest > testCommitWithTopicAndGroupRead PASSED

kafka.api.GroupAuthorizerIntegrationTest > testIdempotentProducerNoIdempotentWriteAclInInitProducerId
STARTED

kafka.api.GroupAuthorizerIntegrationTest > testIdempotentProducerNoIdempotentWriteAclInInitProducerId
PASSED

kafka.api.GroupAuthorizerIntegrationTest > testSimpleConsumeWithExplicitSeekAndNoGroupAccess
STARTED

kafka.api.GroupAuthorizerIntegrationTest > testSimpleConsumeWithExplicitSeekAndNoGroupAccess
PASSED

kafka.api.SaslPlaintextConsumerTest > testCoordinatorFailover STARTED

kafka.api.SaslPlaintextConsumerTest > testCoordinatorFailover PASSED

kafka.api.SaslPlaintextConsumerTest > testSimpleConsumption STARTED

kafka.api.SaslPlaintextConsumerTest > testSimpleConsumption PASSED

kafka.api.TransactionsTest > testBasicTransactions STARTED

kafka.api.TransactionsTest > testBasicTransactions PASSED

kafka.api.TransactionsTest > testFencingOnSendOffsets STARTED

kafka.api.TransactionsTest > testFencingOnSendOffsets PASSED

kafka.api.TransactionsTest > testFencingOnAddPartitions STARTED

kafka.api.TransactionsTest > testFencingOnAddPartitions PASSED

kafka.api.TransactionsTest > testFencingOnTransactionExpiration STARTED

kafka.api.TransactionsTest > testFencingOnTransactionExpiration PASSED

kafka.api.TransactionsTest > testDelayedFetchIncludesAbortedTransaction STARTED

kafka.api.TransactionsTest > testDelayedFetchIncludesAbortedTransaction PASSED

kafka.api.TransactionsTest > testOffsetMetadataInSendOffsetsToTransaction STARTED

kafka.api.TransactionsTest > testOffsetMetadataInSendOffsetsToTransaction PASSED

kafka.api.TransactionsTest > testConsecutivelyRunInitTransactions STARTED

kafka.api.TransactionsTest > testConsecutivelyRunInitTransactions PASSED

kafka.api.TransactionsTest > testReadCommittedConsumerShouldNotSeeUndecidedData STARTED

kafka.api.TransactionsTest > testReadCommittedConsumerShouldNotSeeUndecidedData PASSED

kafka.api.TransactionsTest > testFencingOnSend STARTED

kafka.api.TransactionsTest > testFencingOnSend PASSED

kafka.api.TransactionsTest > testFencingOnCommit STARTED

kafka.api.TransactionsTest > testFencingOnCommit PASSED

kafka.api.TransactionsTest > testMultipleMarkersOneLeader STARTED

kafka.api.TransactionsTest > testMultipleMarkersOneLeader PASSED

kafka.api.TransactionsTest > testSendOffsets STARTED

kafka.api.TransactionsTest > testSendOffsets PASSED

kafka.api.LogAppendTimeTest > testProduceConsume STARTED

kafka.api.LogAppendTimeTest > testProduceConsume PASSED

kafka.api.SaslPlainSslEndToEndAuthorizationTest > testAcls STARTED

kafka.api.SaslPlainSslEndToEndAuthorizationTest > testAcls PASSED

kafka.api.SaslPlainSslEndToEndAuthorizationTest > testTwoConsumersWithDifferentSaslCredentials
STARTED

kafka.api.SaslPlainSslEndToEndAuthorizationTest > testTwoConsumersWithDifferentSaslCredentials
PASSED

kafka.api.SaslPlainSslEndToEndAuthorizationTest > testNoConsumeWithoutDescribeAclViaSubscribe
STARTED

kafka.api.SaslPlainSslEndToEndAuthorizationTest > testNoConsumeWithoutDescribeAclViaSubscribe
PASSED

kafka.api.SaslPlainSslEndToEndAuthorizationTest > testProduceConsumeWithPrefixedAcls STARTED

kafka.api.SaslPlainSslEndToEndAuthorizationTest > testProduceConsumeWithPrefixedAcls PASSED

kafka.api.SaslPlainSslEndToEndAuthorizationTest > testProduceConsumeViaAssign STARTED

kafka.api.SaslPlainSslEndToEndAuthorizationTest > testProduceConsumeViaAssign PASSED

kafka.api.SaslPlainSslEndToEndAuthorizationTest > testNoConsumeWithDescribeAclViaAssign
STARTED

kafka.api.SaslPlainSslEndToEndAuthorizationTest > testNoConsumeWithDescribeAclViaAssign
PASSED

kafka.api.SaslPlainSslEndToEndAuthorizationTest > testProduceConsumeTopicAutoCreateTopicCreateAcl
STARTED

kafka.api.SaslPlainSslEndToEndAuthorizationTest > testProduceConsumeTopicAutoCreateTopicCreateAcl
PASSED

kafka.api.SaslPlainSslEndToEndAuthorizationTest > testProduceConsumeWithWildcardAcls STARTED

kafka.api.SaslPlainSslEndToEndAuthorizationTest > testProduceConsumeWithWildcardAcls PASSED

kafka.api.SaslPlainSslEndToEndAuthorizationTest > testNoConsumeWithDescribeAclViaSubscribe
STARTED

kafka.api.SaslPlainSslEndToEndAuthorizationTest > testNoConsumeWithDescribeAclViaSubscribe
PASSED

kafka.api.SaslPlainSslEndToEndAuthorizationTest > testNoConsumeWithoutDescribeAclViaAssign
STARTED

kafka.api.SaslPlainSslEndToEndAuthorizationTest > testNoConsumeWithoutDescribeAclViaAssign
PASSED

kafka.api.SaslPlainSslEndToEndAuthorizationTest > testNoGroupAcl STARTED

kafka.api.SaslPlainSslEndToEndAuthorizationTest > testNoGroupAcl PASSED

kafka.api.SaslPlainSslEndToEndAuthorizationTest > testNoProduceWithDescribeAcl STARTED

kafka.api.SaslPlainSslEndToEndAuthorizationTest > testNoProduceWithDescribeAcl PASSED

kafka.api.SaslPlainSslEndToEndAuthorizationTest > testProduceConsumeViaSubscribe STARTED

kafka.api.SaslPlainSslEndToEndAuthorizationTest > testProduceConsumeViaSubscribe PASSED

kafka.api.SaslPlainSslEndToEndAuthorizationTest > testNoProduceWithoutDescribeAcl STARTED

kafka.api.SaslPlainSslEndToEndAuthorizationTest > testNoProduceWithoutDescribeAcl PASSED

kafka.api.ClientIdQuotaTest > testProducerConsumerOverrideUnthrottled STARTED

kafka.api.ClientIdQuotaTest > testProducerConsumerOverrideUnthrottled PASSED

kafka.api.ClientIdQuotaTest > testThrottledProducerConsumer STARTED

kafka.api.ClientIdQuotaTest > testThrottledProducerConsumer PASSED

kafka.api.ClientIdQuotaTest > testQuotaOverrideDelete STARTED

kafka.api.ClientIdQuotaTest > testQuotaOverrideDelete PASSED

kafka.api.ClientIdQuotaTest > testThrottledRequest STARTED

kafka.api.ClientIdQuotaTest > testThrottledRequest PASSED

unit.kafka.utils.ThrottlerTest > testThrottleDesiredRate STARTED

unit.kafka.utils.ThrottlerTest > testThrottleDesiredRate PASSED

> Task :clients:compileJava UP-TO-DATE
> Task :clients:processResources UP-TO-DATE
> Task :clients:classes UP-TO-DATE

> Task :clients:checkstyleMain
[ant:checkstyle] [ERROR] <https://builds.apache.org/job/kafka-2.1-jdk8/ws/clients/src/main/java/org/apache/kafka/clients/producer/KafkaProducer.java>:1200:13:
'}' at column 13 should be on the same line as the next part of a multi-block statement (one
that directly contains multiple blocks: if/else-if/else, do/while or try/catch/finally). [RightCurly]

> Task :clients:checkstyleMain FAILED

FAILURE: Build failed with an exception.

* What went wrong:
Execution failed for task ':clients:checkstyleMain'.
> Checkstyle rule violations were found. See the report at: file://<https://builds.apache.org/job/kafka-2.1-jdk8/ws/clients/build/reports/checkstyle/main.html>
  Checkstyle files with violations: 1
  Checkstyle violations by severity: [error:1]


* Try:
Run with --stacktrace option to get the stack trace. Run with --info or --debug option to
get more log output. Run with --scan to get full insights.

* Get more help at https://help.gradle.org

BUILD FAILED in 3h 42m 49s
30 actionable tasks: 11 executed, 19 up-to-date
Build step 'Execute shell' marked build as failure
[FINDBUGS] Collecting findbugs analysis files...
Setting GRADLE_4_8_1_HOME=/home/jenkins/tools/gradle/4.8.1
[FINDBUGS] Searching for all files in <https://builds.apache.org/job/kafka-2.1-jdk8/ws/>
that match the pattern **/build/reports/findbugs/*.xml
[FINDBUGS] No files found. Configuration error?
Setting GRADLE_4_8_1_HOME=/home/jenkins/tools/gradle/4.8.1
Setting GRADLE_4_8_1_HOME=/home/jenkins/tools/gradle/4.8.1
<Git Blamer> Using GitBlamer to create author and commit information for all warnings.
<Git Blamer> GIT_COMMIT=2436c8f762043139ee3cd7de86b7d6f137781f9f, workspace=<https://builds.apache.org/job/kafka-2.1-jdk8/ws/>
[FINDBUGS] Computing warning deltas based on reference build #96
Recording test results
Setting GRADLE_4_8_1_HOME=/home/jenkins/tools/gradle/4.8.1
Setting GRADLE_4_8_1_HOME=/home/jenkins/tools/gradle/4.8.1
Not sending mail to unregistered user wangguoz@gmail.com
Not sending mail to unregistered user manikumar.reddy@gmail.com

Mime
View raw message