kafka-dev mailing list archives

Site index · List index
Message view « Date » · « Thread »
Top « Date » · « Thread »
From Apache Jenkins Server <jenk...@builds.apache.org>
Subject Build failed in Jenkins: kafka-trunk-jdk8 #3259
Date Thu, 13 Dec 2018 18:41:12 GMT
See <https://builds.apache.org/job/kafka-trunk-jdk8/3259/display/redirect?page=changes>

Changes:

[mjsax] KAFKA-7655 Metadata spamming requests from Kafka Streams under some

------------------------------------------
[...truncated 2.25 MB...]
kafka.coordinator.group.GroupCoordinatorTest > testValidJoinGroup PASSED

kafka.coordinator.group.GroupCoordinatorTest > shouldDelayRebalanceUptoRebalanceTimeout
STARTED

kafka.coordinator.group.GroupCoordinatorTest > shouldDelayRebalanceUptoRebalanceTimeout
PASSED

kafka.coordinator.group.GroupCoordinatorTest > testFetchOffsets STARTED

kafka.coordinator.group.GroupCoordinatorTest > testFetchOffsets PASSED

kafka.coordinator.group.GroupCoordinatorTest > testSessionTimeoutDuringRebalance STARTED

kafka.coordinator.group.GroupCoordinatorTest > testSessionTimeoutDuringRebalance PASSED

kafka.coordinator.group.GroupCoordinatorTest > testNewMemberJoinExpiration STARTED

kafka.coordinator.group.GroupCoordinatorTest > testNewMemberJoinExpiration PASSED

kafka.coordinator.group.GroupCoordinatorTest > testFetchTxnOffsetsWithAbort STARTED

kafka.coordinator.group.GroupCoordinatorTest > testFetchTxnOffsetsWithAbort PASSED

kafka.coordinator.group.GroupCoordinatorTest > testSyncGroupLeaderAfterFollower STARTED

kafka.coordinator.group.GroupCoordinatorTest > testSyncGroupLeaderAfterFollower PASSED

kafka.coordinator.group.GroupCoordinatorTest > testSyncGroupFromUnknownMember STARTED

kafka.coordinator.group.GroupCoordinatorTest > testSyncGroupFromUnknownMember PASSED

kafka.coordinator.group.GroupCoordinatorTest > testValidLeaveGroup STARTED

kafka.coordinator.group.GroupCoordinatorTest > testValidLeaveGroup PASSED

kafka.coordinator.group.GroupCoordinatorTest > testDescribeGroupInactiveGroup STARTED

kafka.coordinator.group.GroupCoordinatorTest > testDescribeGroupInactiveGroup PASSED

kafka.coordinator.group.GroupCoordinatorTest > testFetchTxnOffsetsIgnoreSpuriousCommit
STARTED

kafka.coordinator.group.GroupCoordinatorTest > testFetchTxnOffsetsIgnoreSpuriousCommit
PASSED

kafka.coordinator.group.GroupCoordinatorTest > testSyncGroupNotCoordinator STARTED

kafka.coordinator.group.GroupCoordinatorTest > testSyncGroupNotCoordinator PASSED

kafka.coordinator.group.GroupCoordinatorTest > testBasicFetchTxnOffsets STARTED

kafka.coordinator.group.GroupCoordinatorTest > testBasicFetchTxnOffsets PASSED

kafka.coordinator.group.GroupCoordinatorTest > shouldResetRebalanceDelayWhenNewMemberJoinsGroupInInitialRebalance
STARTED

kafka.coordinator.group.GroupCoordinatorTest > shouldResetRebalanceDelayWhenNewMemberJoinsGroupInInitialRebalance
PASSED

kafka.coordinator.group.GroupCoordinatorTest > testHeartbeatUnknownConsumerExistingGroup
STARTED

kafka.coordinator.group.GroupCoordinatorTest > testHeartbeatUnknownConsumerExistingGroup
PASSED

kafka.coordinator.group.GroupCoordinatorTest > testValidHeartbeat STARTED

kafka.coordinator.group.GroupCoordinatorTest > testValidHeartbeat PASSED

kafka.coordinator.group.GroupCoordinatorTest > testRequestHandlingWhileLoadingInProgress
STARTED

kafka.coordinator.group.GroupCoordinatorTest > testRequestHandlingWhileLoadingInProgress
PASSED

kafka.network.SocketServerTest > testGracefulClose STARTED

kafka.network.SocketServerTest > testGracefulClose PASSED

kafka.network.SocketServerTest > testSendActionResponseWithThrottledChannelWhereThrottlingAlreadyDone
STARTED

kafka.network.SocketServerTest > testSendActionResponseWithThrottledChannelWhereThrottlingAlreadyDone
PASSED

kafka.network.SocketServerTest > controlThrowable STARTED

kafka.network.SocketServerTest > controlThrowable PASSED

kafka.network.SocketServerTest > testRequestMetricsAfterStop STARTED

kafka.network.SocketServerTest > testRequestMetricsAfterStop PASSED

kafka.network.SocketServerTest > testConnectionIdReuse STARTED

kafka.network.SocketServerTest > testConnectionIdReuse PASSED

kafka.network.SocketServerTest > testClientDisconnectionUpdatesRequestMetrics STARTED

kafka.network.SocketServerTest > testClientDisconnectionUpdatesRequestMetrics PASSED

kafka.network.SocketServerTest > testProcessorMetricsTags STARTED

kafka.network.SocketServerTest > testProcessorMetricsTags PASSED

kafka.network.SocketServerTest > testMaxConnectionsPerIp STARTED

kafka.network.SocketServerTest > testMaxConnectionsPerIp PASSED

kafka.network.SocketServerTest > testConnectionId STARTED

kafka.network.SocketServerTest > testConnectionId PASSED

kafka.network.SocketServerTest > testBrokerSendAfterChannelClosedUpdatesRequestMetrics
STARTED

kafka.network.SocketServerTest > testBrokerSendAfterChannelClosedUpdatesRequestMetrics
PASSED

kafka.network.SocketServerTest > testNoOpAction STARTED

kafka.network.SocketServerTest > testNoOpAction PASSED

kafka.network.SocketServerTest > simpleRequest STARTED

kafka.network.SocketServerTest > simpleRequest PASSED

kafka.network.SocketServerTest > closingChannelException STARTED

kafka.network.SocketServerTest > closingChannelException PASSED

kafka.network.SocketServerTest > testSendActionResponseWithThrottledChannelWhereThrottlingInProgress
STARTED

kafka.network.SocketServerTest > testSendActionResponseWithThrottledChannelWhereThrottlingInProgress
PASSED

kafka.network.SocketServerTest > testIdleConnection STARTED

kafka.network.SocketServerTest > testIdleConnection PASSED

kafka.network.SocketServerTest > testClientDisconnectionWithStagedReceivesFullyProcessed
STARTED

kafka.network.SocketServerTest > testClientDisconnectionWithStagedReceivesFullyProcessed
PASSED

kafka.network.SocketServerTest > testZeroMaxConnectionsPerIp STARTED

kafka.network.SocketServerTest > testZeroMaxConnectionsPerIp PASSED

kafka.network.SocketServerTest > testMetricCollectionAfterShutdown STARTED

kafka.network.SocketServerTest > testMetricCollectionAfterShutdown PASSED

kafka.network.SocketServerTest > testSessionPrincipal STARTED

kafka.network.SocketServerTest > testSessionPrincipal PASSED

kafka.network.SocketServerTest > configureNewConnectionException STARTED

kafka.network.SocketServerTest > configureNewConnectionException PASSED

kafka.network.SocketServerTest > testMaxConnectionsPerIpOverrides STARTED

kafka.network.SocketServerTest > testMaxConnectionsPerIpOverrides PASSED

kafka.network.SocketServerTest > processNewResponseException STARTED

kafka.network.SocketServerTest > processNewResponseException PASSED

kafka.network.SocketServerTest > processCompletedSendException STARTED

kafka.network.SocketServerTest > processCompletedSendException PASSED

kafka.network.SocketServerTest > processDisconnectedException STARTED

kafka.network.SocketServerTest > processDisconnectedException PASSED

kafka.network.SocketServerTest > sendCancelledKeyException STARTED

kafka.network.SocketServerTest > sendCancelledKeyException PASSED

kafka.network.SocketServerTest > processCompletedReceiveException STARTED

kafka.network.SocketServerTest > processCompletedReceiveException PASSED

kafka.network.SocketServerTest > testSocketsCloseOnShutdown STARTED

kafka.network.SocketServerTest > testSocketsCloseOnShutdown PASSED

kafka.network.SocketServerTest > testNoOpActionResponseWithThrottledChannelWhereThrottlingAlreadyDone
STARTED

kafka.network.SocketServerTest > testNoOpActionResponseWithThrottledChannelWhereThrottlingAlreadyDone
PASSED

kafka.network.SocketServerTest > pollException STARTED

kafka.network.SocketServerTest > pollException PASSED

kafka.network.SocketServerTest > testSslSocketServer STARTED

kafka.network.SocketServerTest > testSslSocketServer PASSED

kafka.network.SocketServerTest > tooBigRequestIsRejected STARTED

kafka.network.SocketServerTest > tooBigRequestIsRejected PASSED

kafka.network.SocketServerTest > testNoOpActionResponseWithThrottledChannelWhereThrottlingInProgress
STARTED

kafka.network.SocketServerTest > testNoOpActionResponseWithThrottledChannelWhereThrottlingInProgress
PASSED

kafka.network.DynamicConnectionQuotaTest > testDynamicConnectionQuota STARTED

kafka.network.DynamicConnectionQuotaTest > testDynamicConnectionQuota PASSED

2169 tests completed, 1 failed, 4 skipped

> Task :core:test FAILED

FAILURE: Build failed with an exception.

* What went wrong:
Execution failed for task ':core:test'.
> There were failing tests. See the report at: file://<https://builds.apache.org/job/kafka-trunk-jdk8/ws/core/build/reports/tests/test/index.html>

* Try:
Run with --stacktrace option to get the stack trace. Run with --info or --debug option to
get more log output. Run with --scan to get full insights.

* Get more help at https://help.gradle.org

Deprecated Gradle features were used in this build, making it incompatible with Gradle 6.0.
Use '--warning-mode all' to show the individual deprecation warnings.
See https://docs.gradle.org/5.0/userguide/command_line_interface.html#sec:command_line_warnings

BUILD FAILED in 2h 26m 49s
161 actionable tasks: 138 executed, 23 up-to-date
Build step 'Execute shell' marked build as failure
[FINDBUGS] Collecting findbugs analysis files...
Setting GRADLE_4_8_1_HOME=/home/jenkins/tools/gradle/4.8.1
[FINDBUGS] Searching for all files in <https://builds.apache.org/job/kafka-trunk-jdk8/ws/>
that match the pattern **/build/reports/*bugs/*.xml
[FINDBUGS] Parsing 16 files in <https://builds.apache.org/job/kafka-trunk-jdk8/ws/>
[FINDBUGS] Successfully parsed file <https://builds.apache.org/job/kafka-trunk-jdk8/ws/clients/build/reports/spotbugs/main.xml>
with 0 unique warnings and 0 duplicates.
[FINDBUGS] Successfully parsed file <https://builds.apache.org/job/kafka-trunk-jdk8/ws/connect/api/build/reports/spotbugs/main.xml>
with 0 unique warnings and 0 duplicates.
[FINDBUGS] Successfully parsed file <https://builds.apache.org/job/kafka-trunk-jdk8/ws/connect/basic-auth-extension/build/reports/spotbugs/main.xml>
with 0 unique warnings and 0 duplicates.
[FINDBUGS] Successfully parsed file <https://builds.apache.org/job/kafka-trunk-jdk8/ws/connect/file/build/reports/spotbugs/main.xml>
with 0 unique warnings and 0 duplicates.
[FINDBUGS] Successfully parsed file <https://builds.apache.org/job/kafka-trunk-jdk8/ws/connect/json/build/reports/spotbugs/main.xml>
with 0 unique warnings and 0 duplicates.
[FINDBUGS] Successfully parsed file <https://builds.apache.org/job/kafka-trunk-jdk8/ws/connect/runtime/build/reports/spotbugs/main.xml>
with 0 unique warnings and 0 duplicates.
[FINDBUGS] Successfully parsed file <https://builds.apache.org/job/kafka-trunk-jdk8/ws/connect/transforms/build/reports/spotbugs/main.xml>
with 0 unique warnings and 0 duplicates.
[FINDBUGS] Successfully parsed file <https://builds.apache.org/job/kafka-trunk-jdk8/ws/core/build/reports/spotbugs/main.xml>
with 0 unique warnings and 0 duplicates.
[FINDBUGS] Successfully parsed file <https://builds.apache.org/job/kafka-trunk-jdk8/ws/examples/build/reports/spotbugs/main.xml>
with 0 unique warnings and 0 duplicates.
[FINDBUGS] Successfully parsed file <https://builds.apache.org/job/kafka-trunk-jdk8/ws/jmh-benchmarks/build/reports/spotbugs/main.xml>
with 0 unique warnings and 0 duplicates.
[FINDBUGS] Successfully parsed file <https://builds.apache.org/job/kafka-trunk-jdk8/ws/log4j-appender/build/reports/spotbugs/main.xml>
with 0 unique warnings and 0 duplicates.
[FINDBUGS] Successfully parsed file <https://builds.apache.org/job/kafka-trunk-jdk8/ws/streams/build/reports/spotbugs/main.xml>
with 0 unique warnings and 0 duplicates.
[FINDBUGS] Successfully parsed file <https://builds.apache.org/job/kafka-trunk-jdk8/ws/streams/examples/build/reports/spotbugs/main.xml>
with 0 unique warnings and 0 duplicates.
[FINDBUGS] Successfully parsed file <https://builds.apache.org/job/kafka-trunk-jdk8/ws/streams/streams-scala/build/reports/spotbugs/main.xml>
with 0 unique warnings and 0 duplicates.
[FINDBUGS] Successfully parsed file <https://builds.apache.org/job/kafka-trunk-jdk8/ws/streams/test-utils/build/reports/spotbugs/main.xml>
with 0 unique warnings and 0 duplicates.
[FINDBUGS] Successfully parsed file <https://builds.apache.org/job/kafka-trunk-jdk8/ws/tools/build/reports/spotbugs/main.xml>
with 0 unique warnings and 0 duplicates.
Setting GRADLE_4_8_1_HOME=/home/jenkins/tools/gradle/4.8.1
Setting GRADLE_4_8_1_HOME=/home/jenkins/tools/gradle/4.8.1
<Git Blamer> Using GitBlamer to create author and commit information for all warnings.
<Git Blamer> GIT_COMMIT=dffce6e7ae047a21fb40ec2c27d3d1f562a511a3, workspace=<https://builds.apache.org/job/kafka-trunk-jdk8/ws/>
[FINDBUGS] Computing warning deltas based on reference build #3257
Recording test results
Setting GRADLE_4_8_1_HOME=/home/jenkins/tools/gradle/4.8.1
Setting GRADLE_4_8_1_HOME=/home/jenkins/tools/gradle/4.8.1
Not sending mail to unregistered user wangguoz@gmail.com

Mime
View raw message