kafka-dev mailing list archives

Site index · List index
Message view « Date » · « Thread »
Top « Date » · « Thread »
From Apache Jenkins Server <jenk...@builds.apache.org>
Subject Build failed in Jenkins: kafka-trunk-jdk10 #526
Date Fri, 28 Sep 2018 10:23:10 GMT
See <https://builds.apache.org/job/kafka-trunk-jdk10/526/display/redirect?page=changes>

Changes:

[jason] KAFKA-7409; Validate message format version before creating topics or

------------------------------------------
[...truncated 2.15 MB...]

org.apache.kafka.streams.TopologyTestDriverTest > shouldCloseProcessor[Eos enabled = false]
STARTED

org.apache.kafka.streams.TopologyTestDriverTest > shouldCloseProcessor[Eos enabled = false]
PASSED

org.apache.kafka.streams.TopologyTestDriverTest > shouldFeedStoreFromGlobalKTable[Eos enabled
= false] STARTED

org.apache.kafka.streams.TopologyTestDriverTest > shouldFeedStoreFromGlobalKTable[Eos enabled
= false] PASSED

org.apache.kafka.streams.TopologyTestDriverTest > shouldCleanUpPersistentStateStoresOnClose[Eos
enabled = false] STARTED

org.apache.kafka.streams.TopologyTestDriverTest > shouldCleanUpPersistentStateStoresOnClose[Eos
enabled = false] PASSED

org.apache.kafka.streams.TopologyTestDriverTest > shouldThrowPatternNotValidForTopicNameException[Eos
enabled = false] STARTED

org.apache.kafka.streams.TopologyTestDriverTest > shouldThrowPatternNotValidForTopicNameException[Eos
enabled = false] PASSED

org.apache.kafka.streams.TopologyTestDriverTest > shouldPunctuateIfEvenTimeAdvances[Eos
enabled = false] STARTED

org.apache.kafka.streams.TopologyTestDriverTest > shouldPunctuateIfEvenTimeAdvances[Eos
enabled = false] PASSED

org.apache.kafka.streams.TopologyTestDriverTest > shouldInitProcessor[Eos enabled = false]
STARTED

org.apache.kafka.streams.TopologyTestDriverTest > shouldInitProcessor[Eos enabled = false]
PASSED

org.apache.kafka.streams.TopologyTestDriverTest > shouldThrowForUnknownTopic[Eos enabled
= false] STARTED

org.apache.kafka.streams.TopologyTestDriverTest > shouldThrowForUnknownTopic[Eos enabled
= false] PASSED

org.apache.kafka.streams.TopologyTestDriverTest > shouldPunctuateOnStreamsTime[Eos enabled
= false] STARTED

org.apache.kafka.streams.TopologyTestDriverTest > shouldPunctuateOnStreamsTime[Eos enabled
= false] PASSED

org.apache.kafka.streams.TopologyTestDriverTest > shouldProcessFromSourcesThatMatchMultiplePattern[Eos
enabled = false] STARTED

org.apache.kafka.streams.TopologyTestDriverTest > shouldProcessFromSourcesThatMatchMultiplePattern[Eos
enabled = false] PASSED

org.apache.kafka.streams.TopologyTestDriverTest > shouldPopulateGlobalStore[Eos enabled
= false] STARTED

org.apache.kafka.streams.TopologyTestDriverTest > shouldPopulateGlobalStore[Eos enabled
= false] PASSED

org.apache.kafka.streams.TopologyTestDriverTest > shouldUseSourceSpecificDeserializers[Eos
enabled = false] STARTED

org.apache.kafka.streams.TopologyTestDriverTest > shouldUseSourceSpecificDeserializers[Eos
enabled = false] PASSED

org.apache.kafka.streams.TopologyTestDriverTest > shouldReturnAllStores[Eos enabled = false]
STARTED

org.apache.kafka.streams.TopologyTestDriverTest > shouldReturnAllStores[Eos enabled = false]
PASSED

org.apache.kafka.streams.TopologyTestDriverTest > shouldSendRecordViaCorrectSourceTopic[Eos
enabled = false] STARTED

org.apache.kafka.streams.TopologyTestDriverTest > shouldSendRecordViaCorrectSourceTopic[Eos
enabled = false] PASSED

org.apache.kafka.streams.TopologyTestDriverTest > shouldReturnAllStoresNames[Eos enabled
= false] STARTED

org.apache.kafka.streams.TopologyTestDriverTest > shouldReturnAllStoresNames[Eos enabled
= false] PASSED

org.apache.kafka.streams.TopologyTestDriverTest > shouldProcessConsumerRecordList[Eos enabled
= false] STARTED

org.apache.kafka.streams.TopologyTestDriverTest > shouldProcessConsumerRecordList[Eos enabled
= false] PASSED

org.apache.kafka.streams.TopologyTestDriverTest > shouldUseSinkSpecificSerializers[Eos
enabled = false] STARTED

org.apache.kafka.streams.TopologyTestDriverTest > shouldUseSinkSpecificSerializers[Eos
enabled = false] PASSED

org.apache.kafka.streams.TopologyTestDriverTest > shouldFlushStoreForFirstInput[Eos enabled
= false] STARTED

org.apache.kafka.streams.TopologyTestDriverTest > shouldFlushStoreForFirstInput[Eos enabled
= false] PASSED

org.apache.kafka.streams.TopologyTestDriverTest > shouldProcessFromSourceThatMatchPattern[Eos
enabled = false] STARTED

org.apache.kafka.streams.TopologyTestDriverTest > shouldProcessFromSourceThatMatchPattern[Eos
enabled = false] PASSED

org.apache.kafka.streams.TopologyTestDriverTest > shouldUpdateStoreForNewKey[Eos enabled
= false] STARTED

org.apache.kafka.streams.TopologyTestDriverTest > shouldUpdateStoreForNewKey[Eos enabled
= false] PASSED

org.apache.kafka.streams.TopologyTestDriverTest > shouldPunctuateOnWallClockTime[Eos enabled
= false] STARTED

org.apache.kafka.streams.TopologyTestDriverTest > shouldPunctuateOnWallClockTime[Eos enabled
= false] PASSED

org.apache.kafka.streams.TopologyTestDriverTest > shouldSetRecordMetadata[Eos enabled =
false] STARTED

org.apache.kafka.streams.TopologyTestDriverTest > shouldSetRecordMetadata[Eos enabled =
false] PASSED

org.apache.kafka.streams.TopologyTestDriverTest > shouldNotUpdateStoreForLargerValue[Eos
enabled = false] STARTED

org.apache.kafka.streams.TopologyTestDriverTest > shouldNotUpdateStoreForLargerValue[Eos
enabled = false] PASSED

org.apache.kafka.streams.TopologyTestDriverTest > shouldProcessRecordForTopic[Eos enabled
= false] STARTED

org.apache.kafka.streams.TopologyTestDriverTest > shouldProcessRecordForTopic[Eos enabled
= false] PASSED

org.apache.kafka.streams.TopologyTestDriverTest > shouldForwardRecordsFromSubtopologyToSubtopology[Eos
enabled = false] STARTED

org.apache.kafka.streams.TopologyTestDriverTest > shouldForwardRecordsFromSubtopologyToSubtopology[Eos
enabled = false] PASSED

org.apache.kafka.streams.TopologyTestDriverTest > shouldNotUpdateStoreForSmallerValue[Eos
enabled = false] STARTED

org.apache.kafka.streams.TopologyTestDriverTest > shouldNotUpdateStoreForSmallerValue[Eos
enabled = false] PASSED

org.apache.kafka.streams.TopologyTestDriverTest > shouldPunctuateIfWallClockTimeAdvances[Eos
enabled = false] STARTED

org.apache.kafka.streams.TopologyTestDriverTest > shouldPunctuateIfWallClockTimeAdvances[Eos
enabled = false] PASSED

> Task :streams:upgrade-system-tests-0100:compileJava NO-SOURCE
> Task :streams:upgrade-system-tests-0100:processResources NO-SOURCE
> Task :streams:upgrade-system-tests-0100:classes UP-TO-DATE
> Task :streams:upgrade-system-tests-0100:checkstyleMain NO-SOURCE
> Task :streams:upgrade-system-tests-0100:compileTestJava
> Task :streams:upgrade-system-tests-0100:processTestResources NO-SOURCE
> Task :streams:upgrade-system-tests-0100:testClasses
> Task :streams:upgrade-system-tests-0100:checkstyleTest
> Task :streams:upgrade-system-tests-0100:spotbugsMain NO-SOURCE
> Task :streams:upgrade-system-tests-0100:test
> Task :streams:upgrade-system-tests-0101:compileJava NO-SOURCE
> Task :streams:upgrade-system-tests-0101:processResources NO-SOURCE
> Task :streams:upgrade-system-tests-0101:classes UP-TO-DATE
> Task :streams:upgrade-system-tests-0101:checkstyleMain NO-SOURCE
> Task :streams:upgrade-system-tests-0101:compileTestJava
> Task :streams:upgrade-system-tests-0101:processTestResources NO-SOURCE
> Task :streams:upgrade-system-tests-0101:testClasses
> Task :streams:upgrade-system-tests-0101:checkstyleTest
> Task :streams:upgrade-system-tests-0101:spotbugsMain NO-SOURCE
> Task :streams:upgrade-system-tests-0101:test
> Task :streams:upgrade-system-tests-0102:compileJava NO-SOURCE
> Task :streams:upgrade-system-tests-0102:processResources NO-SOURCE
> Task :streams:upgrade-system-tests-0102:classes UP-TO-DATE
> Task :streams:upgrade-system-tests-0102:checkstyleMain NO-SOURCE
> Task :streams:upgrade-system-tests-0102:compileTestJava
> Task :streams:upgrade-system-tests-0102:processTestResources NO-SOURCE
> Task :streams:upgrade-system-tests-0102:testClasses
> Task :streams:upgrade-system-tests-0102:checkstyleTest
> Task :streams:upgrade-system-tests-0102:spotbugsMain NO-SOURCE
> Task :streams:upgrade-system-tests-0102:test
> Task :streams:upgrade-system-tests-0110:compileJava NO-SOURCE
> Task :streams:upgrade-system-tests-0110:processResources NO-SOURCE
> Task :streams:upgrade-system-tests-0110:classes UP-TO-DATE
> Task :streams:upgrade-system-tests-0110:checkstyleMain NO-SOURCE
> Task :streams:upgrade-system-tests-0110:compileTestJava
> Task :streams:upgrade-system-tests-0110:processTestResources NO-SOURCE
> Task :streams:upgrade-system-tests-0110:testClasses
> Task :streams:upgrade-system-tests-0110:checkstyleTest
> Task :streams:upgrade-system-tests-0110:spotbugsMain NO-SOURCE
> Task :streams:upgrade-system-tests-0110:test
> Task :streams:upgrade-system-tests-10:compileJava NO-SOURCE
> Task :streams:upgrade-system-tests-10:processResources NO-SOURCE
> Task :streams:upgrade-system-tests-10:classes UP-TO-DATE
> Task :streams:upgrade-system-tests-10:checkstyleMain NO-SOURCE
> Task :streams:upgrade-system-tests-10:compileTestJava
> Task :streams:upgrade-system-tests-10:processTestResources NO-SOURCE
> Task :streams:upgrade-system-tests-10:testClasses
> Task :streams:upgrade-system-tests-10:checkstyleTest
> Task :streams:upgrade-system-tests-10:spotbugsMain NO-SOURCE
> Task :streams:upgrade-system-tests-10:test
> Task :streams:upgrade-system-tests-11:compileJava NO-SOURCE
> Task :streams:upgrade-system-tests-11:processResources NO-SOURCE
> Task :streams:upgrade-system-tests-11:classes UP-TO-DATE
> Task :streams:upgrade-system-tests-11:checkstyleMain NO-SOURCE
> Task :streams:upgrade-system-tests-11:compileTestJava
> Task :streams:upgrade-system-tests-11:processTestResources NO-SOURCE
> Task :streams:upgrade-system-tests-11:testClasses
> Task :streams:upgrade-system-tests-11:checkstyleTest
> Task :streams:upgrade-system-tests-11:spotbugsMain NO-SOURCE
> Task :streams:upgrade-system-tests-11:test
> Task :streams:upgrade-system-tests-20:compileJava NO-SOURCE
> Task :streams:upgrade-system-tests-20:processResources NO-SOURCE
> Task :streams:upgrade-system-tests-20:classes UP-TO-DATE
> Task :streams:upgrade-system-tests-20:checkstyleMain NO-SOURCE
> Task :streams:upgrade-system-tests-20:compileTestJava
> Task :streams:upgrade-system-tests-20:processTestResources NO-SOURCE
> Task :streams:upgrade-system-tests-20:testClasses
> Task :streams:upgrade-system-tests-20:checkstyleTest
> Task :streams:upgrade-system-tests-20:spotbugsMain NO-SOURCE
> Task :streams:upgrade-system-tests-20:test

FAILURE: Build failed with an exception.

* What went wrong:
Execution failed for task ':streams:test'.
> Process 'Gradle Test Executor 11' finished with non-zero exit value 1
  This problem might be caused by incorrect test process configuration.
  Please refer to the test execution section in the user guide at https://docs.gradle.org/4.10/userguide/java_plugin.html#sec:test_execution

* Try:
Run with --info or --debug option to get more log output. Run with --scan to get full insights.

* Exception is:
org.gradle.api.tasks.TaskExecutionException: Execution failed for task ':streams:test'.
	at org.gradle.api.internal.tasks.execution.ExecuteActionsTaskExecuter.executeActions(ExecuteActionsTaskExecuter.java:110)
	at org.gradle.api.internal.tasks.execution.ExecuteActionsTaskExecuter.execute(ExecuteActionsTaskExecuter.java:77)
	at org.gradle.api.internal.tasks.execution.OutputDirectoryCreatingTaskExecuter.execute(OutputDirectoryCreatingTaskExecuter.java:51)
	at org.gradle.api.internal.tasks.execution.SkipUpToDateTaskExecuter.execute(SkipUpToDateTaskExecuter.java:59)
	at org.gradle.api.internal.tasks.execution.ResolveTaskOutputCachingStateExecuter.execute(ResolveTaskOutputCachingStateExecuter.java:54)
	at org.gradle.api.internal.tasks.execution.ValidatingTaskExecuter.execute(ValidatingTaskExecuter.java:59)
	at org.gradle.api.internal.tasks.execution.SkipEmptySourceFilesTaskExecuter.execute(SkipEmptySourceFilesTaskExecuter.java:101)
	at org.gradle.api.internal.tasks.execution.FinalizeInputFilePropertiesTaskExecuter.execute(FinalizeInputFilePropertiesTaskExecuter.java:44)
	at org.gradle.api.internal.tasks.execution.CleanupStaleOutputsExecuter.execute(CleanupStaleOutputsExecuter.java:91)
	at org.gradle.api.internal.tasks.execution.ResolveTaskArtifactStateTaskExecuter.execute(ResolveTaskArtifactStateTaskExecuter.java:62)
	at org.gradle.api.internal.tasks.execution.SkipTaskWithNoActionsExecuter.execute(SkipTaskWithNoActionsExecuter.java:59)
	at org.gradle.api.internal.tasks.execution.SkipOnlyIfTaskExecuter.execute(SkipOnlyIfTaskExecuter.java:54)
	at org.gradle.api.internal.tasks.execution.ExecuteAtMostOnceTaskExecuter.execute(ExecuteAtMostOnceTaskExecuter.java:43)
	at org.gradle.api.internal.tasks.execution.CatchExceptionTaskExecuter.execute(CatchExceptionTaskExecuter.java:34)
	at org.gradle.api.internal.tasks.execution.EventFiringTaskExecuter$1.run(EventFiringTaskExecuter.java:51)
	at org.gradle.internal.operations.DefaultBuildOperationExecutor$RunnableBuildOperationWorker.execute(DefaultBuildOperationExecutor.java:300)
	at org.gradle.internal.operations.DefaultBuildOperationExecutor$RunnableBuildOperationWorker.execute(DefaultBuildOperationExecutor.java:292)
	at org.gradle.internal.operations.DefaultBuildOperationExecutor.execute(DefaultBuildOperationExecutor.java:174)
	at org.gradle.internal.operations.DefaultBuildOperationExecutor.run(DefaultBuildOperationExecutor.java:90)
	at org.gradle.internal.operations.DelegatingBuildOperationExecutor.run(DelegatingBuildOperationExecutor.java:31)
	at org.gradle.api.internal.tasks.execution.EventFiringTaskExecuter.execute(EventFiringTaskExecuter.java:46)
	at org.gradle.execution.taskgraph.LocalTaskInfoExecutor.execute(LocalTaskInfoExecutor.java:42)
	at org.gradle.execution.taskgraph.DefaultTaskExecutionGraph$BuildOperationAwareWorkItemExecutor.execute(DefaultTaskExecutionGraph.java:277)
	at org.gradle.execution.taskgraph.DefaultTaskExecutionGraph$BuildOperationAwareWorkItemExecutor.execute(DefaultTaskExecutionGraph.java:262)
	at org.gradle.execution.taskgraph.DefaultTaskPlanExecutor$ExecutorWorker$1.execute(DefaultTaskPlanExecutor.java:135)
	at org.gradle.execution.taskgraph.DefaultTaskPlanExecutor$ExecutorWorker$1.execute(DefaultTaskPlanExecutor.java:130)
	at org.gradle.execution.taskgraph.DefaultTaskPlanExecutor$ExecutorWorker.execute(DefaultTaskPlanExecutor.java:200)
	at org.gradle.execution.taskgraph.DefaultTaskPlanExecutor$ExecutorWorker.executeWithWork(DefaultTaskPlanExecutor.java:191)
	at org.gradle.execution.taskgraph.DefaultTaskPlanExecutor$ExecutorWorker.run(DefaultTaskPlanExecutor.java:130)
	at org.gradle.internal.concurrent.ExecutorPolicy$CatchAndRecordFailures.onExecute(ExecutorPolicy.java:63)
	at org.gradle.internal.concurrent.ManagedExecutorImpl$1.run(ManagedExecutorImpl.java:46)
	at org.gradle.internal.concurrent.ThreadFactoryImpl$ManagedThreadRunnable.run(ThreadFactoryImpl.java:55)
Caused by: org.gradle.process.internal.ExecException: Process 'Gradle Test Executor 11' finished
with non-zero exit value 1
This problem might be caused by incorrect test process configuration.
Please refer to the test execution section in the user guide at https://docs.gradle.org/4.10/userguide/java_plugin.html#sec:test_execution
	at org.gradle.api.internal.tasks.testing.worker.ForkingTestClassProcessor.stop(ForkingTestClassProcessor.java:155)
	at org.gradle.api.internal.tasks.testing.processors.RestartEveryNTestClassProcessor.endBatch(RestartEveryNTestClassProcessor.java:77)
	at org.gradle.api.internal.tasks.testing.processors.RestartEveryNTestClassProcessor.stop(RestartEveryNTestClassProcessor.java:62)
	at java.base/jdk.internal.reflect.NativeMethodAccessorImpl.invoke0(Native Method)
	at java.base/jdk.internal.reflect.NativeMethodAccessorImpl.invoke(NativeMethodAccessorImpl.java:62)
	at java.base/jdk.internal.reflect.DelegatingMethodAccessorImpl.invoke(DelegatingMethodAccessorImpl.java:43)
	at org.gradle.internal.dispatch.ReflectionDispatch.dispatch(ReflectionDispatch.java:35)
	at org.gradle.internal.dispatch.ReflectionDispatch.dispatch(ReflectionDispatch.java:24)
	at org.gradle.internal.dispatch.FailureHandlingDispatch.dispatch(FailureHandlingDispatch.java:29)
	at org.gradle.internal.dispatch.AsyncDispatch.dispatchMessages(AsyncDispatch.java:133)
	at org.gradle.internal.dispatch.AsyncDispatch.access$000(AsyncDispatch.java:34)
	at org.gradle.internal.dispatch.AsyncDispatch$1.run(AsyncDispatch.java:73)
	at org.gradle.internal.operations.CurrentBuildOperationPreservingRunnable.run(CurrentBuildOperationPreservingRunnable.java:42)
	... 3 more


* Get more help at https://help.gradle.org

BUILD FAILED in 2h 14m 33s
161 actionable tasks: 138 executed, 23 up-to-date
Build step 'Execute shell' marked build as failure
[FINDBUGS] Skipping publisher since build result is FAILURE
Recording test results
Setting GRADLE_4_8_1_HOME=/home/jenkins/tools/gradle/4.8.1
Setting GRADLE_4_8_1_HOME=/home/jenkins/tools/gradle/4.8.1

Mime
View raw message