kafka-dev mailing list archives

Site index · List index
Message view « Date » · « Thread »
Top « Date » · « Thread »
From Apache Jenkins Server <jenk...@builds.apache.org>
Subject Build failed in Jenkins: kafka-trunk-jdk10 #511
Date Fri, 21 Sep 2018 19:24:07 GMT
See <https://builds.apache.org/job/kafka-trunk-jdk10/511/display/redirect?page=changes>

Changes:

[mjsax] MINOR: rename InternalProcessorContext.initialized (#5672)

------------------------------------------
[...truncated 1.40 MB...]

org.apache.kafka.connect.transforms.RegexRouterTest > addSuffix PASSED

org.apache.kafka.connect.transforms.RegexRouterTest > slice STARTED

org.apache.kafka.connect.transforms.RegexRouterTest > slice PASSED

org.apache.kafka.connect.transforms.RegexRouterTest > staticReplacement STARTED

org.apache.kafka.connect.transforms.RegexRouterTest > staticReplacement PASSED

org.apache.kafka.connect.transforms.SetSchemaMetadataTest > schemaNameUpdate STARTED

org.apache.kafka.connect.transforms.SetSchemaMetadataTest > schemaNameUpdate PASSED

org.apache.kafka.connect.transforms.SetSchemaMetadataTest > schemaNameAndVersionUpdateWithStruct
STARTED

org.apache.kafka.connect.transforms.SetSchemaMetadataTest > schemaNameAndVersionUpdateWithStruct
PASSED

org.apache.kafka.connect.transforms.SetSchemaMetadataTest > updateSchemaOfStruct STARTED

org.apache.kafka.connect.transforms.SetSchemaMetadataTest > updateSchemaOfStruct PASSED

org.apache.kafka.connect.transforms.SetSchemaMetadataTest > schemaNameAndVersionUpdate
STARTED

org.apache.kafka.connect.transforms.SetSchemaMetadataTest > schemaNameAndVersionUpdate
PASSED

org.apache.kafka.connect.transforms.SetSchemaMetadataTest > updateSchemaOfNull STARTED

org.apache.kafka.connect.transforms.SetSchemaMetadataTest > updateSchemaOfNull PASSED

org.apache.kafka.connect.transforms.SetSchemaMetadataTest > schemaVersionUpdate STARTED

org.apache.kafka.connect.transforms.SetSchemaMetadataTest > schemaVersionUpdate PASSED

org.apache.kafka.connect.transforms.SetSchemaMetadataTest > updateSchemaOfNonStruct STARTED

org.apache.kafka.connect.transforms.SetSchemaMetadataTest > updateSchemaOfNonStruct PASSED

org.apache.kafka.connect.transforms.TimestampRouterTest > defaultConfiguration STARTED

org.apache.kafka.connect.transforms.TimestampRouterTest > defaultConfiguration PASSED

org.apache.kafka.connect.transforms.ExtractFieldTest > withSchema STARTED

org.apache.kafka.connect.transforms.ExtractFieldTest > withSchema PASSED

org.apache.kafka.connect.transforms.ExtractFieldTest > testNullWithSchema STARTED

org.apache.kafka.connect.transforms.ExtractFieldTest > testNullWithSchema PASSED

org.apache.kafka.connect.transforms.ExtractFieldTest > schemaless STARTED

org.apache.kafka.connect.transforms.ExtractFieldTest > schemaless PASSED

org.apache.kafka.connect.transforms.ExtractFieldTest > testNullSchemaless STARTED

org.apache.kafka.connect.transforms.ExtractFieldTest > testNullSchemaless PASSED

org.apache.kafka.connect.transforms.ValueToKeyTest > withSchema STARTED

org.apache.kafka.connect.transforms.ValueToKeyTest > withSchema PASSED

org.apache.kafka.connect.transforms.ValueToKeyTest > schemaless STARTED

org.apache.kafka.connect.transforms.ValueToKeyTest > schemaless PASSED

> Task :streams:examples:processResources NO-SOURCE
> Task :streams:examples:processTestResources NO-SOURCE
> Task :spotlessScala
> Task :spotlessScalaCheck
> Task :streams:streams-scala:processResources NO-SOURCE
> Task :streams:streams-scala:processTestResources
> Task :streams:test-utils:processTestResources NO-SOURCE
> Task :streams:upgrade-system-tests-0100:compileJava NO-SOURCE
> Task :streams:upgrade-system-tests-0100:processResources NO-SOURCE
> Task :streams:upgrade-system-tests-0100:classes UP-TO-DATE
> Task :streams:upgrade-system-tests-0100:checkstyleMain NO-SOURCE
> Task :streams:upgrade-system-tests-0100:compileTestJava
> Task :streams:upgrade-system-tests-0100:processTestResources NO-SOURCE
> Task :streams:upgrade-system-tests-0100:testClasses
> Task :streams:upgrade-system-tests-0100:checkstyleTest
> Task :streams:upgrade-system-tests-0100:spotbugsMain NO-SOURCE
> Task :streams:upgrade-system-tests-0100:test
> Task :streams:upgrade-system-tests-0101:compileJava NO-SOURCE
> Task :streams:upgrade-system-tests-0101:processResources NO-SOURCE
> Task :streams:upgrade-system-tests-0101:classes UP-TO-DATE
> Task :streams:upgrade-system-tests-0101:checkstyleMain NO-SOURCE
> Task :streams:upgrade-system-tests-0101:compileTestJava
> Task :streams:upgrade-system-tests-0101:processTestResources NO-SOURCE
> Task :streams:upgrade-system-tests-0101:testClasses
> Task :streams:upgrade-system-tests-0101:checkstyleTest
> Task :streams:upgrade-system-tests-0101:spotbugsMain NO-SOURCE
> Task :streams:upgrade-system-tests-0101:test
> Task :streams:upgrade-system-tests-0102:compileJava NO-SOURCE
> Task :streams:upgrade-system-tests-0102:processResources NO-SOURCE
> Task :streams:upgrade-system-tests-0102:classes UP-TO-DATE
> Task :streams:upgrade-system-tests-0102:checkstyleMain NO-SOURCE
> Task :streams:upgrade-system-tests-0102:compileTestJava
> Task :streams:upgrade-system-tests-0102:processTestResources NO-SOURCE
> Task :streams:upgrade-system-tests-0102:testClasses
> Task :streams:upgrade-system-tests-0102:checkstyleTest
> Task :streams:upgrade-system-tests-0102:spotbugsMain NO-SOURCE
> Task :streams:upgrade-system-tests-0102:test
> Task :streams:upgrade-system-tests-0110:compileJava NO-SOURCE
> Task :streams:upgrade-system-tests-0110:processResources NO-SOURCE
> Task :streams:upgrade-system-tests-0110:classes UP-TO-DATE
> Task :streams:upgrade-system-tests-0110:checkstyleMain NO-SOURCE
> Task :streams:upgrade-system-tests-0110:compileTestJava
> Task :streams:upgrade-system-tests-0110:processTestResources NO-SOURCE
> Task :streams:upgrade-system-tests-0110:testClasses
> Task :streams:upgrade-system-tests-0110:checkstyleTest
> Task :streams:upgrade-system-tests-0110:spotbugsMain NO-SOURCE
> Task :streams:upgrade-system-tests-0110:test
> Task :streams:upgrade-system-tests-10:compileJava NO-SOURCE
> Task :streams:upgrade-system-tests-10:processResources NO-SOURCE
> Task :streams:upgrade-system-tests-10:classes UP-TO-DATE
> Task :streams:upgrade-system-tests-10:checkstyleMain NO-SOURCE
> Task :streams:upgrade-system-tests-10:compileTestJava
> Task :streams:upgrade-system-tests-10:processTestResources NO-SOURCE
> Task :streams:upgrade-system-tests-10:testClasses
> Task :streams:upgrade-system-tests-10:checkstyleTest
> Task :streams:upgrade-system-tests-10:spotbugsMain NO-SOURCE
> Task :streams:upgrade-system-tests-10:test
> Task :streams:upgrade-system-tests-11:compileJava NO-SOURCE
> Task :streams:upgrade-system-tests-11:processResources NO-SOURCE
> Task :streams:upgrade-system-tests-11:classes UP-TO-DATE
> Task :streams:upgrade-system-tests-11:checkstyleMain NO-SOURCE
> Task :streams:upgrade-system-tests-11:compileTestJava
> Task :streams:upgrade-system-tests-11:processTestResources NO-SOURCE
> Task :streams:upgrade-system-tests-11:testClasses
> Task :streams:upgrade-system-tests-11:checkstyleTest
> Task :streams:upgrade-system-tests-11:spotbugsMain NO-SOURCE
> Task :streams:upgrade-system-tests-11:test
> Task :streams:upgrade-system-tests-20:compileJava NO-SOURCE
> Task :streams:upgrade-system-tests-20:processResources NO-SOURCE
> Task :streams:upgrade-system-tests-20:classes UP-TO-DATE
> Task :streams:upgrade-system-tests-20:checkstyleMain NO-SOURCE
> Task :streams:upgrade-system-tests-20:compileTestJava
> Task :streams:upgrade-system-tests-20:processTestResources NO-SOURCE
> Task :streams:upgrade-system-tests-20:testClasses
> Task :streams:upgrade-system-tests-20:checkstyleTest
> Task :streams:upgrade-system-tests-20:spotbugsMain NO-SOURCE
> Task :streams:upgrade-system-tests-20:test

FAILURE: Build failed with an exception.

* What went wrong:
Execution failed for task ':core:compileTestScala'.
> Compilation failed

* Try:
Run with --info or --debug option to get more log output. Run with --scan to get full insights.

* Exception is:
org.gradle.api.tasks.TaskExecutionException: Execution failed for task ':core:compileTestScala'.
	at org.gradle.api.internal.tasks.execution.ExecuteActionsTaskExecuter.executeActions(ExecuteActionsTaskExecuter.java:110)
	at org.gradle.api.internal.tasks.execution.ExecuteActionsTaskExecuter.execute(ExecuteActionsTaskExecuter.java:77)
	at org.gradle.api.internal.tasks.execution.OutputDirectoryCreatingTaskExecuter.execute(OutputDirectoryCreatingTaskExecuter.java:51)
	at org.gradle.api.internal.tasks.execution.SkipUpToDateTaskExecuter.execute(SkipUpToDateTaskExecuter.java:59)
	at org.gradle.api.internal.tasks.execution.ResolveTaskOutputCachingStateExecuter.execute(ResolveTaskOutputCachingStateExecuter.java:54)
	at org.gradle.api.internal.tasks.execution.ValidatingTaskExecuter.execute(ValidatingTaskExecuter.java:59)
	at org.gradle.api.internal.tasks.execution.SkipEmptySourceFilesTaskExecuter.execute(SkipEmptySourceFilesTaskExecuter.java:101)
	at org.gradle.api.internal.tasks.execution.FinalizeInputFilePropertiesTaskExecuter.execute(FinalizeInputFilePropertiesTaskExecuter.java:44)
	at org.gradle.api.internal.tasks.execution.CleanupStaleOutputsExecuter.execute(CleanupStaleOutputsExecuter.java:91)
	at org.gradle.api.internal.tasks.execution.ResolveTaskArtifactStateTaskExecuter.execute(ResolveTaskArtifactStateTaskExecuter.java:62)
	at org.gradle.api.internal.tasks.execution.SkipTaskWithNoActionsExecuter.execute(SkipTaskWithNoActionsExecuter.java:59)
	at org.gradle.api.internal.tasks.execution.SkipOnlyIfTaskExecuter.execute(SkipOnlyIfTaskExecuter.java:54)
	at org.gradle.api.internal.tasks.execution.ExecuteAtMostOnceTaskExecuter.execute(ExecuteAtMostOnceTaskExecuter.java:43)
	at org.gradle.api.internal.tasks.execution.CatchExceptionTaskExecuter.execute(CatchExceptionTaskExecuter.java:34)
	at org.gradle.api.internal.tasks.execution.EventFiringTaskExecuter$1.run(EventFiringTaskExecuter.java:51)
	at org.gradle.internal.operations.DefaultBuildOperationExecutor$RunnableBuildOperationWorker.execute(DefaultBuildOperationExecutor.java:300)
	at org.gradle.internal.operations.DefaultBuildOperationExecutor$RunnableBuildOperationWorker.execute(DefaultBuildOperationExecutor.java:292)
	at org.gradle.internal.operations.DefaultBuildOperationExecutor.execute(DefaultBuildOperationExecutor.java:174)
	at org.gradle.internal.operations.DefaultBuildOperationExecutor.run(DefaultBuildOperationExecutor.java:90)
	at org.gradle.internal.operations.DelegatingBuildOperationExecutor.run(DelegatingBuildOperationExecutor.java:31)
	at org.gradle.api.internal.tasks.execution.EventFiringTaskExecuter.execute(EventFiringTaskExecuter.java:46)
	at org.gradle.execution.taskgraph.LocalTaskInfoExecutor.execute(LocalTaskInfoExecutor.java:42)
	at org.gradle.execution.taskgraph.DefaultTaskExecutionGraph$BuildOperationAwareWorkItemExecutor.execute(DefaultTaskExecutionGraph.java:277)
	at org.gradle.execution.taskgraph.DefaultTaskExecutionGraph$BuildOperationAwareWorkItemExecutor.execute(DefaultTaskExecutionGraph.java:262)
	at org.gradle.execution.taskgraph.DefaultTaskPlanExecutor$ExecutorWorker$1.execute(DefaultTaskPlanExecutor.java:135)
	at org.gradle.execution.taskgraph.DefaultTaskPlanExecutor$ExecutorWorker$1.execute(DefaultTaskPlanExecutor.java:130)
	at org.gradle.execution.taskgraph.DefaultTaskPlanExecutor$ExecutorWorker.execute(DefaultTaskPlanExecutor.java:200)
	at org.gradle.execution.taskgraph.DefaultTaskPlanExecutor$ExecutorWorker.executeWithWork(DefaultTaskPlanExecutor.java:191)
	at org.gradle.execution.taskgraph.DefaultTaskPlanExecutor$ExecutorWorker.run(DefaultTaskPlanExecutor.java:130)
	at org.gradle.internal.concurrent.ExecutorPolicy$CatchAndRecordFailures.onExecute(ExecutorPolicy.java:63)
	at org.gradle.internal.concurrent.ManagedExecutorImpl$1.run(ManagedExecutorImpl.java:46)
	at org.gradle.internal.concurrent.ThreadFactoryImpl$ManagedThreadRunnable.run(ThreadFactoryImpl.java:55)
Caused by: org.gradle.api.internal.tasks.compile.CompilationFailedException: Compilation failed
	at org.gradle.api.internal.tasks.scala.ZincScalaCompiler$Compiler.execute(ZincScalaCompiler.java:83)
	at org.gradle.api.internal.tasks.scala.ZincScalaCompiler.execute(ZincScalaCompiler.java:52)
	at org.gradle.api.internal.tasks.scala.ZincScalaCompiler.execute(ZincScalaCompiler.java:38)
	at org.gradle.api.internal.tasks.compile.daemon.AbstractDaemonCompiler$CompilerCallable.call(AbstractDaemonCompiler.java:88)
	at org.gradle.api.internal.tasks.compile.daemon.AbstractDaemonCompiler$CompilerCallable.call(AbstractDaemonCompiler.java:76)
	at org.gradle.workers.internal.DefaultWorkerServer.execute(DefaultWorkerServer.java:42)
	at org.gradle.workers.internal.WorkerDaemonServer.execute(WorkerDaemonServer.java:46)
	at org.gradle.workers.internal.WorkerDaemonServer.execute(WorkerDaemonServer.java:30)
	at java.base/jdk.internal.reflect.NativeMethodAccessorImpl.invoke0(Native Method)
	at java.base/jdk.internal.reflect.NativeMethodAccessorImpl.invoke(NativeMethodAccessorImpl.java:62)
	at java.base/jdk.internal.reflect.DelegatingMethodAccessorImpl.invoke(DelegatingMethodAccessorImpl.java:43)
	at org.gradle.process.internal.worker.request.WorkerAction.run(WorkerAction.java:101)
	at java.base/jdk.internal.reflect.NativeMethodAccessorImpl.invoke0(Native Method)
	at java.base/jdk.internal.reflect.NativeMethodAccessorImpl.invoke(NativeMethodAccessorImpl.java:62)
	at java.base/jdk.internal.reflect.DelegatingMethodAccessorImpl.invoke(DelegatingMethodAccessorImpl.java:43)
	at org.gradle.internal.dispatch.ReflectionDispatch.dispatch(ReflectionDispatch.java:35)
	at org.gradle.internal.dispatch.ReflectionDispatch.dispatch(ReflectionDispatch.java:24)
	at org.gradle.internal.remote.internal.hub.MessageHubBackedObjectConnection$DispatchWrapper.dispatch(MessageHubBackedObjectConnection.java:155)
	at org.gradle.internal.remote.internal.hub.MessageHubBackedObjectConnection$DispatchWrapper.dispatch(MessageHubBackedObjectConnection.java:137)
	at org.gradle.internal.remote.internal.hub.MessageHub$Handler.run(MessageHub.java:404)
	... 3 more
Caused by: Compilation failed
	at sbt.compiler.AnalyzingCompiler.call(AnalyzingCompiler.scala:111)
	at sbt.compiler.AnalyzingCompiler.compile(AnalyzingCompiler.scala:53)
	at sbt.compiler.AnalyzingCompiler.compile(AnalyzingCompiler.scala:47)
	at sbt.compiler.AggressiveCompile$$anonfun$3$$anonfun$compileScala$1$1.apply$mcV$sp(AggressiveCompile.scala:95)
	at sbt.compiler.AggressiveCompile$$anonfun$3$$anonfun$compileScala$1$1.apply(AggressiveCompile.scala:95)
	at sbt.compiler.AggressiveCompile$$anonfun$3$$anonfun$compileScala$1$1.apply(AggressiveCompile.scala:95)
	at sbt.compiler.AggressiveCompile.sbt$compiler$AggressiveCompile$$timed(AggressiveCompile.scala:168)
	at sbt.compiler.AggressiveCompile$$anonfun$3.compileScala$1(AggressiveCompile.scala:94)
	at sbt.compiler.AggressiveCompile$$anonfun$3.apply(AggressiveCompile.scala:142)
	at sbt.compiler.AggressiveCompile$$anonfun$3.apply(AggressiveCompile.scala:84)
	at sbt.inc.IncrementalCompile$$anonfun$doCompile$1.apply(Compile.scala:66)
	at sbt.inc.IncrementalCompile$$anonfun$doCompile$1.apply(Compile.scala:64)
	at sbt.inc.IncrementalCommon.cycle(IncrementalCommon.scala:32)
	at sbt.inc.Incremental$$anonfun$1.apply(Incremental.scala:72)
	at sbt.inc.Incremental$$anonfun$1.apply(Incremental.scala:71)
	at sbt.inc.Incremental$.manageClassfiles(Incremental.scala:99)
	at sbt.inc.Incremental$.compile(Incremental.scala:71)
	at sbt.inc.IncrementalCompile$.apply(Compile.scala:54)
	at sbt.compiler.AggressiveCompile.compile2(AggressiveCompile.scala:159)
	at sbt.compiler.AggressiveCompile.compile1(AggressiveCompile.scala:68)
	at com.typesafe.zinc.Compiler.compile(Compiler.scala:207)
	at com.typesafe.zinc.Compiler.compile(Compiler.scala:189)
	at com.typesafe.zinc.Compiler.compile(Compiler.scala:180)
	at com.typesafe.zinc.Compiler.compile(Compiler.scala:171)
	at org.gradle.api.internal.tasks.scala.ZincScalaCompiler$Compiler.execute(ZincScalaCompiler.java:81)
	... 22 more


* Get more help at https://help.gradle.org

BUILD FAILED in 14m 37s
134 actionable tasks: 111 executed, 23 up-to-date
Build step 'Execute shell' marked build as failure
[FINDBUGS] Skipping publisher since build result is FAILURE
Recording test results
Setting GRADLE_4_8_1_HOME=/home/jenkins/tools/gradle/4.8.1
Setting GRADLE_4_8_1_HOME=/home/jenkins/tools/gradle/4.8.1
Not sending mail to unregistered user wangguoz@gmail.com

Mime
View raw message