kafka-dev mailing list archives

Site index · List index
Message view « Date » · « Thread »
Top « Date » · « Thread »
From Apache Jenkins Server <jenk...@builds.apache.org>
Subject Build failed in Jenkins: kafka-trunk-jdk8 #2988
Date Tue, 25 Sep 2018 08:58:37 GMT
See <https://builds.apache.org/job/kafka-trunk-jdk8/2988/display/redirect?page=changes>

Changes:

[lindong28] KAFKA-5066; Add KafkaMetricsConfig (Yammer metrics reporters) props to

------------------------------------------
[...truncated 10.19 MB...]
	at com.diffplug.spotless.scala.ScalaFmtStep$State.<init>(ScalaFmtStep.java:67)
	at com.diffplug.spotless.scala.ScalaFmtStep.lambda$create$0(ScalaFmtStep.java:52)
	at com.diffplug.spotless.FormatterStepImpl.calculateState(FormatterStepImpl.java:56)
	at com.diffplug.spotless.LazyForwardingEquality.state(LazyForwardingEquality.java:56)
	at com.diffplug.spotless.LazyForwardingEquality.toBytes(LazyForwardingEquality.java:85)
	at com.diffplug.spotless.LazyForwardingEquality.hashCode(LazyForwardingEquality.java:102)
	at java.lang.Object.toString(Object.java:236)
	at java.lang.String.valueOf(String.java:2994)
	at java.lang.StringBuilder.append(StringBuilder.java:131)
	at java.util.AbstractCollection.toString(AbstractCollection.java:462)
	at java.util.Collections$UnmodifiableCollection.toString(Collections.java:1035)
	at java.util.Formatter$FormatSpecifier.printString(Formatter.java:2886)
	at java.util.Formatter$FormatSpecifier.print(Formatter.java:2763)
	at java.util.Formatter.format(Formatter.java:2520)
	at java.util.Formatter.format(Formatter.java:2455)
	at java.lang.String.format(String.java:2940)
	at org.gradle.api.internal.changedetection.state.CacheBackedTaskHistoryRepository.snapshotTaskInputProperties(CacheBackedTaskHistoryRepository.java:343)
	at org.gradle.api.internal.changedetection.state.CacheBackedTaskHistoryRepository.createExecution(CacheBackedTaskHistoryRepository.java:158)
	at org.gradle.api.internal.changedetection.state.CacheBackedTaskHistoryRepository.access$100(CacheBackedTaskHistoryRepository.java:76)
	at org.gradle.api.internal.changedetection.state.CacheBackedTaskHistoryRepository$1.getCurrentExecution(CacheBackedTaskHistoryRepository.java:123)
	at org.gradle.api.internal.changedetection.changes.DefaultTaskArtifactStateRepository$TaskArtifactStateImpl.getStates(DefaultTaskArtifactStateRepository.java:200)
	at org.gradle.api.internal.changedetection.changes.DefaultTaskArtifactStateRepository$TaskArtifactStateImpl.isUpToDate(DefaultTaskArtifactStateRepository.java:94)
	at org.gradle.api.internal.tasks.execution.SkipUpToDateTaskExecuter.execute(SkipUpToDateTaskExecuter.java:50)
	at org.gradle.api.internal.tasks.execution.ResolveTaskOutputCachingStateExecuter.execute(ResolveTaskOutputCachingStateExecuter.java:54)
	at org.gradle.api.internal.tasks.execution.ValidatingTaskExecuter.execute(ValidatingTaskExecuter.java:59)
	at org.gradle.api.internal.tasks.execution.SkipEmptySourceFilesTaskExecuter.execute(SkipEmptySourceFilesTaskExecuter.java:101)
	at org.gradle.api.internal.tasks.execution.FinalizeInputFilePropertiesTaskExecuter.execute(FinalizeInputFilePropertiesTaskExecuter.java:44)
	at org.gradle.api.internal.tasks.execution.CleanupStaleOutputsExecuter.execute(CleanupStaleOutputsExecuter.java:91)
	at org.gradle.api.internal.tasks.execution.ResolveTaskArtifactStateTaskExecuter.execute(ResolveTaskArtifactStateTaskExecuter.java:62)
	at org.gradle.api.internal.tasks.execution.SkipTaskWithNoActionsExecuter.execute(SkipTaskWithNoActionsExecuter.java:59)
	at org.gradle.api.internal.tasks.execution.SkipOnlyIfTaskExecuter.execute(SkipOnlyIfTaskExecuter.java:54)
	at org.gradle.api.internal.tasks.execution.ExecuteAtMostOnceTaskExecuter.execute(ExecuteAtMostOnceTaskExecuter.java:43)
	at org.gradle.api.internal.tasks.execution.CatchExceptionTaskExecuter.execute(CatchExceptionTaskExecuter.java:34)
	at org.gradle.api.internal.tasks.execution.EventFiringTaskExecuter$1.run(EventFiringTaskExecuter.java:51)
	at org.gradle.internal.operations.DefaultBuildOperationExecutor$RunnableBuildOperationWorker.execute(DefaultBuildOperationExecutor.java:300)
	at org.gradle.internal.operations.DefaultBuildOperationExecutor$RunnableBuildOperationWorker.execute(DefaultBuildOperationExecutor.java:292)
	at org.gradle.internal.operations.DefaultBuildOperationExecutor.execute(DefaultBuildOperationExecutor.java:174)
	at org.gradle.internal.operations.DefaultBuildOperationExecutor.run(DefaultBuildOperationExecutor.java:90)
	at org.gradle.internal.operations.DelegatingBuildOperationExecutor.run(DelegatingBuildOperationExecutor.java:31)
	at org.gradle.api.internal.tasks.execution.EventFiringTaskExecuter.execute(EventFiringTaskExecuter.java:46)
	at org.gradle.execution.taskgraph.LocalTaskInfoExecutor.execute(LocalTaskInfoExecutor.java:42)
	at org.gradle.execution.taskgraph.DefaultTaskExecutionGraph$BuildOperationAwareWorkItemExecutor.execute(DefaultTaskExecutionGraph.java:277)
	at org.gradle.execution.taskgraph.DefaultTaskExecutionGraph$BuildOperationAwareWorkItemExecutor.execute(DefaultTaskExecutionGraph.java:262)
	at org.gradle.execution.taskgraph.DefaultTaskPlanExecutor$ExecutorWorker$1.execute(DefaultTaskPlanExecutor.java:135)
	at org.gradle.execution.taskgraph.DefaultTaskPlanExecutor$ExecutorWorker$1.execute(DefaultTaskPlanExecutor.java:130)
	at org.gradle.execution.taskgraph.DefaultTaskPlanExecutor$ExecutorWorker.execute(DefaultTaskPlanExecutor.java:200)
	at org.gradle.execution.taskgraph.DefaultTaskPlanExecutor$ExecutorWorker.executeWithWork(DefaultTaskPlanExecutor.java:191)
	at org.gradle.execution.taskgraph.DefaultTaskPlanExecutor$ExecutorWorker.run(DefaultTaskPlanExecutor.java:130)
	at org.gradle.internal.concurrent.ExecutorPolicy$CatchAndRecordFailures.onExecute(ExecutorPolicy.java:63)
	at org.gradle.internal.concurrent.ManagedExecutorImpl$1.run(ManagedExecutorImpl.java:46)
	at java.util.concurrent.ThreadPoolExecutor.runWorker(ThreadPoolExecutor.java:1149)
	at java.util.concurrent.ThreadPoolExecutor$Worker.run(ThreadPoolExecutor.java:624)
	at org.gradle.internal.concurrent.ThreadFactoryImpl$ManagedThreadRunnable.run(ThreadFactoryImpl.java:55)
	at java.lang.Thread.run(Thread.java:748)
Caused by: java.lang.RuntimeException: Problems writing to Binary store in /tmp/gradle584301950595994297.bin
(exist: true)
	at org.gradle.api.internal.artifacts.ivyservice.resolveengine.store.DefaultBinaryStore.write(DefaultBinaryStore.java:60)
	at org.gradle.api.internal.artifacts.ivyservice.resolveengine.result.StreamingResolutionResultBuilder.visitEdges(StreamingResolutionResultBuilder.java:127)
	at org.gradle.api.internal.artifacts.ivyservice.resolveengine.graph.CompositeDependencyGraphVisitor.visitEdges(CompositeDependencyGraphVisitor.java:53)
	at org.gradle.api.internal.artifacts.ivyservice.resolveengine.graph.CompositeDependencyGraphVisitor.visitEdges(CompositeDependencyGraphVisitor.java:53)
	at org.gradle.api.internal.artifacts.ivyservice.resolveengine.graph.builder.DependencyGraphBuilder.assembleResult(DependencyGraphBuilder.java:403)
	at org.gradle.api.internal.artifacts.ivyservice.resolveengine.graph.builder.DependencyGraphBuilder.resolve(DependencyGraphBuilder.java:130)
	at org.gradle.api.internal.artifacts.ivyservice.resolveengine.DefaultArtifactDependencyResolver.resolve(DefaultArtifactDependencyResolver.java:123)
	at org.gradle.api.internal.artifacts.ivyservice.DefaultConfigurationResolver.resolveGraph(DefaultConfigurationResolver.java:167)
	at org.gradle.api.internal.artifacts.ivyservice.ShortCircuitEmptyConfigurationResolver.resolveGraph(ShortCircuitEmptyConfigurationResolver.java:89)
	at org.gradle.api.internal.artifacts.ivyservice.ErrorHandlingConfigurationResolver.resolveGraph(ErrorHandlingConfigurationResolver.java:73)
	... 71 more
Caused by: com.esotericsoftware.kryo.KryoException: java.io.IOException: No space left on
device
	at com.esotericsoftware.kryo.io.Output.flush(Output.java:156)
	at com.esotericsoftware.kryo.io.Output.require(Output.java:134)
	at com.esotericsoftware.kryo.io.Output.writeLong(Output.java:494)
	at org.gradle.internal.serialize.kryo.StringDeduplicatingKryoBackedEncoder.writeSmallLong(StringDeduplicatingKryoBackedEncoder.java:55)
	at org.gradle.api.internal.artifacts.ivyservice.resolveengine.result.DependencyResultSerializer.write(DependencyResultSerializer.java:53)
	at org.gradle.api.internal.artifacts.ivyservice.resolveengine.result.StreamingResolutionResultBuilder$4.write(StreamingResolutionResultBuilder.java:133)
	at org.gradle.api.internal.artifacts.ivyservice.resolveengine.store.DefaultBinaryStore.write(DefaultBinaryStore.java:58)
	... 80 more
Caused by: java.io.IOException: No space left on device
	at java.io.FileOutputStream.writeBytes(Native Method)
	at java.io.FileOutputStream.write(FileOutputStream.java:326)
	at com.esotericsoftware.kryo.io.Output.flush(Output.java:154)
	... 86 more

> Task :streams:streams-scala:processResources NO-SOURCE
> Task :streams:streams-scala:processTestResources UP-TO-DATE
> Task :streams:test-utils:processTestResources NO-SOURCE

FAILURE: Build completed with 13 failures.

1: Task failed with an exception.
-----------
* What went wrong:
Execution failed for task ':kafka-trunk-jdk8:core:test'.
> Process 'Gradle Test Executor 3' finished with non-zero exit value 1
  This problem might be caused by incorrect test process configuration.
  Please refer to the test execution section in the user guide at https://docs.gradle.org/4.10/userguide/java_plugin.html#sec:test_execution

* Try:
Run with --stacktrace option to get the stack trace. Run with --info or --debug option to
get more log output. Run with --scan to get full insights.
==============================================================================

2: Task failed with an exception.
-----------
* What went wrong:
Execution failed for task ':kafka-trunk-jdk8:core:test'.
> java.io.IOException: No space left on device

* Try:
Run with --stacktrace option to get the stack trace. Run with --info or --debug option to
get more log output. Run with --scan to get full insights.
==============================================================================

3: Task failed with an exception.
-----------
* What went wrong:
Execution failed for task ':clients:checkstyleMain'.
> javax.xml.transform.TransformerException: javax.xml.transform.TransformerException: com.sun.org.apache.xml.internal.utils.WrappedRuntimeException:
XML document structures must start and end within the same entity.

* Try:
Run with --stacktrace option to get the stack trace. Run with --info or --debug option to
get more log output. Run with --scan to get full insights.
==============================================================================

4: Task failed with an exception.
-----------
* What went wrong:
Execution failed for task ':clients:compileTestJava'.
> Compilation failed; see the compiler error output for details.

* Try:
Run with --stacktrace option to get the stack trace. Run with --info or --debug option to
get more log output. Run with --scan to get full insights.
==============================================================================

5: Task failed with an exception.
-----------
* What went wrong:
Could not resolve all dependencies for configuration ':clients:spotbugs'.
> java.io.IOException: No space left on device

* Try:
Run with --stacktrace option to get the stack trace. Run with --info or --debug option to
get more log output. Run with --scan to get full insights.
==============================================================================

6: Task failed with an exception.
-----------
* What went wrong:
Could not resolve all dependencies for configuration ':core:compileClasspath'.
> java.io.IOException: No space left on device

* Try:
Run with --stacktrace option to get the stack trace. Run with --info or --debug option to
get more log output. Run with --scan to get full insights.
==============================================================================

7: Task failed with an exception.
-----------
* What went wrong:
Could not resolve all dependencies for configuration ':log4j-appender:compileClasspath'.
> java.io.IOException: No space left on device

* Try:
Run with --stacktrace option to get the stack trace. Run with --info or --debug option to
get more log output. Run with --scan to get full insights.
==============================================================================

8: Task failed with an exception.
-----------
* What went wrong:
Could not resolve all dependencies for configuration ':connect:api:compileClasspath'.
> java.io.IOException: No space left on device

* Try:
Run with --stacktrace option to get the stack trace. Run with --info or --debug option to
get more log output. Run with --scan to get full insights.
==============================================================================

9: Task failed with an exception.
-----------
* What went wrong:
Failed to create parent directory '<https://builds.apache.org/job/kafka-trunk-jdk8/ws/tools/build'>
when creating directory '<https://builds.apache.org/job/kafka-trunk-jdk8/ws/tools/build/resources/test'>

* Try:
Run with --stacktrace option to get the stack trace. Run with --info or --debug option to
get more log output. Run with --scan to get full insights.
==============================================================================

10: Task failed with an exception.
-----------
* What went wrong:
Failed to create parent directory '<https://builds.apache.org/job/kafka-trunk-jdk8/ws/connect/basic-auth-extension/build'>
when creating directory '<https://builds.apache.org/job/kafka-trunk-jdk8/ws/connect/basic-auth-extension/build/resources/main'>

* Try:
Run with --stacktrace option to get the stack trace. Run with --info or --debug option to
get more log output. Run with --scan to get full insights.
==============================================================================

11: Task failed with an exception.
-----------
* What went wrong:
Failed to create parent directory '<https://builds.apache.org/job/kafka-trunk-jdk8/ws/connect/json/build/resources'>
when creating directory '<https://builds.apache.org/job/kafka-trunk-jdk8/ws/connect/json/build/resources/test'>

* Try:
Run with --stacktrace option to get the stack trace. Run with --info or --debug option to
get more log output. Run with --scan to get full insights.
==============================================================================

12: Task failed with an exception.
-----------
* What went wrong:
Failed to create parent directory '<https://builds.apache.org/job/kafka-trunk-jdk8/ws/connect/runtime/build'>
when creating directory '<https://builds.apache.org/job/kafka-trunk-jdk8/ws/connect/runtime/build/resources/test'>

* Try:
Run with --stacktrace option to get the stack trace. Run with --info or --debug option to
get more log output. Run with --scan to get full insights.
==============================================================================

13: Task failed with an exception.
-----------
* What went wrong:
Could not resolve all dependencies for configuration ':detachedConfiguration3'.
> Problems writing to Binary store in /tmp/gradle584301950595994297.bin (exist: true)

* Try:
Run with --stacktrace option to get the stack trace. Run with --info or --debug option to
get more log output. Run with --scan to get full insights.
==============================================================================

* Get more help at https://help.gradle.org

BUILD FAILED in 1h 45m 48s
46 actionable tasks: 16 executed, 30 up-to-date

FAILURE: Build failed with an exception.

* What went wrong:
Could not add entry ':clients:checkstyleMain' to cache taskHistory.bin (<https://builds.apache.org/job/kafka-trunk-jdk8/ws/.gradle/4.10/taskHistory/taskHistory.bin).>
> java.io.IOException: No space left on device

* Try:
Run with --stacktrace option to get the stack trace. Run with --info or --debug option to
get more log output. Run with --scan to get full insights.

* Get more help at https://help.gradle.org

BUILD FAILED in 1h 45m 49s
Build step 'Execute shell' marked build as failure
[FINDBUGS] Collecting findbugs analysis files...
Setting GRADLE_4_8_1_HOME=/home/jenkins/tools/gradle/4.8.1
[FINDBUGS] Searching for all files in <https://builds.apache.org/job/kafka-trunk-jdk8/ws/>
that match the pattern **/build/reports/*bugs/*.xml
[FINDBUGS] Parsing 2 files in <https://builds.apache.org/job/kafka-trunk-jdk8/ws/>
[FINDBUGS] Successfully parsed file <https://builds.apache.org/job/kafka-trunk-jdk8/ws/core/build/reports/spotbugs/main.xml>
with 0 unique warnings and 0 duplicates.
[FINDBUGS] Successfully parsed file <https://builds.apache.org/job/kafka-trunk-jdk8/ws/streams/streams-scala/build/reports/spotbugs/main.xml>
with 0 unique warnings and 0 duplicates.
Setting GRADLE_4_8_1_HOME=/home/jenkins/tools/gradle/4.8.1
Setting GRADLE_4_8_1_HOME=/home/jenkins/tools/gradle/4.8.1
<Git Blamer> Using GitBlamer to create author and commit information for all warnings.
<Git Blamer> GIT_COMMIT=c835331c7855c4bd60b3eb82b8f284006a1ee9b7, workspace=<https://builds.apache.org/job/kafka-trunk-jdk8/ws/>
[FINDBUGS] Computing warning deltas based on reference build #2985
Recording test results
Setting GRADLE_4_8_1_HOME=/home/jenkins/tools/gradle/4.8.1
ERROR: Step ?Publish JUnit test result report? failed: No test report files were found. Configuration
error?
Setting GRADLE_4_8_1_HOME=/home/jenkins/tools/gradle/4.8.1
Not sending mail to unregistered user lindong28@gmail.com

Mime
View raw message