kafka-dev mailing list archives

Site index · List index
Message view « Date » · « Thread »
Top « Date » · « Thread »
From Apache Jenkins Server <jenk...@builds.apache.org>
Subject Build failed in Jenkins: kafka-trunk-jdk8 #2894
Date Wed, 15 Aug 2018 02:19:05 GMT
See <https://builds.apache.org/job/kafka-trunk-jdk8/2894/display/redirect?page=changes>

Changes:

[github] MINOR: Use explicit construction of clients in IntegrationTestHarness

[lindong28] KAFKA-7019; Make reading metadata lock-free by maintaining an

------------------------------------------
[...truncated 870.57 KB...]

kafka.zk.KafkaZkClientTest > testGetDataAndVersion STARTED

kafka.zk.KafkaZkClientTest > testGetDataAndVersion PASSED

kafka.zk.KafkaZkClientTest > testGetChildren STARTED

kafka.zk.KafkaZkClientTest > testGetChildren PASSED

kafka.zk.KafkaZkClientTest > testSetAndGetConsumerOffset STARTED

kafka.zk.KafkaZkClientTest > testSetAndGetConsumerOffset PASSED

kafka.zk.KafkaZkClientTest > testClusterIdMethods STARTED

kafka.zk.KafkaZkClientTest > testClusterIdMethods PASSED

kafka.zk.KafkaZkClientTest > testEntityConfigManagementMethods STARTED

kafka.zk.KafkaZkClientTest > testEntityConfigManagementMethods PASSED

kafka.zk.KafkaZkClientTest > testUpdateLeaderAndIsr STARTED

kafka.zk.KafkaZkClientTest > testUpdateLeaderAndIsr PASSED

kafka.zk.KafkaZkClientTest > testUpdateBrokerInfo STARTED

kafka.zk.KafkaZkClientTest > testUpdateBrokerInfo PASSED

kafka.zk.KafkaZkClientTest > testCreateRecursive STARTED

kafka.zk.KafkaZkClientTest > testCreateRecursive PASSED

kafka.zk.KafkaZkClientTest > testGetConsumerOffsetNoData STARTED

kafka.zk.KafkaZkClientTest > testGetConsumerOffsetNoData PASSED

kafka.zk.KafkaZkClientTest > testDeleteTopicPathMethods STARTED

kafka.zk.KafkaZkClientTest > testDeleteTopicPathMethods PASSED

kafka.zk.KafkaZkClientTest > testSetTopicPartitionStatesRaw STARTED

kafka.zk.KafkaZkClientTest > testSetTopicPartitionStatesRaw PASSED

kafka.zk.KafkaZkClientTest > testAclManagementMethods STARTED

kafka.zk.KafkaZkClientTest > testAclManagementMethods PASSED

kafka.zk.KafkaZkClientTest > testPreferredReplicaElectionMethods STARTED

kafka.zk.KafkaZkClientTest > testPreferredReplicaElectionMethods PASSED

kafka.zk.KafkaZkClientTest > testPropagateLogDir STARTED

kafka.zk.KafkaZkClientTest > testPropagateLogDir PASSED

kafka.zk.KafkaZkClientTest > testGetDataAndStat STARTED

kafka.zk.KafkaZkClientTest > testGetDataAndStat PASSED

kafka.zk.KafkaZkClientTest > testReassignPartitionsInProgress STARTED

kafka.zk.KafkaZkClientTest > testReassignPartitionsInProgress PASSED

kafka.zk.KafkaZkClientTest > testCreateTopLevelPaths STARTED

kafka.zk.KafkaZkClientTest > testCreateTopLevelPaths PASSED

kafka.zk.KafkaZkClientTest > testIsrChangeNotificationGetters STARTED

kafka.zk.KafkaZkClientTest > testIsrChangeNotificationGetters PASSED

kafka.zk.KafkaZkClientTest > testLogDirEventNotificationsDeletion STARTED

kafka.zk.KafkaZkClientTest > testLogDirEventNotificationsDeletion PASSED

kafka.zk.KafkaZkClientTest > testGetLogConfigs STARTED

kafka.zk.KafkaZkClientTest > testGetLogConfigs PASSED

kafka.zk.KafkaZkClientTest > testBrokerSequenceIdMethods STARTED

kafka.zk.KafkaZkClientTest > testBrokerSequenceIdMethods PASSED

kafka.zk.KafkaZkClientTest > testCreateSequentialPersistentPath STARTED

kafka.zk.KafkaZkClientTest > testCreateSequentialPersistentPath PASSED

kafka.zk.KafkaZkClientTest > testConditionalUpdatePath STARTED

kafka.zk.KafkaZkClientTest > testConditionalUpdatePath PASSED

kafka.zk.KafkaZkClientTest > testDeleteTopicZNode STARTED

kafka.zk.KafkaZkClientTest > testDeleteTopicZNode PASSED

kafka.zk.KafkaZkClientTest > testDeletePath STARTED

kafka.zk.KafkaZkClientTest > testDeletePath PASSED

kafka.zk.KafkaZkClientTest > testGetBrokerMethods STARTED

kafka.zk.KafkaZkClientTest > testGetBrokerMethods PASSED

kafka.zk.KafkaZkClientTest > testCreateTokenChangeNotification STARTED

kafka.zk.KafkaZkClientTest > testCreateTokenChangeNotification PASSED

kafka.zk.KafkaZkClientTest > testGetTopicsAndPartitions STARTED

kafka.zk.KafkaZkClientTest > testGetTopicsAndPartitions PASSED

kafka.zk.KafkaZkClientTest > testRegisterBrokerInfo STARTED

kafka.zk.KafkaZkClientTest > testRegisterBrokerInfo PASSED

kafka.zk.KafkaZkClientTest > testConsumerOffsetPath STARTED

kafka.zk.KafkaZkClientTest > testConsumerOffsetPath PASSED

kafka.zk.KafkaZkClientTest > testControllerManagementMethods STARTED

kafka.zk.KafkaZkClientTest > testControllerManagementMethods PASSED

kafka.zk.KafkaZkClientTest > testTopicAssignmentMethods STARTED

kafka.zk.KafkaZkClientTest > testTopicAssignmentMethods PASSED

kafka.zk.KafkaZkClientTest > testPropagateIsrChanges STARTED

kafka.zk.KafkaZkClientTest > testPropagateIsrChanges PASSED

kafka.zk.KafkaZkClientTest > testControllerEpochMethods STARTED

kafka.zk.KafkaZkClientTest > testControllerEpochMethods PASSED

kafka.zk.KafkaZkClientTest > testDeleteRecursive STARTED

kafka.zk.KafkaZkClientTest > testDeleteRecursive PASSED

kafka.zk.KafkaZkClientTest > testGetTopicPartitionStates STARTED

kafka.zk.KafkaZkClientTest > testGetTopicPartitionStates PASSED

kafka.zk.KafkaZkClientTest > testCreateConfigChangeNotification STARTED

kafka.zk.KafkaZkClientTest > testCreateConfigChangeNotification PASSED

kafka.zk.KafkaZkClientTest > testDelegationTokenMethods STARTED

kafka.zk.KafkaZkClientTest > testDelegationTokenMethods PASSED

kafka.zk.ReassignPartitionsZNodeTest > testDecodeInvalidJson STARTED

kafka.zk.ReassignPartitionsZNodeTest > testDecodeInvalidJson PASSED

kafka.zk.ReassignPartitionsZNodeTest > testEncode STARTED

kafka.zk.ReassignPartitionsZNodeTest > testEncode PASSED

kafka.zk.ReassignPartitionsZNodeTest > testDecodeValidJson STARTED

kafka.zk.ReassignPartitionsZNodeTest > testDecodeValidJson PASSED

kafka.zk.LiteralAclStoreTest > shouldHaveCorrectPaths STARTED

kafka.zk.LiteralAclStoreTest > shouldHaveCorrectPaths PASSED

kafka.zk.LiteralAclStoreTest > shouldRoundTripChangeNode STARTED

kafka.zk.LiteralAclStoreTest > shouldRoundTripChangeNode PASSED

kafka.zk.LiteralAclStoreTest > shouldThrowFromEncodeOnNoneLiteral STARTED

kafka.zk.LiteralAclStoreTest > shouldThrowFromEncodeOnNoneLiteral PASSED

kafka.zk.LiteralAclStoreTest > shouldWriteChangesToTheWritePath STARTED

kafka.zk.LiteralAclStoreTest > shouldWriteChangesToTheWritePath PASSED

kafka.zk.LiteralAclStoreTest > shouldHaveCorrectPatternType STARTED

kafka.zk.LiteralAclStoreTest > shouldHaveCorrectPatternType PASSED

kafka.zk.LiteralAclStoreTest > shouldDecodeResourceUsingTwoPartLogic STARTED

kafka.zk.LiteralAclStoreTest > shouldDecodeResourceUsingTwoPartLogic PASSED

kafka.zk.ExtendedAclStoreTest > shouldHaveCorrectPaths STARTED

kafka.zk.ExtendedAclStoreTest > shouldHaveCorrectPaths PASSED

kafka.zk.ExtendedAclStoreTest > shouldRoundTripChangeNode STARTED

kafka.zk.ExtendedAclStoreTest > shouldRoundTripChangeNode PASSED

kafka.zk.ExtendedAclStoreTest > shouldThrowFromEncodeOnLiteral STARTED

kafka.zk.ExtendedAclStoreTest > shouldThrowFromEncodeOnLiteral PASSED

kafka.zk.ExtendedAclStoreTest > shouldThrowIfConstructedWithLiteral STARTED

kafka.zk.ExtendedAclStoreTest > shouldThrowIfConstructedWithLiteral PASSED

kafka.zk.ExtendedAclStoreTest > shouldWriteChangesToTheWritePath STARTED

kafka.zk.ExtendedAclStoreTest > shouldWriteChangesToTheWritePath PASSED

kafka.zk.ExtendedAclStoreTest > shouldHaveCorrectPatternType STARTED

kafka.zk.ExtendedAclStoreTest > shouldHaveCorrectPatternType PASSED

2040 tests completed, 1 failed, 4 skipped

> Task :kafka-trunk-jdk8:core:test FAILED
> Task :testScala_2_12 FAILED

FAILURE: Build failed with an exception.

* What went wrong:
Execution failed for task ':kafka-trunk-jdk8:core:test'.
> There were failing tests. See the report at: file://<https://builds.apache.org/job/kafka-trunk-jdk8/ws/core/build/reports/tests/test/index.html>

* Try:
Run with --stacktrace option to get the stack trace. Run with --info or --debug option to
get more log output. Run with --scan to get full insights.

* Get more help at https://help.gradle.org

BUILD FAILED in 3h 37m 24s
26 actionable tasks: 4 executed, 22 up-to-date
Build step 'Execute shell' marked build as failure
[FINDBUGS] Collecting findbugs analysis files...
Setting GRADLE_4_8_1_HOME=/home/jenkins/tools/gradle/4.8.1
[FINDBUGS] Searching for all files in <https://builds.apache.org/job/kafka-trunk-jdk8/ws/>
that match the pattern **/build/reports/findbugs/*.xml
[FINDBUGS] Parsing 2 files in <https://builds.apache.org/job/kafka-trunk-jdk8/ws/>
[FINDBUGS] Successfully parsed file <https://builds.apache.org/job/kafka-trunk-jdk8/ws/core/build/reports/findbugs/main.xml>
with 0 unique warnings and 0 duplicates.
[FINDBUGS] Successfully parsed file <https://builds.apache.org/job/kafka-trunk-jdk8/ws/streams/streams-scala/build/reports/findbugs/main.xml>
with 0 unique warnings and 0 duplicates.
Setting GRADLE_4_8_1_HOME=/home/jenkins/tools/gradle/4.8.1
Setting GRADLE_4_8_1_HOME=/home/jenkins/tools/gradle/4.8.1
<Git Blamer> Using GitBlamer to create author and commit information for all warnings.
<Git Blamer> GIT_COMMIT=bb4cc4962894cf930c6b1cc01b121444f4ebb106, workspace=<https://builds.apache.org/job/kafka-trunk-jdk8/ws/>
[FINDBUGS] Computing warning deltas based on reference build #2892
Recording test results
Setting GRADLE_4_8_1_HOME=/home/jenkins/tools/gradle/4.8.1
Setting GRADLE_4_8_1_HOME=/home/jenkins/tools/gradle/4.8.1
Not sending mail to unregistered user rajinisivaram@googlemail.com
Not sending mail to unregistered user noreply@github.com
Not sending mail to unregistered user lindong28@gmail.com

Mime
View raw message