kafka-dev mailing list archives

Site index · List index
Message view « Date » · « Thread »
Top « Date » · « Thread »
From Apache Jenkins Server <jenk...@builds.apache.org>
Subject Build failed in Jenkins: kafka-trunk-jdk8 #2858
Date Fri, 03 Aug 2018 06:37:28 GMT
See <https://builds.apache.org/job/kafka-trunk-jdk8/2858/display/redirect?page=changes>

Changes:

[github] KAFKA-3514: Part II, Choose tasks with data on all partitions to process

------------------------------------------
[...truncated 2.47 MB...]
org.apache.kafka.streams.TopologyTest > multipleSourcesWithProcessorsShouldHaveDistinctSubtopologies
STARTED

org.apache.kafka.streams.TopologyTest > multipleSourcesWithProcessorsShouldHaveDistinctSubtopologies
PASSED

org.apache.kafka.streams.TopologyTest > shouldThrowOnUnassignedStateStoreAccess STARTED

org.apache.kafka.streams.TopologyTest > shouldThrowOnUnassignedStateStoreAccess PASSED

org.apache.kafka.streams.TopologyTest > shouldNotAllowNullProcessorNameWhenConnectingProcessorAndStateStores
STARTED

org.apache.kafka.streams.TopologyTest > shouldNotAllowNullProcessorNameWhenConnectingProcessorAndStateStores
PASSED

org.apache.kafka.streams.TopologyTest > kTableAnonymousMaterializedMapValuesShouldPreserveTopologyStructure
STARTED

org.apache.kafka.streams.TopologyTest > kTableAnonymousMaterializedMapValuesShouldPreserveTopologyStructure
PASSED

org.apache.kafka.streams.TopologyTest > sessionWindowZeroArgCountShouldPreserveTopologyStructure
STARTED

org.apache.kafka.streams.TopologyTest > sessionWindowZeroArgCountShouldPreserveTopologyStructure
PASSED

org.apache.kafka.streams.TopologyTest > tableAnonymousMaterializedCountShouldPreserveTopologyStructure
STARTED

org.apache.kafka.streams.TopologyTest > tableAnonymousMaterializedCountShouldPreserveTopologyStructure
PASSED

org.apache.kafka.streams.TopologyTest > shouldDescribeGlobalStoreTopology STARTED

org.apache.kafka.streams.TopologyTest > shouldDescribeGlobalStoreTopology PASSED

org.apache.kafka.streams.TopologyTest > kTableNonMaterializedMapValuesShouldPreserveTopologyStructure
STARTED

org.apache.kafka.streams.TopologyTest > kTableNonMaterializedMapValuesShouldPreserveTopologyStructure
PASSED

org.apache.kafka.streams.TopologyTest > kGroupedStreamAnonymousMaterializedCountShouldPreserveTopologyStructure
STARTED

org.apache.kafka.streams.TopologyTest > kGroupedStreamAnonymousMaterializedCountShouldPreserveTopologyStructure
PASSED

org.apache.kafka.streams.TopologyTest > shouldDescribeMultipleGlobalStoreTopology STARTED

org.apache.kafka.streams.TopologyTest > shouldDescribeMultipleGlobalStoreTopology PASSED

org.apache.kafka.streams.TopologyTest > shouldNotAllowToAddSinkWithSameName STARTED

org.apache.kafka.streams.TopologyTest > shouldNotAllowToAddSinkWithSameName PASSED

org.apache.kafka.streams.TopologyTest > shouldNotAllowToAddSinkWithNullParents STARTED

org.apache.kafka.streams.TopologyTest > shouldNotAllowToAddSinkWithNullParents PASSED

org.apache.kafka.streams.TopologyTest > shouldNotAllowNullProcessorSupplierWhenAddingProcessor
STARTED

org.apache.kafka.streams.TopologyTest > shouldNotAllowNullProcessorSupplierWhenAddingProcessor
PASSED

org.apache.kafka.streams.TopologyTest > timeWindowAnonymousMaterializedCountShouldPreserveTopologyStructure
STARTED

org.apache.kafka.streams.TopologyTest > timeWindowAnonymousMaterializedCountShouldPreserveTopologyStructure
PASSED

org.apache.kafka.streams.TopologyTest > shouldFailIfSinkIsParent STARTED

org.apache.kafka.streams.TopologyTest > shouldFailIfSinkIsParent PASSED

org.apache.kafka.streams.TopologyTest > shouldNotAllowToAddSourcesWithSameName STARTED

org.apache.kafka.streams.TopologyTest > shouldNotAllowToAddSourcesWithSameName PASSED

org.apache.kafka.streams.TopologyTest > sourceAndProcessorWithMultipleStatesShouldHaveSingleSubtopology
STARTED

org.apache.kafka.streams.TopologyTest > sourceAndProcessorWithMultipleStatesShouldHaveSingleSubtopology
PASSED

org.apache.kafka.streams.TopologyTest > shouldDescribeEmptyTopology STARTED

org.apache.kafka.streams.TopologyTest > shouldDescribeEmptyTopology PASSED

org.apache.kafka.streams.TopologyTest > shouldFailIfSinkIsItsOwnParent STARTED

org.apache.kafka.streams.TopologyTest > shouldFailIfSinkIsItsOwnParent PASSED

org.apache.kafka.streams.TopologyTest > testPatternMatchesAlreadyProvidedTopicSource STARTED

org.apache.kafka.streams.TopologyTest > testPatternMatchesAlreadyProvidedTopicSource PASSED

org.apache.kafka.streams.TopologyTest > singleSourcePatternShouldHaveSingleSubtopology
STARTED

org.apache.kafka.streams.TopologyTest > singleSourcePatternShouldHaveSingleSubtopology
PASSED

org.apache.kafka.streams.TopologyTest > kTableNonMaterializedFilterShouldPreserveTopologyStructure
STARTED

org.apache.kafka.streams.TopologyTest > kTableNonMaterializedFilterShouldPreserveTopologyStructure
PASSED

org.apache.kafka.streams.TopologyTest > singleSourceShouldHaveSingleSubtopology STARTED

org.apache.kafka.streams.TopologyTest > singleSourceShouldHaveSingleSubtopology PASSED

org.apache.kafka.streams.TopologyTest > shouldNotAllowNullTopicChooserWhenAddingSink STARTED

org.apache.kafka.streams.TopologyTest > shouldNotAllowNullTopicChooserWhenAddingSink PASSED

org.apache.kafka.streams.TopologyTest > processorsWithSameSinkShouldHaveSameSubtopology
STARTED

org.apache.kafka.streams.TopologyTest > processorsWithSameSinkShouldHaveSameSubtopology
PASSED

org.apache.kafka.streams.TopologyTest > shouldNotAllowNullTopicsWhenAddingSoureWithTopic
STARTED

org.apache.kafka.streams.TopologyTest > shouldNotAllowNullTopicsWhenAddingSoureWithTopic
PASSED

org.apache.kafka.streams.TopologyTest > shouldFailWithUnknownParent STARTED

org.apache.kafka.streams.TopologyTest > shouldFailWithUnknownParent PASSED

org.apache.kafka.streams.TopologyTest > kTableAnonymousMaterializedFilterShouldPreserveTopologyStructure
STARTED

org.apache.kafka.streams.TopologyTest > kTableAnonymousMaterializedFilterShouldPreserveTopologyStructure
PASSED

org.apache.kafka.streams.TopologyTest > shouldNotAllowToAddProcessorWithEmptyParents STARTED

org.apache.kafka.streams.TopologyTest > shouldNotAllowToAddProcessorWithEmptyParents PASSED

org.apache.kafka.streams.TopologyTest > sessionWindowAnonymousMaterializedCountShouldPreserveTopologyStructure
STARTED

org.apache.kafka.streams.TopologyTest > sessionWindowAnonymousMaterializedCountShouldPreserveTopologyStructure
PASSED

org.apache.kafka.streams.TopologyTest > shouldFailIfNodeIsItsOwnParent STARTED

org.apache.kafka.streams.TopologyTest > shouldFailIfNodeIsItsOwnParent PASSED

org.apache.kafka.streams.TopologyTest > shouldNotAllowToAddStateStoreToSource STARTED

org.apache.kafka.streams.TopologyTest > shouldNotAllowToAddStateStoreToSource PASSED

org.apache.kafka.streams.TopologyTest > shouldNotAllowNullNameWhenAddingProcessor STARTED

org.apache.kafka.streams.TopologyTest > shouldNotAllowNullNameWhenAddingProcessor PASSED

org.apache.kafka.streams.TopologyTest > shouldNotAllowToAddStoreWithSameName STARTED

org.apache.kafka.streams.TopologyTest > shouldNotAllowToAddStoreWithSameName PASSED

org.apache.kafka.streams.TopologyTest > shouldNotAllowToAddProcessorWithNullParents STARTED

org.apache.kafka.streams.TopologyTest > shouldNotAllowToAddProcessorWithNullParents PASSED

org.apache.kafka.streams.TopologyTest > shouldNotAllowNullNameWhenAddingSourceWithPattern
STARTED

org.apache.kafka.streams.TopologyTest > shouldNotAllowNullNameWhenAddingSourceWithPattern
PASSED

org.apache.kafka.streams.TopologyTest > multipleSourcesWithSinksShouldHaveDistinctSubtopologies
STARTED

org.apache.kafka.streams.TopologyTest > multipleSourcesWithSinksShouldHaveDistinctSubtopologies
PASSED

org.apache.kafka.streams.TopologyTest > kGroupedStreamZeroArgCountShouldPreserveTopologyStructure
STARTED

org.apache.kafka.streams.TopologyTest > kGroupedStreamZeroArgCountShouldPreserveTopologyStructure
PASSED

org.apache.kafka.streams.TopologyTest > sessionWindowNamedMaterializedCountShouldPreserveTopologyStructure
STARTED

org.apache.kafka.streams.TopologyTest > sessionWindowNamedMaterializedCountShouldPreserveTopologyStructure
PASSED

org.apache.kafka.streams.tools.StreamsResetterTest > testShiftOffsetByWhenBetweenBeginningAndEndOffset
STARTED

org.apache.kafka.streams.tools.StreamsResetterTest > testShiftOffsetByWhenBetweenBeginningAndEndOffset
PASSED

org.apache.kafka.streams.tools.StreamsResetterTest > testResetToSpecificOffsetWhenAfterEndOffset
STARTED

org.apache.kafka.streams.tools.StreamsResetterTest > testResetToSpecificOffsetWhenAfterEndOffset
PASSED

org.apache.kafka.streams.tools.StreamsResetterTest > shouldAcceptValidDateFormats STARTED

org.apache.kafka.streams.tools.StreamsResetterTest > shouldAcceptValidDateFormats PASSED

org.apache.kafka.streams.tools.StreamsResetterTest > shouldDeleteTopic STARTED

org.apache.kafka.streams.tools.StreamsResetterTest > shouldDeleteTopic PASSED

org.apache.kafka.streams.tools.StreamsResetterTest > testResetToSpecificOffsetWhenBetweenBeginningAndEndOffset
STARTED

org.apache.kafka.streams.tools.StreamsResetterTest > testResetToSpecificOffsetWhenBetweenBeginningAndEndOffset
PASSED

org.apache.kafka.streams.tools.StreamsResetterTest > testShiftOffsetByWhenAfterEndOffset
STARTED

org.apache.kafka.streams.tools.StreamsResetterTest > testShiftOffsetByWhenAfterEndOffset
PASSED

org.apache.kafka.streams.tools.StreamsResetterTest > testResetToSpecificOffsetWhenBeforeBeginningOffset
STARTED

org.apache.kafka.streams.tools.StreamsResetterTest > testResetToSpecificOffsetWhenBeforeBeginningOffset
PASSED

org.apache.kafka.streams.tools.StreamsResetterTest > shouldSeekToEndOffset STARTED

org.apache.kafka.streams.tools.StreamsResetterTest > shouldSeekToEndOffset PASSED

org.apache.kafka.streams.tools.StreamsResetterTest > testResetUsingPlanWhenBetweenBeginningAndEndOffset
STARTED

org.apache.kafka.streams.tools.StreamsResetterTest > testResetUsingPlanWhenBetweenBeginningAndEndOffset
PASSED

org.apache.kafka.streams.tools.StreamsResetterTest > testResetUsingPlanWhenBeforeBeginningOffset
STARTED

org.apache.kafka.streams.tools.StreamsResetterTest > testResetUsingPlanWhenBeforeBeginningOffset
PASSED

org.apache.kafka.streams.tools.StreamsResetterTest > shouldThrowOnInvalidDateFormat STARTED

org.apache.kafka.streams.tools.StreamsResetterTest > shouldThrowOnInvalidDateFormat PASSED

org.apache.kafka.streams.tools.StreamsResetterTest > testResetUsingPlanWhenAfterEndOffset
STARTED

org.apache.kafka.streams.tools.StreamsResetterTest > testResetUsingPlanWhenAfterEndOffset
PASSED

org.apache.kafka.streams.tools.StreamsResetterTest > testShiftOffsetByWhenBeforeBeginningOffset
STARTED

org.apache.kafka.streams.tools.StreamsResetterTest > testShiftOffsetByWhenBeforeBeginningOffset
PASSED

org.apache.kafka.streams.KeyValueTest > shouldHaveSaneEqualsAndHashCode STARTED

org.apache.kafka.streams.KeyValueTest > shouldHaveSaneEqualsAndHashCode PASSED

1907 tests completed, 1 failed

> Task :streams:test FAILED

FAILURE: Build failed with an exception.

* What went wrong:
Execution failed for task ':streams:test'.
> There were failing tests. See the report at: file://<https://builds.apache.org/job/kafka-trunk-jdk8/ws/streams/build/reports/tests/test/index.html>

* Try:
Run with --stacktrace option to get the stack trace. Run with --info or --debug option to
get more log output. Run with --scan to get full insights.

* Get more help at https://help.gradle.org

BUILD FAILED in 4h 9m 50s
68 actionable tasks: 43 executed, 25 up-to-date
Build step 'Execute shell' marked build as failure
[FINDBUGS] Collecting findbugs analysis files...
Setting GRADLE_4_8_1_HOME=/home/jenkins/tools/gradle/4.8.1
[FINDBUGS] Searching for all files in <https://builds.apache.org/job/kafka-trunk-jdk8/ws/>
that match the pattern **/build/reports/findbugs/*.xml
[FINDBUGS] Parsing 6 files in <https://builds.apache.org/job/kafka-trunk-jdk8/ws/>
[FINDBUGS] Successfully parsed file <https://builds.apache.org/job/kafka-trunk-jdk8/ws/clients/build/reports/findbugs/main.xml>
with 0 unique warnings and 0 duplicates.
[FINDBUGS] Successfully parsed file <https://builds.apache.org/job/kafka-trunk-jdk8/ws/core/build/reports/findbugs/main.xml>
with 0 unique warnings and 0 duplicates.
[FINDBUGS] Successfully parsed file <https://builds.apache.org/job/kafka-trunk-jdk8/ws/examples/build/reports/findbugs/main.xml>
with 0 unique warnings and 0 duplicates.
[FINDBUGS] Successfully parsed file <https://builds.apache.org/job/kafka-trunk-jdk8/ws/log4j-appender/build/reports/findbugs/main.xml>
with 0 unique warnings and 0 duplicates.
[FINDBUGS] Successfully parsed file <https://builds.apache.org/job/kafka-trunk-jdk8/ws/streams/build/reports/findbugs/main.xml>
with 0 unique warnings and 0 duplicates.
[FINDBUGS] Successfully parsed file <https://builds.apache.org/job/kafka-trunk-jdk8/ws/streams/streams-scala/build/reports/findbugs/main.xml>
with 0 unique warnings and 0 duplicates.
Setting GRADLE_4_8_1_HOME=/home/jenkins/tools/gradle/4.8.1
Setting GRADLE_4_8_1_HOME=/home/jenkins/tools/gradle/4.8.1
<Git Blamer> Using GitBlamer to create author and commit information for all warnings.
<Git Blamer> GIT_COMMIT=afe00effe2d79e89e159972cf1f5f7ffeb0c6e97, workspace=<https://builds.apache.org/job/kafka-trunk-jdk8/ws/>
[FINDBUGS] Computing warning deltas based on reference build #2857
Recording test results
Setting GRADLE_4_8_1_HOME=/home/jenkins/tools/gradle/4.8.1
Setting GRADLE_4_8_1_HOME=/home/jenkins/tools/gradle/4.8.1
Not sending mail to unregistered user noreply@github.com

Mime
View raw message