kafka-dev mailing list archives

Site index · List index
Message view « Date » · « Thread »
Top « Date » · « Thread »
From Apache Jenkins Server <jenk...@builds.apache.org>
Subject Build failed in Jenkins: kafka-trunk-jdk8 #2811
Date Fri, 20 Jul 2018 11:25:12 GMT
See <https://builds.apache.org/job/kafka-trunk-jdk8/2811/display/redirect?page=changes>

Changes:

[lindong28] KAFKA-7098; Improve accuracy of throttling by avoiding under-estimating

------------------------------------------
[...truncated 2.63 MB...]

org.apache.kafka.connect.runtime.ConnectMetricsTest > testCreatingTags STARTED

org.apache.kafka.connect.runtime.ConnectMetricsTest > testCreatingTags PASSED

org.apache.kafka.connect.runtime.ConnectMetricsTest > testMetricGroupIdWithoutTags STARTED

org.apache.kafka.connect.runtime.ConnectMetricsTest > testMetricGroupIdWithoutTags PASSED

org.apache.kafka.connect.runtime.ConnectMetricsTest > testCreatingTagsWithOddNumberOfTags
STARTED

org.apache.kafka.connect.runtime.ConnectMetricsTest > testCreatingTagsWithOddNumberOfTags
PASSED

org.apache.kafka.connect.runtime.ConnectMetricsTest > testGettingGroupWithOddNumberOfTags
STARTED

org.apache.kafka.connect.runtime.ConnectMetricsTest > testGettingGroupWithOddNumberOfTags
PASSED

org.apache.kafka.connect.runtime.ConnectMetricsTest > testMetricGroupIdIdentity STARTED

org.apache.kafka.connect.runtime.ConnectMetricsTest > testMetricGroupIdIdentity PASSED

org.apache.kafka.connect.runtime.ConnectMetricsTest > testRecreateWithoutClose STARTED

org.apache.kafka.connect.runtime.ConnectMetricsTest > testRecreateWithoutClose PASSED

org.apache.kafka.connect.runtime.ConnectMetricsTest > testGettingGroupWithTags STARTED

org.apache.kafka.connect.runtime.ConnectMetricsTest > testGettingGroupWithTags PASSED

org.apache.kafka.connect.runtime.ConnectMetricsTest > testRecreateWithClose STARTED

org.apache.kafka.connect.runtime.ConnectMetricsTest > testRecreateWithClose PASSED

org.apache.kafka.connect.runtime.ConnectMetricsTest > testKafkaMetricsNotNull STARTED

org.apache.kafka.connect.runtime.ConnectMetricsTest > testKafkaMetricsNotNull PASSED

org.apache.kafka.connect.converters.ShortConverterTest > testBytesNullToNumber STARTED

org.apache.kafka.connect.converters.ShortConverterTest > testBytesNullToNumber PASSED

org.apache.kafka.connect.converters.ShortConverterTest > testSerializingIncorrectType STARTED

org.apache.kafka.connect.converters.ShortConverterTest > testSerializingIncorrectType PASSED

org.apache.kafka.connect.converters.ShortConverterTest > testDeserializingHeaderWithTooManyBytes
STARTED

org.apache.kafka.connect.converters.ShortConverterTest > testDeserializingHeaderWithTooManyBytes
PASSED

org.apache.kafka.connect.converters.ShortConverterTest > testNullToBytes STARTED

org.apache.kafka.connect.converters.ShortConverterTest > testNullToBytes PASSED

org.apache.kafka.connect.converters.ShortConverterTest > testSerializingIncorrectHeader
STARTED

org.apache.kafka.connect.converters.ShortConverterTest > testSerializingIncorrectHeader
PASSED

org.apache.kafka.connect.converters.ShortConverterTest > testDeserializingDataWithTooManyBytes
STARTED

org.apache.kafka.connect.converters.ShortConverterTest > testDeserializingDataWithTooManyBytes
PASSED

org.apache.kafka.connect.converters.ShortConverterTest > testConvertingSamplesToAndFromBytes
STARTED

org.apache.kafka.connect.converters.ShortConverterTest > testConvertingSamplesToAndFromBytes
PASSED

org.apache.kafka.connect.converters.FloatConverterTest > testBytesNullToNumber STARTED

org.apache.kafka.connect.converters.FloatConverterTest > testBytesNullToNumber PASSED

org.apache.kafka.connect.converters.FloatConverterTest > testSerializingIncorrectType STARTED

org.apache.kafka.connect.converters.FloatConverterTest > testSerializingIncorrectType PASSED

org.apache.kafka.connect.converters.FloatConverterTest > testDeserializingHeaderWithTooManyBytes
STARTED

org.apache.kafka.connect.converters.FloatConverterTest > testDeserializingHeaderWithTooManyBytes
PASSED

org.apache.kafka.connect.converters.FloatConverterTest > testNullToBytes STARTED

org.apache.kafka.connect.converters.FloatConverterTest > testNullToBytes PASSED

org.apache.kafka.connect.converters.FloatConverterTest > testSerializingIncorrectHeader
STARTED

org.apache.kafka.connect.converters.FloatConverterTest > testSerializingIncorrectHeader
PASSED

org.apache.kafka.connect.converters.FloatConverterTest > testDeserializingDataWithTooManyBytes
STARTED

org.apache.kafka.connect.converters.FloatConverterTest > testDeserializingDataWithTooManyBytes
PASSED

org.apache.kafka.connect.converters.FloatConverterTest > testConvertingSamplesToAndFromBytes
STARTED

org.apache.kafka.connect.converters.FloatConverterTest > testConvertingSamplesToAndFromBytes
PASSED

org.apache.kafka.connect.converters.ByteArrayConverterTest > testFromConnectSchemaless
STARTED

org.apache.kafka.connect.converters.ByteArrayConverterTest > testFromConnectSchemaless
PASSED

org.apache.kafka.connect.converters.ByteArrayConverterTest > testToConnectNull STARTED

org.apache.kafka.connect.converters.ByteArrayConverterTest > testToConnectNull PASSED

org.apache.kafka.connect.converters.ByteArrayConverterTest > testFromConnectBadSchema STARTED

org.apache.kafka.connect.converters.ByteArrayConverterTest > testFromConnectBadSchema PASSED

org.apache.kafka.connect.converters.ByteArrayConverterTest > testFromConnectNull STARTED

org.apache.kafka.connect.converters.ByteArrayConverterTest > testFromConnectNull PASSED

org.apache.kafka.connect.converters.ByteArrayConverterTest > testToConnect STARTED

org.apache.kafka.connect.converters.ByteArrayConverterTest > testToConnect PASSED

org.apache.kafka.connect.converters.ByteArrayConverterTest > testFromConnect STARTED

org.apache.kafka.connect.converters.ByteArrayConverterTest > testFromConnect PASSED

org.apache.kafka.connect.converters.ByteArrayConverterTest > testFromConnectInvalidValue
STARTED

org.apache.kafka.connect.converters.ByteArrayConverterTest > testFromConnectInvalidValue
PASSED

org.apache.kafka.connect.converters.LongConverterTest > testBytesNullToNumber STARTED

org.apache.kafka.connect.converters.LongConverterTest > testBytesNullToNumber PASSED

org.apache.kafka.connect.converters.LongConverterTest > testSerializingIncorrectType STARTED

org.apache.kafka.connect.converters.LongConverterTest > testSerializingIncorrectType PASSED

org.apache.kafka.connect.converters.LongConverterTest > testDeserializingHeaderWithTooManyBytes
STARTED

org.apache.kafka.connect.converters.LongConverterTest > testDeserializingHeaderWithTooManyBytes
PASSED

org.apache.kafka.connect.converters.LongConverterTest > testNullToBytes STARTED

org.apache.kafka.connect.converters.LongConverterTest > testNullToBytes PASSED

org.apache.kafka.connect.converters.LongConverterTest > testSerializingIncorrectHeader
STARTED

org.apache.kafka.connect.converters.LongConverterTest > testSerializingIncorrectHeader
PASSED

org.apache.kafka.connect.converters.LongConverterTest > testDeserializingDataWithTooManyBytes
STARTED

org.apache.kafka.connect.converters.LongConverterTest > testDeserializingDataWithTooManyBytes
PASSED

org.apache.kafka.connect.converters.LongConverterTest > testConvertingSamplesToAndFromBytes
STARTED

org.apache.kafka.connect.converters.LongConverterTest > testConvertingSamplesToAndFromBytes
PASSED

org.apache.kafka.connect.converters.IntegerConverterTest > testBytesNullToNumber STARTED

org.apache.kafka.connect.converters.IntegerConverterTest > testBytesNullToNumber PASSED

org.apache.kafka.connect.converters.IntegerConverterTest > testSerializingIncorrectType
STARTED

org.apache.kafka.connect.converters.IntegerConverterTest > testSerializingIncorrectType
PASSED

org.apache.kafka.connect.converters.IntegerConverterTest > testDeserializingHeaderWithTooManyBytes
STARTED

org.apache.kafka.connect.converters.IntegerConverterTest > testDeserializingHeaderWithTooManyBytes
PASSED

org.apache.kafka.connect.converters.IntegerConverterTest > testNullToBytes STARTED

org.apache.kafka.connect.converters.IntegerConverterTest > testNullToBytes PASSED

org.apache.kafka.connect.converters.IntegerConverterTest > testSerializingIncorrectHeader
STARTED

org.apache.kafka.connect.converters.IntegerConverterTest > testSerializingIncorrectHeader
PASSED

org.apache.kafka.connect.converters.IntegerConverterTest > testDeserializingDataWithTooManyBytes
STARTED

org.apache.kafka.connect.converters.IntegerConverterTest > testDeserializingDataWithTooManyBytes
PASSED

org.apache.kafka.connect.converters.IntegerConverterTest > testConvertingSamplesToAndFromBytes
STARTED

org.apache.kafka.connect.converters.IntegerConverterTest > testConvertingSamplesToAndFromBytes
PASSED

org.apache.kafka.connect.converters.DoubleConverterTest > testBytesNullToNumber STARTED

org.apache.kafka.connect.converters.DoubleConverterTest > testBytesNullToNumber PASSED

org.apache.kafka.connect.converters.DoubleConverterTest > testSerializingIncorrectType
STARTED

org.apache.kafka.connect.converters.DoubleConverterTest > testSerializingIncorrectType
PASSED

org.apache.kafka.connect.converters.DoubleConverterTest > testDeserializingHeaderWithTooManyBytes
STARTED

org.apache.kafka.connect.converters.DoubleConverterTest > testDeserializingHeaderWithTooManyBytes
PASSED

org.apache.kafka.connect.converters.DoubleConverterTest > testNullToBytes STARTED

org.apache.kafka.connect.converters.DoubleConverterTest > testNullToBytes PASSED

org.apache.kafka.connect.converters.DoubleConverterTest > testSerializingIncorrectHeader
STARTED

org.apache.kafka.connect.converters.DoubleConverterTest > testSerializingIncorrectHeader
PASSED

org.apache.kafka.connect.converters.DoubleConverterTest > testDeserializingDataWithTooManyBytes
STARTED

org.apache.kafka.connect.converters.DoubleConverterTest > testDeserializingDataWithTooManyBytes
PASSED

org.apache.kafka.connect.converters.DoubleConverterTest > testConvertingSamplesToAndFromBytes
STARTED

org.apache.kafka.connect.converters.DoubleConverterTest > testConvertingSamplesToAndFromBytes
PASSED

373 tests completed, 1 failed

> Task :connect:runtime:test FAILED

FAILURE: Build failed with an exception.

* What went wrong:
Execution failed for task ':connect:runtime:test'.
> There were failing tests. See the report at: file://<https://builds.apache.org/job/kafka-trunk-jdk8/ws/connect/runtime/build/reports/tests/test/index.html>

* Try:
Run with --stacktrace option to get the stack trace. Run with --info or --debug option to
get more log output. Run with --scan to get full insights.

* Get more help at https://help.gradle.org

BUILD FAILED in 3h 12m 15s
112 actionable tasks: 74 executed, 38 up-to-date
Build step 'Execute shell' marked build as failure
[FINDBUGS] Collecting findbugs analysis files...
Setting GRADLE_4_8_1_HOME=/home/jenkins/tools/gradle/4.8.1
[FINDBUGS] Searching for all files in <https://builds.apache.org/job/kafka-trunk-jdk8/ws/>
that match the pattern **/build/reports/findbugs/*.xml
[FINDBUGS] Parsing 12 files in <https://builds.apache.org/job/kafka-trunk-jdk8/ws/>
[FINDBUGS] Successfully parsed file <https://builds.apache.org/job/kafka-trunk-jdk8/ws/clients/build/reports/findbugs/main.xml>
with 0 unique warnings and 0 duplicates.
[FINDBUGS] Successfully parsed file <https://builds.apache.org/job/kafka-trunk-jdk8/ws/connect/api/build/reports/findbugs/main.xml>
with 0 unique warnings and 0 duplicates.
[FINDBUGS] Successfully parsed file <https://builds.apache.org/job/kafka-trunk-jdk8/ws/connect/basic-auth-extension/build/reports/findbugs/main.xml>
with 0 unique warnings and 0 duplicates.
[FINDBUGS] Successfully parsed file <https://builds.apache.org/job/kafka-trunk-jdk8/ws/connect/file/build/reports/findbugs/main.xml>
with 0 unique warnings and 0 duplicates.
[FINDBUGS] Successfully parsed file <https://builds.apache.org/job/kafka-trunk-jdk8/ws/connect/json/build/reports/findbugs/main.xml>
with 0 unique warnings and 0 duplicates.
[FINDBUGS] Successfully parsed file <https://builds.apache.org/job/kafka-trunk-jdk8/ws/connect/runtime/build/reports/findbugs/main.xml>
with 0 unique warnings and 0 duplicates.
[FINDBUGS] Successfully parsed file <https://builds.apache.org/job/kafka-trunk-jdk8/ws/core/build/reports/findbugs/main.xml>
with 0 unique warnings and 0 duplicates.
[FINDBUGS] Successfully parsed file <https://builds.apache.org/job/kafka-trunk-jdk8/ws/examples/build/reports/findbugs/main.xml>
with 0 unique warnings and 0 duplicates.
[FINDBUGS] Successfully parsed file <https://builds.apache.org/job/kafka-trunk-jdk8/ws/log4j-appender/build/reports/findbugs/main.xml>
with 0 unique warnings and 0 duplicates.
[FINDBUGS] Successfully parsed file <https://builds.apache.org/job/kafka-trunk-jdk8/ws/streams/build/reports/findbugs/main.xml>
with 0 unique warnings and 0 duplicates.
[FINDBUGS] Successfully parsed file <https://builds.apache.org/job/kafka-trunk-jdk8/ws/streams/streams-scala/build/reports/findbugs/main.xml>
with 0 unique warnings and 0 duplicates.
[FINDBUGS] Successfully parsed file <https://builds.apache.org/job/kafka-trunk-jdk8/ws/tools/build/reports/findbugs/main.xml>
with 0 unique warnings and 0 duplicates.
Setting GRADLE_4_8_1_HOME=/home/jenkins/tools/gradle/4.8.1
Setting GRADLE_4_8_1_HOME=/home/jenkins/tools/gradle/4.8.1
<Git Blamer> Using GitBlamer to create author and commit information for all warnings.
<Git Blamer> GIT_COMMIT=80b55309d1090b0bb45d571c5f6114461f6cb041, workspace=<https://builds.apache.org/job/kafka-trunk-jdk8/ws/>
[FINDBUGS] Computing warning deltas based on reference build #2809
Recording test results
Setting GRADLE_4_8_1_HOME=/home/jenkins/tools/gradle/4.8.1
Setting GRADLE_4_8_1_HOME=/home/jenkins/tools/gradle/4.8.1
Not sending mail to unregistered user lindong28@gmail.com
Not sending mail to unregistered user wangguoz@gmail.com

Mime
View raw message