kafka-dev mailing list archives

Site index · List index
Message view « Date » · « Thread »
Top « Date » · « Thread »
From Apache Jenkins Server <jenk...@builds.apache.org>
Subject Build failed in Jenkins: kafka-0.11.0-jdk7 #389
Date Tue, 03 Jul 2018 22:12:53 GMT
See <https://builds.apache.org/job/kafka-0.11.0-jdk7/389/display/redirect?page=changes>

Changes:

[jason] MINOR: Fix kafkatest snapshot version for 0.11.0.4

------------------------------------------
[...truncated 1.56 MB...]
org.apache.kafka.streams.kstream.internals.KStreamImplTest > shouldNotAllowNullFilePathOnWriteAsText
PASSED

org.apache.kafka.streams.kstream.internals.KStreamKStreamJoinTest > testOuterJoin STARTED

org.apache.kafka.streams.kstream.internals.KStreamKStreamJoinTest > testOuterJoin PASSED

org.apache.kafka.streams.kstream.internals.KStreamKStreamJoinTest > testJoin STARTED

org.apache.kafka.streams.kstream.internals.KStreamKStreamJoinTest > testJoin PASSED

org.apache.kafka.streams.kstream.internals.KStreamKStreamJoinTest > testWindowing STARTED

org.apache.kafka.streams.kstream.internals.KStreamKStreamJoinTest > testWindowing PASSED

org.apache.kafka.streams.kstream.internals.KStreamKStreamJoinTest > testAsymetricWindowingBefore
STARTED

org.apache.kafka.streams.kstream.internals.KStreamKStreamJoinTest > testAsymetricWindowingBefore
PASSED

org.apache.kafka.streams.kstream.internals.KStreamKStreamJoinTest > testAsymetricWindowingAfter
STARTED

org.apache.kafka.streams.kstream.internals.KStreamKStreamJoinTest > testAsymetricWindowingAfter
PASSED

org.apache.kafka.streams.kstream.internals.KStreamWindowAggregateTest > testAggBasic STARTED

org.apache.kafka.streams.kstream.internals.KStreamWindowAggregateTest > testAggBasic PASSED

org.apache.kafka.streams.kstream.internals.KStreamWindowAggregateTest > testJoin STARTED

org.apache.kafka.streams.kstream.internals.KStreamWindowAggregateTest > testJoin PASSED

org.apache.kafka.streams.kstream.internals.SessionKeySerdeTest > shouldConvertToBinaryAndBack
STARTED

org.apache.kafka.streams.kstream.internals.SessionKeySerdeTest > shouldConvertToBinaryAndBack
PASSED

org.apache.kafka.streams.kstream.internals.SessionKeySerdeTest > shouldExtractStartTimeFromBinary
STARTED

org.apache.kafka.streams.kstream.internals.SessionKeySerdeTest > shouldExtractStartTimeFromBinary
PASSED

org.apache.kafka.streams.kstream.internals.SessionKeySerdeTest > shouldDeSerializeNullToNull
STARTED

org.apache.kafka.streams.kstream.internals.SessionKeySerdeTest > shouldDeSerializeNullToNull
PASSED

org.apache.kafka.streams.kstream.internals.SessionKeySerdeTest > shouldSerializeDeserialize
STARTED

org.apache.kafka.streams.kstream.internals.SessionKeySerdeTest > shouldSerializeDeserialize
PASSED

org.apache.kafka.streams.kstream.internals.SessionKeySerdeTest > shouldDeSerializeEmtpyByteArrayToNull
STARTED

org.apache.kafka.streams.kstream.internals.SessionKeySerdeTest > shouldDeSerializeEmtpyByteArrayToNull
PASSED

org.apache.kafka.streams.kstream.internals.SessionKeySerdeTest > shouldExtractWindowFromBindary
STARTED

org.apache.kafka.streams.kstream.internals.SessionKeySerdeTest > shouldExtractWindowFromBindary
PASSED

org.apache.kafka.streams.kstream.internals.SessionKeySerdeTest > shouldExtractKeyFromBinary
STARTED

org.apache.kafka.streams.kstream.internals.SessionKeySerdeTest > shouldExtractKeyFromBinary
PASSED

org.apache.kafka.streams.kstream.internals.SessionKeySerdeTest > shouldExtractKeyBytesFromBinary
STARTED

org.apache.kafka.streams.kstream.internals.SessionKeySerdeTest > shouldExtractKeyBytesFromBinary
PASSED

org.apache.kafka.streams.kstream.internals.SessionKeySerdeTest > shouldExtractEndTimeFromBinary
STARTED

org.apache.kafka.streams.kstream.internals.SessionKeySerdeTest > shouldExtractEndTimeFromBinary
PASSED

org.apache.kafka.streams.kstream.internals.SessionKeySerdeTest > shouldSerializeNullToNull
STARTED

org.apache.kafka.streams.kstream.internals.SessionKeySerdeTest > shouldSerializeNullToNull
PASSED

org.apache.kafka.streams.kstream.internals.SessionKeySerdeTest > shouldExtractBytesKeyFromBinary
STARTED

org.apache.kafka.streams.kstream.internals.SessionKeySerdeTest > shouldExtractBytesKeyFromBinary
PASSED

org.apache.kafka.streams.kstream.internals.KTableAggregateTest > testAggBasic STARTED

org.apache.kafka.streams.kstream.internals.KTableAggregateTest > testAggBasic PASSED

org.apache.kafka.streams.kstream.internals.KTableAggregateTest > shouldForwardToCorrectProcessorNodeWhenMultiCacheEvictions
STARTED

org.apache.kafka.streams.kstream.internals.KTableAggregateTest > shouldForwardToCorrectProcessorNodeWhenMultiCacheEvictions
PASSED

org.apache.kafka.streams.kstream.internals.KTableAggregateTest > testCount STARTED

org.apache.kafka.streams.kstream.internals.KTableAggregateTest > testCount PASSED

org.apache.kafka.streams.kstream.internals.KTableAggregateTest > testCountWithInternalStore
STARTED

org.apache.kafka.streams.kstream.internals.KTableAggregateTest > testCountWithInternalStore
PASSED

org.apache.kafka.streams.kstream.internals.KTableAggregateTest > testAggCoalesced STARTED

org.apache.kafka.streams.kstream.internals.KTableAggregateTest > testAggCoalesced PASSED

org.apache.kafka.streams.kstream.internals.KTableAggregateTest > testAggRepartition STARTED

org.apache.kafka.streams.kstream.internals.KTableAggregateTest > testAggRepartition PASSED

org.apache.kafka.streams.kstream.internals.KTableAggregateTest > testRemoveOldBeforeAddNew
STARTED

org.apache.kafka.streams.kstream.internals.KTableAggregateTest > testRemoveOldBeforeAddNew
PASSED

org.apache.kafka.streams.kstream.internals.KTableAggregateTest > testCountCoalesced STARTED

org.apache.kafka.streams.kstream.internals.KTableAggregateTest > testCountCoalesced PASSED

org.apache.kafka.streams.kstream.internals.KGroupedTableImplTest > shouldNotAllowNullSubtractorOnAggregate
STARTED

org.apache.kafka.streams.kstream.internals.KGroupedTableImplTest > shouldNotAllowNullSubtractorOnAggregate
PASSED

org.apache.kafka.streams.kstream.internals.KGroupedTableImplTest > shouldNotAllowNullInitializerOnAggregate
STARTED

org.apache.kafka.streams.kstream.internals.KGroupedTableImplTest > shouldNotAllowNullInitializerOnAggregate
PASSED

org.apache.kafka.streams.kstream.internals.KGroupedTableImplTest > shouldAllowNullStoreNameOnCount
STARTED

org.apache.kafka.streams.kstream.internals.KGroupedTableImplTest > shouldAllowNullStoreNameOnCount
PASSED

org.apache.kafka.streams.kstream.internals.KGroupedTableImplTest > shouldAllowNullStoreNameOnAggregate
STARTED

org.apache.kafka.streams.kstream.internals.KGroupedTableImplTest > shouldAllowNullStoreNameOnAggregate
PASSED

org.apache.kafka.streams.kstream.internals.KGroupedTableImplTest > shouldNotAllowInvalidStoreNameOnAggregate
STARTED

org.apache.kafka.streams.kstream.internals.KGroupedTableImplTest > shouldNotAllowInvalidStoreNameOnAggregate
PASSED

org.apache.kafka.streams.kstream.internals.KGroupedTableImplTest > shouldReduce STARTED

org.apache.kafka.streams.kstream.internals.KGroupedTableImplTest > shouldReduce PASSED

org.apache.kafka.streams.kstream.internals.KGroupedTableImplTest > shouldNotAllowNullAdderOnReduce
STARTED

org.apache.kafka.streams.kstream.internals.KGroupedTableImplTest > shouldNotAllowNullAdderOnReduce
PASSED

org.apache.kafka.streams.kstream.internals.KGroupedTableImplTest > shouldNotAllowNullStoreSupplierOnReduce
STARTED

org.apache.kafka.streams.kstream.internals.KGroupedTableImplTest > shouldNotAllowNullStoreSupplierOnReduce
PASSED

org.apache.kafka.streams.kstream.internals.KGroupedTableImplTest > shouldAllowNullStoreNameOnReduce
STARTED

org.apache.kafka.streams.kstream.internals.KGroupedTableImplTest > shouldAllowNullStoreNameOnReduce
PASSED

org.apache.kafka.streams.kstream.internals.KGroupedTableImplTest > shouldNotAllowNullAdderOnAggregate
STARTED

org.apache.kafka.streams.kstream.internals.KGroupedTableImplTest > shouldNotAllowNullAdderOnAggregate
PASSED

org.apache.kafka.streams.kstream.internals.KGroupedTableImplTest > shouldNotAllowNullSubtractorOnReduce
STARTED

org.apache.kafka.streams.kstream.internals.KGroupedTableImplTest > shouldNotAllowNullSubtractorOnReduce
PASSED

org.apache.kafka.streams.kstream.internals.KGroupedTableImplTest > shouldReduceWithInternalStoreName
STARTED

org.apache.kafka.streams.kstream.internals.KGroupedTableImplTest > shouldReduceWithInternalStoreName
PASSED

org.apache.kafka.streams.kstream.internals.KGroupedTableImplTest > shouldNotAllowInvalidStoreNameOnReduce
STARTED

org.apache.kafka.streams.kstream.internals.KGroupedTableImplTest > shouldNotAllowInvalidStoreNameOnReduce
PASSED

org.apache.kafka.streams.kstream.internals.KTableKTableJoinTest > testJoin STARTED

org.apache.kafka.streams.kstream.internals.KTableKTableJoinTest > testJoin PASSED

org.apache.kafka.streams.kstream.internals.KTableKTableJoinTest > testNotSendingOldValues
STARTED

org.apache.kafka.streams.kstream.internals.KTableKTableJoinTest > testNotSendingOldValues
PASSED

org.apache.kafka.streams.kstream.internals.KTableKTableJoinTest > testQueryableNotSendingOldValues
STARTED

org.apache.kafka.streams.kstream.internals.KTableKTableJoinTest > testQueryableNotSendingOldValues
PASSED

org.apache.kafka.streams.kstream.internals.KTableKTableJoinTest > testSendingOldValues
STARTED

org.apache.kafka.streams.kstream.internals.KTableKTableJoinTest > testSendingOldValues
PASSED

org.apache.kafka.streams.kstream.internals.KTableKTableJoinTest > testQueryableJoin STARTED

org.apache.kafka.streams.kstream.internals.KTableKTableJoinTest > testQueryableJoin PASSED

org.apache.kafka.streams.kstream.internals.KStreamSelectKeyTest > testSelectKey STARTED

org.apache.kafka.streams.kstream.internals.KStreamSelectKeyTest > testSelectKey PASSED

org.apache.kafka.streams.kstream.internals.KStreamSelectKeyTest > testTypeVariance STARTED

org.apache.kafka.streams.kstream.internals.KStreamSelectKeyTest > testTypeVariance PASSED

org.apache.kafka.streams.kstream.internals.KStreamMapTest > testMap STARTED

org.apache.kafka.streams.kstream.internals.KStreamMapTest > testMap PASSED

org.apache.kafka.streams.kstream.internals.KStreamMapTest > testTypeVariance STARTED

org.apache.kafka.streams.kstream.internals.KStreamMapTest > testTypeVariance PASSED

org.apache.kafka.streams.kstream.WindowsTest > retentionTimeMustNotBeNegative STARTED

org.apache.kafka.streams.kstream.WindowsTest > retentionTimeMustNotBeNegative PASSED

org.apache.kafka.streams.kstream.WindowsTest > numberOfSegmentsMustBeAtLeastTwo STARTED

org.apache.kafka.streams.kstream.WindowsTest > numberOfSegmentsMustBeAtLeastTwo PASSED

org.apache.kafka.streams.kstream.WindowsTest > shouldSetWindowRetentionTime STARTED

org.apache.kafka.streams.kstream.WindowsTest > shouldSetWindowRetentionTime PASSED

org.apache.kafka.streams.kstream.WindowsTest > shouldSetNumberOfSegments STARTED

org.apache.kafka.streams.kstream.WindowsTest > shouldSetNumberOfSegments PASSED

1255 tests completed, 2 failed

> Task :streams:test FAILED

FAILURE: Build failed with an exception.

* What went wrong:
Execution failed for task ':streams:test'.
> There were failing tests. See the report at: file://<https://builds.apache.org/job/kafka-0.11.0-jdk7/ws/streams/build/reports/tests/test/index.html>

* Try:
Run with --stacktrace option to get the stack trace. Run with --info or --debug option to
get more log output. Run with --scan to get full insights.

* Get more help at https://help.gradle.org

Deprecated Gradle features were used in this build, making it incompatible with Gradle 5.0.
See https://docs.gradle.org/4.8.1/userguide/command_line_interface.html#sec:command_line_warnings

BUILD FAILED in 1h 41m 32s
55 actionable tasks: 37 executed, 18 up-to-date
Build step 'Execute shell' marked build as failure
[FINDBUGS] Collecting findbugs analysis files...
Setting GRADLE_4_4_HOME=/home/jenkins/tools/gradle/4.4
[FINDBUGS] Searching for all files in <https://builds.apache.org/job/kafka-0.11.0-jdk7/ws/>
that match the pattern **/build/reports/findbugs/*.xml
[FINDBUGS] Parsing 5 files in <https://builds.apache.org/job/kafka-0.11.0-jdk7/ws/>
[FINDBUGS] Successfully parsed file <https://builds.apache.org/job/kafka-0.11.0-jdk7/ws/clients/build/reports/findbugs/main.xml>
with 0 unique warnings and 0 duplicates.
[FINDBUGS] Successfully parsed file <https://builds.apache.org/job/kafka-0.11.0-jdk7/ws/core/build/reports/findbugs/main.xml>
with 0 unique warnings and 0 duplicates.
[FINDBUGS] Successfully parsed file <https://builds.apache.org/job/kafka-0.11.0-jdk7/ws/examples/build/reports/findbugs/main.xml>
with 0 unique warnings and 0 duplicates.
[FINDBUGS] Successfully parsed file <https://builds.apache.org/job/kafka-0.11.0-jdk7/ws/log4j-appender/build/reports/findbugs/main.xml>
with 0 unique warnings and 0 duplicates.
[FINDBUGS] Successfully parsed file <https://builds.apache.org/job/kafka-0.11.0-jdk7/ws/streams/build/reports/findbugs/main.xml>
with 0 unique warnings and 0 duplicates.
Setting GRADLE_4_4_HOME=/home/jenkins/tools/gradle/4.4
Setting GRADLE_4_4_HOME=/home/jenkins/tools/gradle/4.4
<Git Blamer> Using GitBlamer to create author and commit information for all warnings.
<Git Blamer> GIT_COMMIT=156a28844ffbbe844f041a3177af48817e4192ee, workspace=<https://builds.apache.org/job/kafka-0.11.0-jdk7/ws/>
[FINDBUGS] Computing warning deltas based on reference build #385
Recording test results
Setting GRADLE_4_4_HOME=/home/jenkins/tools/gradle/4.4
Setting GRADLE_4_4_HOME=/home/jenkins/tools/gradle/4.4
Not sending mail to unregistered user rajinisivaram@googlemail.com

Mime
View raw message