kafka-dev mailing list archives

Site index · List index
Message view « Date » · « Thread »
Top « Date » · « Thread »
From Apache Jenkins Server <jenk...@builds.apache.org>
Subject Build failed in Jenkins: kafka-0.10.2-jdk7 #225
Date Thu, 05 Jul 2018 21:13:06 GMT
See <https://builds.apache.org/job/kafka-0.10.2-jdk7/225/display/redirect>

------------------------------------------
[...truncated 1.32 MB...]

org.apache.kafka.streams.processor.internals.StreamThreadTest > shouldNotViolateAtLeastOnceWhenExceptionOccursDuringCloseTopologyWhenSuspendingState
STARTED

org.apache.kafka.streams.processor.internals.StreamThreadTest > shouldNotViolateAtLeastOnceWhenExceptionOccursDuringCloseTopologyWhenSuspendingState
PASSED

org.apache.kafka.streams.processor.internals.StreamThreadTest > testPartitionAssignmentChange
STARTED

org.apache.kafka.streams.processor.internals.StreamThreadTest > testPartitionAssignmentChange
PASSED

org.apache.kafka.streams.processor.internals.StreamThreadTest > testMaybeClean STARTED

org.apache.kafka.streams.processor.internals.StreamThreadTest > testMaybeClean PASSED

org.apache.kafka.streams.processor.internals.StreamThreadTest > shouldReleaseStateDirLockIfFailureOnTaskCloseForUnassignedSuspendedTask
STARTED

org.apache.kafka.streams.processor.internals.StreamThreadTest > shouldReleaseStateDirLockIfFailureOnTaskCloseForUnassignedSuspendedTask
PASSED

org.apache.kafka.streams.processor.internals.StreamThreadTest > testMetrics STARTED

org.apache.kafka.streams.processor.internals.StreamThreadTest > testMetrics PASSED

org.apache.kafka.streams.processor.internals.StreamThreadTest > shouldCloseSuspendedTasksThatAreNoLongerAssignedToThisStreamThreadBeforeCreatingNewTasks
STARTED

org.apache.kafka.streams.processor.internals.StreamThreadTest > shouldCloseSuspendedTasksThatAreNoLongerAssignedToThisStreamThreadBeforeCreatingNewTasks
PASSED

org.apache.kafka.streams.processor.internals.StreamThreadTest > shouldNotViolateAtLeastOnceWhenAnExceptionOccursOnTaskFlushDuringShutdown
STARTED

org.apache.kafka.streams.processor.internals.StreamThreadTest > shouldNotViolateAtLeastOnceWhenAnExceptionOccursOnTaskFlushDuringShutdown
PASSED

org.apache.kafka.streams.processor.internals.StreamsKafkaClientTest > testConfigFromStreamsConfig
STARTED

org.apache.kafka.streams.processor.internals.StreamsKafkaClientTest > testConfigFromStreamsConfig
PASSED

org.apache.kafka.streams.processor.LogAndSkipOnInvalidTimestampTest > logAndSkipOnInvalidTimestamp
STARTED

org.apache.kafka.streams.processor.LogAndSkipOnInvalidTimestampTest > logAndSkipOnInvalidTimestamp
PASSED

org.apache.kafka.streams.processor.LogAndSkipOnInvalidTimestampTest > extractMetadataTimestamp
STARTED

org.apache.kafka.streams.processor.LogAndSkipOnInvalidTimestampTest > extractMetadataTimestamp
PASSED

org.apache.kafka.streams.processor.FailOnInvalidTimestampTest > failOnInvalidTimestamp
STARTED

org.apache.kafka.streams.processor.FailOnInvalidTimestampTest > failOnInvalidTimestamp
PASSED

org.apache.kafka.streams.processor.FailOnInvalidTimestampTest > extractMetadataTimestamp
STARTED

org.apache.kafka.streams.processor.FailOnInvalidTimestampTest > extractMetadataTimestamp
PASSED

org.apache.kafka.streams.processor.WallclockTimestampExtractorTest > extractSystemTimestamp
STARTED

org.apache.kafka.streams.processor.WallclockTimestampExtractorTest > extractSystemTimestamp
PASSED

org.apache.kafka.streams.processor.TopologyBuilderTest > shouldNotAllowNullProcessorSupplier
STARTED

org.apache.kafka.streams.processor.TopologyBuilderTest > shouldNotAllowNullProcessorSupplier
PASSED

org.apache.kafka.streams.processor.TopologyBuilderTest > shouldNotSetApplicationIdToNull
STARTED

org.apache.kafka.streams.processor.TopologyBuilderTest > shouldNotSetApplicationIdToNull
PASSED

org.apache.kafka.streams.processor.TopologyBuilderTest > testSourceTopics STARTED

org.apache.kafka.streams.processor.TopologyBuilderTest > testSourceTopics PASSED

org.apache.kafka.streams.processor.TopologyBuilderTest > shouldNotAllowNullNameWhenAddingSink
STARTED

org.apache.kafka.streams.processor.TopologyBuilderTest > shouldNotAllowNullNameWhenAddingSink
PASSED

org.apache.kafka.streams.processor.TopologyBuilderTest > testNamedTopicMatchesAlreadyProvidedPattern
STARTED

org.apache.kafka.streams.processor.TopologyBuilderTest > testNamedTopicMatchesAlreadyProvidedPattern
PASSED

org.apache.kafka.streams.processor.TopologyBuilderTest > shouldAddInternalTopicConfigWithCompactAndDeleteSetForWindowStores
STARTED

org.apache.kafka.streams.processor.TopologyBuilderTest > shouldAddInternalTopicConfigWithCompactAndDeleteSetForWindowStores
PASSED

org.apache.kafka.streams.processor.TopologyBuilderTest > shouldAddInternalTopicConfigWithCompactForNonWindowStores
STARTED

org.apache.kafka.streams.processor.TopologyBuilderTest > shouldAddInternalTopicConfigWithCompactForNonWindowStores
PASSED

org.apache.kafka.streams.processor.TopologyBuilderTest > testAddSinkWithSameName STARTED

org.apache.kafka.streams.processor.TopologyBuilderTest > testAddSinkWithSameName PASSED

org.apache.kafka.streams.processor.TopologyBuilderTest > testAddSinkWithSelfParent STARTED

org.apache.kafka.streams.processor.TopologyBuilderTest > testAddSinkWithSelfParent PASSED

org.apache.kafka.streams.processor.TopologyBuilderTest > testAddProcessorWithSelfParent
STARTED

org.apache.kafka.streams.processor.TopologyBuilderTest > testAddProcessorWithSelfParent
PASSED

org.apache.kafka.streams.processor.TopologyBuilderTest > shouldAssociateStateStoreNameWhenStateStoreSupplierIsInternal
STARTED

org.apache.kafka.streams.processor.TopologyBuilderTest > shouldAssociateStateStoreNameWhenStateStoreSupplierIsInternal
PASSED

org.apache.kafka.streams.processor.TopologyBuilderTest > testAddStateStoreWithSink STARTED

org.apache.kafka.streams.processor.TopologyBuilderTest > testAddStateStoreWithSink PASSED

org.apache.kafka.streams.processor.TopologyBuilderTest > testTopicGroups STARTED

org.apache.kafka.streams.processor.TopologyBuilderTest > testTopicGroups PASSED

org.apache.kafka.streams.processor.TopologyBuilderTest > testBuild STARTED

org.apache.kafka.streams.processor.TopologyBuilderTest > testBuild PASSED

org.apache.kafka.streams.processor.TopologyBuilderTest > shouldNotAddNullStateStoreSupplier
STARTED

org.apache.kafka.streams.processor.TopologyBuilderTest > shouldNotAddNullStateStoreSupplier
PASSED

org.apache.kafka.streams.processor.TopologyBuilderTest > shouldNotAllowNullNameWhenAddingSource
STARTED

org.apache.kafka.streams.processor.TopologyBuilderTest > shouldNotAllowNullNameWhenAddingSource
PASSED

org.apache.kafka.streams.processor.TopologyBuilderTest > shouldNotAllowNullTopicWhenAddingSink
STARTED

org.apache.kafka.streams.processor.TopologyBuilderTest > shouldNotAllowNullTopicWhenAddingSink
PASSED

org.apache.kafka.streams.processor.TopologyBuilderTest > testAddStateStoreWithSource STARTED

org.apache.kafka.streams.processor.TopologyBuilderTest > testAddStateStoreWithSource PASSED

org.apache.kafka.streams.processor.TopologyBuilderTest > shouldThroughOnUnassignedStateStoreAccess
STARTED

org.apache.kafka.streams.processor.TopologyBuilderTest > shouldThroughOnUnassignedStateStoreAccess
PASSED

org.apache.kafka.streams.processor.TopologyBuilderTest > shouldNotAllowNullProcessorNameWhenConnectingProcessorAndStateStores
STARTED

org.apache.kafka.streams.processor.TopologyBuilderTest > shouldNotAllowNullProcessorNameWhenConnectingProcessorAndStateStores
PASSED

org.apache.kafka.streams.processor.TopologyBuilderTest > testAddSourceWithSameName STARTED

org.apache.kafka.streams.processor.TopologyBuilderTest > testAddSourceWithSameName PASSED

org.apache.kafka.streams.processor.TopologyBuilderTest > testAddMoreThanOnePatternSourceNode
STARTED

org.apache.kafka.streams.processor.TopologyBuilderTest > testAddMoreThanOnePatternSourceNode
PASSED

org.apache.kafka.streams.processor.TopologyBuilderTest > testAddProcessorWithSameName STARTED

org.apache.kafka.streams.processor.TopologyBuilderTest > testAddProcessorWithSameName PASSED

org.apache.kafka.streams.processor.TopologyBuilderTest > shouldSetCorrectSourceNodesWithRegexUpdatedTopics
STARTED

org.apache.kafka.streams.processor.TopologyBuilderTest > shouldSetCorrectSourceNodesWithRegexUpdatedTopics
PASSED

org.apache.kafka.streams.processor.TopologyBuilderTest > shouldConnectRegexMatchedTopicsToStateStore
STARTED

org.apache.kafka.streams.processor.TopologyBuilderTest > shouldConnectRegexMatchedTopicsToStateStore
PASSED

org.apache.kafka.streams.processor.TopologyBuilderTest > testAddSourceWithSameTopic STARTED

org.apache.kafka.streams.processor.TopologyBuilderTest > testAddSourceWithSameTopic PASSED

org.apache.kafka.streams.processor.TopologyBuilderTest > testTopicGroupsByStateStore STARTED

org.apache.kafka.streams.processor.TopologyBuilderTest > testTopicGroupsByStateStore PASSED

org.apache.kafka.streams.processor.TopologyBuilderTest > testAddStateStoreWithDuplicates
STARTED

org.apache.kafka.streams.processor.TopologyBuilderTest > testAddStateStoreWithDuplicates
PASSED

org.apache.kafka.streams.processor.TopologyBuilderTest > testPatternSourceTopic STARTED

org.apache.kafka.streams.processor.TopologyBuilderTest > testPatternSourceTopic PASSED

org.apache.kafka.streams.processor.TopologyBuilderTest > shouldAssociateStateStoreNameWhenStateStoreSupplierIsExternal
STARTED

org.apache.kafka.streams.processor.TopologyBuilderTest > shouldAssociateStateStoreNameWhenStateStoreSupplierIsExternal
PASSED

org.apache.kafka.streams.processor.TopologyBuilderTest > testAddSinkWithWrongParent STARTED

org.apache.kafka.streams.processor.TopologyBuilderTest > testAddSinkWithWrongParent PASSED

org.apache.kafka.streams.processor.TopologyBuilderTest > testPatternMatchesAlreadyProvidedTopicSource
STARTED

org.apache.kafka.streams.processor.TopologyBuilderTest > testPatternMatchesAlreadyProvidedTopicSource
PASSED

org.apache.kafka.streams.processor.TopologyBuilderTest > testAddSinkConnectedWithMultipleParent
STARTED

org.apache.kafka.streams.processor.TopologyBuilderTest > testAddSinkConnectedWithMultipleParent
PASSED

org.apache.kafka.streams.processor.TopologyBuilderTest > testSubscribeTopicNameAndPattern
STARTED

org.apache.kafka.streams.processor.TopologyBuilderTest > testSubscribeTopicNameAndPattern
PASSED

org.apache.kafka.streams.processor.TopologyBuilderTest > shouldNotAddNullInternalTopic
STARTED

org.apache.kafka.streams.processor.TopologyBuilderTest > shouldNotAddNullInternalTopic
PASSED

org.apache.kafka.streams.processor.TopologyBuilderTest > testAddProcessorWithWrongParent
STARTED

org.apache.kafka.streams.processor.TopologyBuilderTest > testAddProcessorWithWrongParent
PASSED

org.apache.kafka.streams.processor.TopologyBuilderTest > shouldNotAllowNullNameWhenAddingProcessor
STARTED

org.apache.kafka.streams.processor.TopologyBuilderTest > shouldNotAllowNullNameWhenAddingProcessor
PASSED

org.apache.kafka.streams.processor.TopologyBuilderTest > testAddStateStore STARTED

org.apache.kafka.streams.processor.TopologyBuilderTest > testAddStateStore PASSED

org.apache.kafka.streams.processor.TopologyBuilderTest > testAddSinkConnectedWithParent
STARTED

org.apache.kafka.streams.processor.TopologyBuilderTest > testAddSinkConnectedWithParent
PASSED

org.apache.kafka.streams.processor.TopologyBuilderTest > testAddStateStoreWithNonExistingProcessor
STARTED

org.apache.kafka.streams.processor.TopologyBuilderTest > testAddStateStoreWithNonExistingProcessor
PASSED

org.apache.kafka.streams.processor.TopologyBuilderTest > shouldAddInternalTopicConfigWithCleanupPolicyDeleteForInternalTopics
STARTED

org.apache.kafka.streams.processor.TopologyBuilderTest > shouldAddInternalTopicConfigWithCleanupPolicyDeleteForInternalTopics
PASSED

org.apache.kafka.streams.processor.TopologyBuilderTest > shouldCorrectlyMapStateStoreToInternalTopics
STARTED

org.apache.kafka.streams.processor.TopologyBuilderTest > shouldCorrectlyMapStateStoreToInternalTopics
PASSED

932 tests completed, 2 failed

> Task :streams:test FAILED

FAILURE: Build failed with an exception.

* What went wrong:
Execution failed for task ':streams:test'.
> There were failing tests. See the report at: file://<https://builds.apache.org/job/kafka-0.10.2-jdk7/ws/streams/build/reports/tests/test/index.html>

* Try:
Run with --stacktrace option to get the stack trace. Run with --info or --debug option to
get more log output. Run with --scan to get full insights.

* Get more help at https://help.gradle.org

Deprecated Gradle features were used in this build, making it incompatible with Gradle 5.0.
See https://docs.gradle.org/4.8.1/userguide/command_line_interface.html#sec:command_line_warnings

BUILD FAILED in 2h 38m 34s
50 actionable tasks: 31 executed, 19 up-to-date
Build step 'Execute shell' marked build as failure
Recording test results
ERROR: No tool found matching GRADLE_2_4_RC_2_HOME
Setting GRADLE_4_8_1_HOME=/home/jenkins/tools/gradle/4.8.1
ERROR: No tool found matching GRADLE_2_4_RC_2_HOME
Setting GRADLE_4_8_1_HOME=/home/jenkins/tools/gradle/4.8.1
Not sending mail to unregistered user github@alasdairhodge.co.uk
Not sending mail to unregistered user rajinisivaram@googlemail.com

Mime
View raw message