kafka-dev mailing list archives

Site index · List index
Message view « Date » · « Thread »
Top « Date » · « Thread »
From Apache Jenkins Server <jenk...@builds.apache.org>
Subject Build failed in Jenkins: kafka-2.0-jdk8 #58
Date Wed, 27 Jun 2018 03:49:35 GMT
See <https://builds.apache.org/job/kafka-2.0-jdk8/58/display/redirect?page=changes>

Changes:

[wangguoz] HOTFIX: update Streams security docs

------------------------------------------
[...truncated 430.29 KB...]

kafka.controller.ReplicaStateMachineTest > testInvalidOfflineReplicaToReplicaDeletionSuccessfulTransition
STARTED

kafka.controller.ReplicaStateMachineTest > testInvalidOfflineReplicaToReplicaDeletionSuccessfulTransition
PASSED

kafka.controller.ReplicaStateMachineTest > testOfflineReplicaToOnlineReplicaTransition
STARTED

kafka.controller.ReplicaStateMachineTest > testOfflineReplicaToOnlineReplicaTransition
PASSED

kafka.controller.ReplicaStateMachineTest > testInvalidReplicaDeletionStartedToNonexistentReplicaTransition
STARTED

kafka.controller.ReplicaStateMachineTest > testInvalidReplicaDeletionStartedToNonexistentReplicaTransition
PASSED

kafka.controller.ReplicaStateMachineTest > testOfflineReplicaToReplicaDeletionStartedTransition
STARTED

kafka.controller.ReplicaStateMachineTest > testOfflineReplicaToReplicaDeletionStartedTransition
PASSED

kafka.controller.ReplicaStateMachineTest > testInvalidReplicaDeletionSuccessfulToNewReplicaTransition
STARTED

kafka.controller.ReplicaStateMachineTest > testInvalidReplicaDeletionSuccessfulToNewReplicaTransition
PASSED

kafka.controller.ReplicaStateMachineTest > testInvalidReplicaDeletionIneligibleToNonexistentReplicaTransition
STARTED

kafka.controller.ReplicaStateMachineTest > testInvalidReplicaDeletionIneligibleToNonexistentReplicaTransition
PASSED

kafka.controller.ReplicaStateMachineTest > testReplicaDeletionSuccessfulToNonexistentReplicaTransition
STARTED

kafka.controller.ReplicaStateMachineTest > testReplicaDeletionSuccessfulToNonexistentReplicaTransition
PASSED

kafka.controller.ReplicaStateMachineTest > testInvalidOnlineReplicaToNonexistentReplicaTransition
STARTED

kafka.controller.ReplicaStateMachineTest > testInvalidOnlineReplicaToNonexistentReplicaTransition
PASSED

kafka.controller.ReplicaStateMachineTest > testInvalidOfflineReplicaToReplicaDeletionIneligibleTransition
STARTED

kafka.controller.ReplicaStateMachineTest > testInvalidOfflineReplicaToReplicaDeletionIneligibleTransition
PASSED

kafka.controller.ReplicaStateMachineTest > testNewReplicaToOfflineReplicaTransition STARTED

kafka.controller.ReplicaStateMachineTest > testNewReplicaToOfflineReplicaTransition PASSED

kafka.controller.ReplicaStateMachineTest > testInvalidReplicaDeletionSuccessfulToOnlineReplicaTransition
STARTED

kafka.controller.ReplicaStateMachineTest > testInvalidReplicaDeletionSuccessfulToOnlineReplicaTransition
PASSED

kafka.controller.ReplicaStateMachineTest > testInvalidNonexistentReplicaToReplicaDeletionStartedTransition
STARTED

kafka.controller.ReplicaStateMachineTest > testInvalidNonexistentReplicaToReplicaDeletionStartedTransition
PASSED

kafka.controller.ReplicaStateMachineTest > testInvalidOnlineReplicaToReplicaDeletionSuccessfulTransition
STARTED

kafka.controller.ReplicaStateMachineTest > testInvalidOnlineReplicaToReplicaDeletionSuccessfulTransition
PASSED

kafka.controller.ReplicaStateMachineTest > testInvalidOfflineReplicaToNonexistentReplicaTransition
STARTED

kafka.controller.ReplicaStateMachineTest > testInvalidOfflineReplicaToNonexistentReplicaTransition
PASSED

kafka.controller.ReplicaStateMachineTest > testInvalidOnlineReplicaToReplicaDeletionIneligibleTransition
STARTED

kafka.controller.ReplicaStateMachineTest > testInvalidOnlineReplicaToReplicaDeletionIneligibleTransition
PASSED

kafka.controller.ReplicaStateMachineTest > testInvalidReplicaDeletionSuccessfulToReplicaDeletionStartedTransition
STARTED

kafka.controller.ReplicaStateMachineTest > testInvalidReplicaDeletionSuccessfulToReplicaDeletionStartedTransition
PASSED

kafka.controller.ReplicaStateMachineTest > testInvalidNewReplicaToReplicaDeletionSuccessfulTransition
STARTED

kafka.controller.ReplicaStateMachineTest > testInvalidNewReplicaToReplicaDeletionSuccessfulTransition
PASSED

kafka.controller.ReplicaStateMachineTest > testInvalidReplicaDeletionIneligibleToReplicaDeletionStartedTransition
STARTED

kafka.controller.ReplicaStateMachineTest > testInvalidReplicaDeletionIneligibleToReplicaDeletionStartedTransition
PASSED

kafka.controller.ReplicaStateMachineTest > testInvalidReplicaDeletionStartedToOfflineReplicaTransition
STARTED

kafka.controller.ReplicaStateMachineTest > testInvalidReplicaDeletionStartedToOfflineReplicaTransition
PASSED

kafka.controller.ReplicaStateMachineTest > testInvalidNewReplicaToReplicaDeletionStartedTransition
STARTED

kafka.controller.ReplicaStateMachineTest > testInvalidNewReplicaToReplicaDeletionStartedTransition
PASSED

kafka.controller.ReplicaStateMachineTest > testOnlineReplicaToOnlineReplicaTransition STARTED

kafka.controller.ReplicaStateMachineTest > testOnlineReplicaToOnlineReplicaTransition PASSED

kafka.controller.ReplicaStateMachineTest > testInvalidNewReplicaToReplicaDeletionIneligibleTransition
STARTED

kafka.controller.ReplicaStateMachineTest > testInvalidNewReplicaToReplicaDeletionIneligibleTransition
PASSED

kafka.controller.ReplicaStateMachineTest > testInvalidNonexistentReplicaToOfflineReplicaTransition
STARTED

kafka.controller.ReplicaStateMachineTest > testInvalidNonexistentReplicaToOfflineReplicaTransition
PASSED

kafka.controller.ReplicaStateMachineTest > testReplicaDeletionStartedToReplicaDeletionSuccessfulTransition
STARTED

kafka.controller.ReplicaStateMachineTest > testReplicaDeletionStartedToReplicaDeletionSuccessfulTransition
PASSED

kafka.controller.ReplicaStateMachineTest > testInvalidNonexistentReplicaToOnlineReplicaTransition
STARTED

kafka.controller.ReplicaStateMachineTest > testInvalidNonexistentReplicaToOnlineReplicaTransition
PASSED

kafka.controller.ReplicaStateMachineTest > testInvalidOnlineReplicaToNewReplicaTransition
STARTED

kafka.controller.ReplicaStateMachineTest > testInvalidOnlineReplicaToNewReplicaTransition
PASSED

kafka.controller.ReplicaStateMachineTest > testReplicaDeletionStartedToReplicaDeletionIneligibleTransition
STARTED

kafka.controller.ReplicaStateMachineTest > testReplicaDeletionStartedToReplicaDeletionIneligibleTransition
PASSED

kafka.controller.ReplicaStateMachineTest > testInvalidReplicaDeletionSuccessfulToOfflineReplicaTransition
STARTED

kafka.controller.ReplicaStateMachineTest > testInvalidReplicaDeletionSuccessfulToOfflineReplicaTransition
PASSED

kafka.controller.ReplicaStateMachineTest > testInvalidReplicaDeletionIneligibleToNewReplicaTransition
STARTED

kafka.controller.ReplicaStateMachineTest > testInvalidReplicaDeletionIneligibleToNewReplicaTransition
PASSED

kafka.controller.ReplicaStateMachineTest > testReplicaDeletionIneligibleToOnlineReplicaTransition
STARTED

kafka.controller.ReplicaStateMachineTest > testReplicaDeletionIneligibleToOnlineReplicaTransition
PASSED

kafka.controller.ReplicaStateMachineTest > testInvalidReplicaDeletionStartedToNewReplicaTransition
STARTED

kafka.controller.ReplicaStateMachineTest > testInvalidReplicaDeletionStartedToNewReplicaTransition
PASSED

kafka.controller.ReplicaStateMachineTest > testInvalidNonexistentReplicaToReplicaDeletionSuccessfulTransition
STARTED

kafka.controller.ReplicaStateMachineTest > testInvalidNonexistentReplicaToReplicaDeletionSuccessfulTransition
PASSED

kafka.controller.ReplicaStateMachineTest > testNewReplicaToOnlineReplicaTransition STARTED

kafka.controller.ReplicaStateMachineTest > testNewReplicaToOnlineReplicaTransition PASSED

kafka.controller.ControllerIntegrationTest > testPartitionReassignmentWithOfflineReplicaHaltingProgress
STARTED

kafka.controller.ControllerIntegrationTest > testPartitionReassignmentWithOfflineReplicaHaltingProgress
PASSED

kafka.controller.ControllerIntegrationTest > testControllerEpochPersistsWhenAllBrokersDown
STARTED

kafka.controller.ControllerIntegrationTest > testControllerEpochPersistsWhenAllBrokersDown
PASSED

kafka.controller.ControllerIntegrationTest > testTopicCreationWithOfflineReplica STARTED

kafka.controller.ControllerIntegrationTest > testTopicCreationWithOfflineReplica PASSED

kafka.controller.ControllerIntegrationTest > testPartitionReassignmentResumesAfterReplicaComesOnline
STARTED

kafka.controller.ControllerIntegrationTest > testPartitionReassignmentResumesAfterReplicaComesOnline
PASSED

kafka.controller.ControllerIntegrationTest > testLeaderAndIsrWhenEntireIsrOfflineAndUncleanLeaderElectionDisabled
STARTED

kafka.controller.ControllerIntegrationTest > testLeaderAndIsrWhenEntireIsrOfflineAndUncleanLeaderElectionDisabled
PASSED

kafka.controller.ControllerIntegrationTest > testTopicPartitionExpansionWithOfflineReplica
STARTED

kafka.controller.ControllerIntegrationTest > testTopicPartitionExpansionWithOfflineReplica
PASSED

kafka.controller.ControllerIntegrationTest > testPreferredReplicaLeaderElectionWithOfflinePreferredReplica
STARTED

kafka.controller.ControllerIntegrationTest > testPreferredReplicaLeaderElectionWithOfflinePreferredReplica
PASSED

kafka.controller.ControllerIntegrationTest > testAutoPreferredReplicaLeaderElection STARTED

kafka.controller.ControllerIntegrationTest > testAutoPreferredReplicaLeaderElection PASSED

kafka.controller.ControllerIntegrationTest > testTopicCreation STARTED

kafka.controller.ControllerIntegrationTest > testTopicCreation PASSED

kafka.controller.ControllerIntegrationTest > testPartitionReassignment STARTED

kafka.controller.ControllerIntegrationTest > testPartitionReassignment PASSED

kafka.controller.ControllerIntegrationTest > testTopicPartitionExpansion STARTED

kafka.controller.ControllerIntegrationTest > testTopicPartitionExpansion PASSED

kafka.controller.ControllerIntegrationTest > testControllerMoveIncrementsControllerEpoch
STARTED

kafka.controller.ControllerIntegrationTest > testControllerMoveIncrementsControllerEpoch
PASSED

kafka.controller.ControllerIntegrationTest > testLeaderAndIsrWhenEntireIsrOfflineAndUncleanLeaderElectionEnabled
STARTED

kafka.controller.ControllerIntegrationTest > testLeaderAndIsrWhenEntireIsrOfflineAndUncleanLeaderElectionEnabled
PASSED

kafka.controller.ControllerIntegrationTest > testBackToBackPreferredReplicaLeaderElections
STARTED

kafka.controller.ControllerIntegrationTest > testBackToBackPreferredReplicaLeaderElections
PASSED

kafka.controller.ControllerIntegrationTest > testEmptyCluster STARTED

kafka.controller.ControllerIntegrationTest > testEmptyCluster PASSED

kafka.controller.ControllerIntegrationTest > testPreferredReplicaLeaderElection STARTED

kafka.controller.ControllerIntegrationTest > testPreferredReplicaLeaderElection PASSED

unit.kafka.server.FetchRequestDownConversionConfigTest > testV1FetchWithDownConversionDisabled
STARTED

unit.kafka.server.FetchRequestDownConversionConfigTest > testV1FetchWithDownConversionDisabled
PASSED

unit.kafka.server.FetchRequestDownConversionConfigTest > testV1FetchFromReplica STARTED

unit.kafka.server.FetchRequestDownConversionConfigTest > testV1FetchFromReplica PASSED

unit.kafka.server.FetchRequestDownConversionConfigTest > testLatestFetchWithDownConversionDisabled
STARTED

unit.kafka.server.FetchRequestDownConversionConfigTest > testLatestFetchWithDownConversionDisabled
PASSED

unit.kafka.server.FetchRequestDownConversionConfigTest > testV1FetchWithTopicLevelOverrides
STARTED

unit.kafka.server.FetchRequestDownConversionConfigTest > testV1FetchWithTopicLevelOverrides
PASSED

2018 tests completed, 1 failed, 4 skipped

> Task :kafka-2.0-jdk8:core:test FAILED
> Task :test_core_2_11 FAILED

FAILURE: Build failed with an exception.

* What went wrong:
Execution failed for task ':kafka-2.0-jdk8:core:test'.
> There were failing tests. See the report at: file://<https://builds.apache.org/job/kafka-2.0-jdk8/ws/core/build/reports/tests/test/index.html>

* Try:
Run with --stacktrace option to get the stack trace. Run with --info or --debug option to
get more log output. Run with --scan to get full insights.

* Get more help at https://help.gradle.org

BUILD FAILED in 1h 45m 35s
25 actionable tasks: 3 executed, 22 up-to-date
Build step 'Execute shell' marked build as failure
[FINDBUGS] Collecting findbugs analysis files...
Setting GRADLE_4_4_HOME=/home/jenkins/tools/gradle/4.4
[FINDBUGS] Searching for all files in <https://builds.apache.org/job/kafka-2.0-jdk8/ws/>
that match the pattern **/build/reports/findbugs/*.xml
[FINDBUGS] Parsing 1 file in <https://builds.apache.org/job/kafka-2.0-jdk8/ws/>
[FINDBUGS] Successfully parsed file <https://builds.apache.org/job/kafka-2.0-jdk8/ws/core/build/reports/findbugs/main.xml>
with 0 unique warnings and 0 duplicates.
Setting GRADLE_4_4_HOME=/home/jenkins/tools/gradle/4.4
Setting GRADLE_4_4_HOME=/home/jenkins/tools/gradle/4.4
<Git Blamer> Using GitBlamer to create author and commit information for all warnings.
<Git Blamer> GIT_COMMIT=35d8383ec8f97db8571e4cb4c559a21f83be52ad, workspace=<https://builds.apache.org/job/kafka-2.0-jdk8/ws/>
[FINDBUGS] Computing warning deltas based on reference build #54
Recording test results
Setting GRADLE_4_4_HOME=/home/jenkins/tools/gradle/4.4
Setting GRADLE_4_4_HOME=/home/jenkins/tools/gradle/4.4
Not sending mail to unregistered user rajinisivaram@googlemail.com
Not sending mail to unregistered user ismael@juma.me.uk
Not sending mail to unregistered user wangguoz@gmail.com
Not sending mail to unregistered user lindong28@gmail.com

Mime
View raw message