kafka-dev mailing list archives

Site index · List index
Message view « Date » · « Thread »
Top « Date » · « Thread »
From Apache Jenkins Server <jenk...@builds.apache.org>
Subject Build failed in Jenkins: kafka-trunk-jdk8 #2766
Date Mon, 25 Jun 2018 19:07:21 GMT
See <https://builds.apache.org/job/kafka-trunk-jdk8/2766/display/redirect?page=changes>

Changes:

[mjsax] Minor: add exception to debug log for

------------------------------------------
[...truncated 877.51 KB...]

kafka.utils.SchedulerTest > testRestart STARTED

kafka.utils.SchedulerTest > testRestart PASSED

kafka.utils.SchedulerTest > testReentrantTaskInMockScheduler STARTED

kafka.utils.SchedulerTest > testReentrantTaskInMockScheduler PASSED

kafka.utils.SchedulerTest > testPeriodicTask STARTED

kafka.utils.SchedulerTest > testPeriodicTask PASSED

kafka.utils.LoggingTest > testLog4jControllerIsRegistered STARTED

kafka.utils.LoggingTest > testLog4jControllerIsRegistered PASSED

kafka.utils.LoggingTest > testLogName STARTED

kafka.utils.LoggingTest > testLogName PASSED

kafka.utils.LoggingTest > testLogNameOverride STARTED

kafka.utils.LoggingTest > testLogNameOverride PASSED

kafka.utils.ZkUtilsTest > testGetSequenceIdMethod STARTED

kafka.utils.ZkUtilsTest > testGetSequenceIdMethod PASSED

kafka.utils.ZkUtilsTest > testAbortedConditionalDeletePath STARTED

kafka.utils.ZkUtilsTest > testAbortedConditionalDeletePath PASSED

kafka.utils.ZkUtilsTest > testGetAllPartitionsTopicWithoutPartitions STARTED

kafka.utils.ZkUtilsTest > testGetAllPartitionsTopicWithoutPartitions PASSED

kafka.utils.ZkUtilsTest > testSuccessfulConditionalDeletePath STARTED

kafka.utils.ZkUtilsTest > testSuccessfulConditionalDeletePath PASSED

kafka.utils.ZkUtilsTest > testPersistentSequentialPath STARTED

kafka.utils.ZkUtilsTest > testPersistentSequentialPath PASSED

kafka.utils.ZkUtilsTest > testClusterIdentifierJsonParsing STARTED

kafka.utils.ZkUtilsTest > testClusterIdentifierJsonParsing PASSED

kafka.utils.ZkUtilsTest > testGetLeaderIsrAndEpochForPartition STARTED

kafka.utils.ZkUtilsTest > testGetLeaderIsrAndEpochForPartition PASSED

kafka.utils.CoreUtilsTest > testGenerateUuidAsBase64 STARTED

kafka.utils.CoreUtilsTest > testGenerateUuidAsBase64 PASSED

kafka.utils.CoreUtilsTest > testAbs STARTED

kafka.utils.CoreUtilsTest > testAbs PASSED

kafka.utils.CoreUtilsTest > testReplaceSuffix STARTED

kafka.utils.CoreUtilsTest > testReplaceSuffix PASSED

kafka.utils.CoreUtilsTest > testCircularIterator STARTED

kafka.utils.CoreUtilsTest > testCircularIterator PASSED

kafka.utils.CoreUtilsTest > testReadBytes STARTED

kafka.utils.CoreUtilsTest > testReadBytes PASSED

kafka.utils.CoreUtilsTest > testCsvList STARTED

kafka.utils.CoreUtilsTest > testCsvList PASSED

kafka.utils.CoreUtilsTest > testReadInt STARTED

kafka.utils.CoreUtilsTest > testReadInt PASSED

kafka.utils.CoreUtilsTest > testAtomicGetOrUpdate STARTED

kafka.utils.CoreUtilsTest > testAtomicGetOrUpdate PASSED

kafka.utils.CoreUtilsTest > testUrlSafeBase64EncodeUUID STARTED

kafka.utils.CoreUtilsTest > testUrlSafeBase64EncodeUUID PASSED

kafka.utils.CoreUtilsTest > testCsvMap STARTED

kafka.utils.CoreUtilsTest > testCsvMap PASSED

kafka.utils.CoreUtilsTest > testInLock STARTED

kafka.utils.CoreUtilsTest > testInLock PASSED

kafka.utils.CoreUtilsTest > testTryAll STARTED

kafka.utils.CoreUtilsTest > testTryAll PASSED

kafka.utils.CoreUtilsTest > testSwallow STARTED

kafka.utils.CoreUtilsTest > testSwallow PASSED

kafka.utils.IteratorTemplateTest > testIterator STARTED

kafka.utils.IteratorTemplateTest > testIterator PASSED

kafka.utils.json.JsonValueTest > testJsonObjectIterator STARTED

kafka.utils.json.JsonValueTest > testJsonObjectIterator PASSED

kafka.utils.json.JsonValueTest > testDecodeLong STARTED

kafka.utils.json.JsonValueTest > testDecodeLong PASSED

kafka.utils.json.JsonValueTest > testAsJsonObject STARTED

kafka.utils.json.JsonValueTest > testAsJsonObject PASSED

kafka.utils.json.JsonValueTest > testDecodeDouble STARTED

kafka.utils.json.JsonValueTest > testDecodeDouble PASSED

kafka.utils.json.JsonValueTest > testDecodeOption STARTED

kafka.utils.json.JsonValueTest > testDecodeOption PASSED

kafka.utils.json.JsonValueTest > testDecodeString STARTED

kafka.utils.json.JsonValueTest > testDecodeString PASSED

kafka.utils.json.JsonValueTest > testJsonValueToString STARTED

kafka.utils.json.JsonValueTest > testJsonValueToString PASSED

kafka.utils.json.JsonValueTest > testAsJsonObjectOption STARTED

kafka.utils.json.JsonValueTest > testAsJsonObjectOption PASSED

kafka.utils.json.JsonValueTest > testAsJsonArrayOption STARTED

kafka.utils.json.JsonValueTest > testAsJsonArrayOption PASSED

kafka.utils.json.JsonValueTest > testAsJsonArray STARTED

kafka.utils.json.JsonValueTest > testAsJsonArray PASSED

kafka.utils.json.JsonValueTest > testJsonValueHashCode STARTED

kafka.utils.json.JsonValueTest > testJsonValueHashCode PASSED

kafka.utils.json.JsonValueTest > testDecodeInt STARTED

kafka.utils.json.JsonValueTest > testDecodeInt PASSED

kafka.utils.json.JsonValueTest > testDecodeMap STARTED

kafka.utils.json.JsonValueTest > testDecodeMap PASSED

kafka.utils.json.JsonValueTest > testDecodeSeq STARTED

kafka.utils.json.JsonValueTest > testDecodeSeq PASSED

kafka.utils.json.JsonValueTest > testJsonObjectGet STARTED

kafka.utils.json.JsonValueTest > testJsonObjectGet PASSED

kafka.utils.json.JsonValueTest > testJsonValueEquals STARTED

kafka.utils.json.JsonValueTest > testJsonValueEquals PASSED

kafka.utils.json.JsonValueTest > testJsonArrayIterator STARTED

kafka.utils.json.JsonValueTest > testJsonArrayIterator PASSED

kafka.utils.json.JsonValueTest > testJsonObjectApply STARTED

kafka.utils.json.JsonValueTest > testJsonObjectApply PASSED

kafka.utils.json.JsonValueTest > testDecodeBoolean STARTED

kafka.utils.json.JsonValueTest > testDecodeBoolean PASSED

kafka.utils.TopicFilterTest > testWhitelists STARTED

kafka.utils.TopicFilterTest > testWhitelists PASSED

kafka.utils.PasswordEncoderTest > testEncoderConfigChange STARTED

kafka.utils.PasswordEncoderTest > testEncoderConfigChange PASSED

kafka.utils.PasswordEncoderTest > testEncodeDecodeAlgorithms STARTED

kafka.utils.PasswordEncoderTest > testEncodeDecodeAlgorithms PASSED

kafka.utils.PasswordEncoderTest > testEncodeDecode STARTED

kafka.utils.PasswordEncoderTest > testEncodeDecode PASSED

unit.kafka.server.FetchRequestDownConversionConfigTest > testV1FetchWithDownConversionDisabled
STARTED

unit.kafka.server.FetchRequestDownConversionConfigTest > testV1FetchWithDownConversionDisabled
PASSED

unit.kafka.server.FetchRequestDownConversionConfigTest > testV1FetchFromReplica STARTED

unit.kafka.server.FetchRequestDownConversionConfigTest > testV1FetchFromReplica PASSED

unit.kafka.server.FetchRequestDownConversionConfigTest > testLatestFetchWithDownConversionDisabled
STARTED

unit.kafka.server.FetchRequestDownConversionConfigTest > testLatestFetchWithDownConversionDisabled
PASSED

unit.kafka.server.FetchRequestDownConversionConfigTest > testV1FetchWithTopicLevelOverrides
STARTED

unit.kafka.server.FetchRequestDownConversionConfigTest > testV1FetchWithTopicLevelOverrides
PASSED

2020 tests completed, 3 failed, 4 skipped

> Task :kafka-trunk-jdk8:core:test FAILED
> Task :test_core_2_12 FAILED

FAILURE: Build failed with an exception.

* What went wrong:
Execution failed for task ':kafka-trunk-jdk8:core:test'.
> There were failing tests. See the report at: file://<https://builds.apache.org/job/kafka-trunk-jdk8/ws/core/build/reports/tests/test/index.html>

* Try:
Run with --stacktrace option to get the stack trace. Run with --info or --debug option to
get more log output. Run with --scan to get full insights.

* Get more help at https://help.gradle.org

BUILD FAILED in 2h 50m 3s
26 actionable tasks: 17 executed, 9 up-to-date
Build step 'Execute shell' marked build as failure
[FINDBUGS] Collecting findbugs analysis files...
Setting GRADLE_4_4_HOME=/home/jenkins/tools/gradle/4.4
[FINDBUGS] Searching for all files in <https://builds.apache.org/job/kafka-trunk-jdk8/ws/>
that match the pattern **/build/reports/findbugs/*.xml
[FINDBUGS] Parsing 1 file in <https://builds.apache.org/job/kafka-trunk-jdk8/ws/>
[FINDBUGS] Successfully parsed file <https://builds.apache.org/job/kafka-trunk-jdk8/ws/core/build/reports/findbugs/main.xml>
with 0 unique warnings and 0 duplicates.
Setting GRADLE_4_4_HOME=/home/jenkins/tools/gradle/4.4
Setting GRADLE_4_4_HOME=/home/jenkins/tools/gradle/4.4
<Git Blamer> Using GitBlamer to create author and commit information for all warnings.
<Git Blamer> GIT_COMMIT=2f36da1747e62a21108e21edacaf2e5ef12c2d6a, workspace=<https://builds.apache.org/job/kafka-trunk-jdk8/ws/>
[FINDBUGS] Computing warning deltas based on reference build #2765
Recording test results
Setting GRADLE_4_4_HOME=/home/jenkins/tools/gradle/4.4
Setting GRADLE_4_4_HOME=/home/jenkins/tools/gradle/4.4

Mime
View raw message