kafka-dev mailing list archives

Site index · List index
Message view « Date » · « Thread »
Top « Date » · « Thread »
From Apache Jenkins Server <jenk...@builds.apache.org>
Subject Build failed in Jenkins: kafka-1.1-jdk7 #155
Date Sun, 24 Jun 2018 00:16:12 GMT
See <https://builds.apache.org/job/kafka-1.1-jdk7/155/display/redirect?page=changes>

Changes:

[ismael] MINOR: Avoid coarse lock in Pool#getAndMaybePut (#5258)

------------------------------------------
Started by an SCM change
[EnvInject] - Loading node environment variables.
Building remotely on H29 (ubuntu xenial) in workspace <https://builds.apache.org/job/kafka-1.1-jdk7/ws/>
 > git rev-parse --is-inside-work-tree # timeout=10
Fetching changes from the remote Git repository
 > git config remote.origin.url https://github.com/apache/kafka.git # timeout=10
Fetching upstream changes from https://github.com/apache/kafka.git
 > git --version # timeout=10
 > git fetch --tags --progress https://github.com/apache/kafka.git +refs/heads/*:refs/remotes/origin/*
 > git rev-parse refs/remotes/origin/1.1^{commit} # timeout=10
 > git rev-parse refs/remotes/origin/origin/1.1^{commit} # timeout=10
Checking out Revision dc3acb065a62972b43988b6a26f1b85c12e648ad (refs/remotes/origin/1.1)
 > git config core.sparsecheckout # timeout=10
 > git checkout -f dc3acb065a62972b43988b6a26f1b85c12e648ad
Commit message: "MINOR: Avoid coarse lock in Pool#getAndMaybePut (#5258)"
 > git rev-list --no-walk 22346636641e9a5708c5f8e8d31123a6c13dbf2f # timeout=10
Setting GRADLE_3_5_HOME=/home/jenkins/tools/gradle/3.5
[kafka-1.1-jdk7] $ /bin/bash -xe /tmp/jenkins3222165898034345385.sh
+ rm -rf <https://builds.apache.org/job/kafka-1.1-jdk7/ws/.gradle>
+ /home/jenkins/tools/gradle/3.5/bin/gradle
To honour the JVM settings for this build a new JVM will be forked. Please consider using
the daemon: https://docs.gradle.org/3.5/userguide/gradle_daemon.html.
Daemon will be stopped at the end of the build stopping after processing
Building project 'core' with Scala version 2.11.12
Cleaned up directory '<https://builds.apache.org/job/kafka-1.1-jdk7/ws/clients/build/resources/test'>
Cleaned up directory '<https://builds.apache.org/job/kafka-1.1-jdk7/ws/tools/build/resources/test'>
Cleaned up directory '<https://builds.apache.org/job/kafka-1.1-jdk7/ws/connect/runtime/build/resources/test'>
Cleaned up directory '<https://builds.apache.org/job/kafka-1.1-jdk7/ws/connect/json/build/resources/test'>
Cleaned up directory '<https://builds.apache.org/job/kafka-1.1-jdk7/ws/core/build/resources/test'>
Cleaned up directory '<https://builds.apache.org/job/kafka-1.1-jdk7/ws/streams/build/resources/test'>
:downloadWrapper

BUILD SUCCESSFUL

Total time: 24.043 secs
Setting GRADLE_3_5_HOME=/home/jenkins/tools/gradle/3.5
[kafka-1.1-jdk7] $ /bin/bash -xe /tmp/jenkins6316065570494158517.sh
+ export 'GRADLE_OPTS=-Xmx1024m -XX:MaxPermSize=256m'
+ GRADLE_OPTS='-Xmx1024m -XX:MaxPermSize=256m'
+ ./gradlew --no-daemon -PmaxParallelForks=1 -PtestLoggingEvents=started,passed,skipped,failed
-PxmlFindBugsReport=true clean testAll
To honour the JVM settings for this build a new JVM will be forked. Please consider using
the daemon: https://docs.gradle.org/4.8.1/userguide/gradle_daemon.html.
Daemon will be stopped at the end of the build stopping after processing

> Configure project :
Building project 'core' with Scala version 2.11.12

> Task :clean UP-TO-DATE
> Task :clients:clean
> Task :connect:clean UP-TO-DATE
> Task :core:clean
> Task :examples:clean
> Task :jmh-benchmarks:clean UP-TO-DATE
> Task :log4j-appender:clean
> Task :streams:clean
> Task :tools:clean
> Task :connect:api:clean
> Task :connect:file:clean
> Task :connect:json:clean
> Task :connect:runtime:clean
> Task :connect:transforms:clean
> Task :streams:examples:clean
> Task :streams:test-utils:clean
> Task :streams:upgrade-system-tests-0100:clean UP-TO-DATE
> Task :streams:upgrade-system-tests-0101:clean UP-TO-DATE
> Task :streams:upgrade-system-tests-0102:clean UP-TO-DATE
> Task :streams:upgrade-system-tests-0110:clean UP-TO-DATE
> Task :streams:upgrade-system-tests-10:clean UP-TO-DATE

> Configure project :kafka-1.1-jdk7
Building project 'core' with Scala version 2.11.12

> Task :kafka-1.1-jdk7:clients:compileJava
<https://builds.apache.org/job/kafka-1.1-jdk7/ws/clients/src/main/java/org/apache/kafka/clients/consumer/internals/Fetcher.java>:743:
warning: [deprecation] offsets in PartitionData has been deprecated
                        offset = partitionData.offsets.get(0);
                                              ^
Note: Some input files use unchecked or unsafe operations.
Note: Recompile with -Xlint:unchecked for details.
1 warning

> Task :kafka-1.1-jdk7:clients:processResources NO-SOURCE
> Task :kafka-1.1-jdk7:clients:classes
> Task :kafka-1.1-jdk7:clients:determineCommitId UP-TO-DATE
> Task :kafka-1.1-jdk7:clients:createVersionFile
> Task :kafka-1.1-jdk7:clients:jar

> Task :kafka-1.1-jdk7:clients:compileTestJava
Note: <https://builds.apache.org/job/kafka-1.1-jdk7/ws/clients/src/test/java/org/apache/kafka/common/network/ChannelBuildersTest.java>
uses or overrides a deprecated API.
Note: Recompile with -Xlint:deprecation for details.
Note: Some input files use unchecked or unsafe operations.
Note: Recompile with -Xlint:unchecked for details.

> Task :kafka-1.1-jdk7:clients:processTestResources
> Task :kafka-1.1-jdk7:clients:testClasses
> Task :kafka-1.1-jdk7:core:compileJava NO-SOURCE
> Task :test_core_2_11

> Task :kafka-1.1-jdk7:core:compileScala
Pruning sources from previous analysis, due to incompatible CompileSetup.
<https://builds.apache.org/job/kafka-1.1-jdk7/ws/core/src/main/scala/kafka/api/OffsetCommitRequest.scala>:78:
value DEFAULT_TIMESTAMP in object OffsetCommitRequest is deprecated: see corresponding Javadoc
for more information.
            org.apache.kafka.common.requests.OffsetCommitRequest.DEFAULT_TIMESTAMP
                                                                 ^
<https://builds.apache.org/job/kafka-1.1-jdk7/ws/core/src/main/scala/kafka/common/OffsetMetadataAndError.scala>:36:
value DEFAULT_TIMESTAMP in object OffsetCommitRequest is deprecated: see corresponding Javadoc
for more information.
                             commitTimestamp: Long = org.apache.kafka.common.requests.OffsetCommitRequest.DEFAULT_TIMESTAMP,
                                                                                         
                ^
<https://builds.apache.org/job/kafka-1.1-jdk7/ws/core/src/main/scala/kafka/common/OffsetMetadataAndError.scala>:37:
value DEFAULT_TIMESTAMP in object OffsetCommitRequest is deprecated: see corresponding Javadoc
for more information.
                             expireTimestamp: Long = org.apache.kafka.common.requests.OffsetCommitRequest.DEFAULT_TIMESTAMP)
{
                                                                                         
                ^
<https://builds.apache.org/job/kafka-1.1-jdk7/ws/core/src/main/scala/kafka/coordinator/group/GroupMetadataManager.scala>:666:
value DEFAULT_TIMESTAMP in object OffsetCommitRequest is deprecated: see corresponding Javadoc
for more information.
        if (offsetAndMetadata.expireTimestamp == org.apache.kafka.common.requests.OffsetCommitRequest.DEFAULT_TIMESTAMP)
                                                                                         
            ^
<https://builds.apache.org/job/kafka-1.1-jdk7/ws/core/src/main/scala/kafka/server/KafkaConfig.scala>:716:
value SASL_ENABLED_MECHANISMS_DOC in object SaslConfigs is deprecated: see corresponding Javadoc
for more information.
  val SaslEnabledMechanismsDoc = SaslConfigs.SASL_ENABLED_MECHANISMS_DOC
                                             ^
<https://builds.apache.org/job/kafka-1.1-jdk7/ws/core/src/main/scala/kafka/server/KafkaApis.scala>:349:
value DEFAULT_TIMESTAMP in object OffsetCommitRequest is deprecated: see corresponding Javadoc
for more information.
              if (partitionData.timestamp == OffsetCommitRequest.DEFAULT_TIMESTAMP)
                                                                 ^
<https://builds.apache.org/job/kafka-1.1-jdk7/ws/core/src/main/scala/kafka/utils/Pool.scala>:59:
value computeIfAbsent is not a member of java.util.concurrent.ConcurrentMap[K,V]
    pool.computeIfAbsent(key, new java.util.function.Function[K, V] {
         ^
<https://builds.apache.org/job/kafka-1.1-jdk7/ws/core/src/main/scala/kafka/utils/Pool.scala>:59:
object function is not a member of package java.util
    pool.computeIfAbsent(key, new java.util.function.Function[K, V] {
                                            ^
6 warnings found
two errors found

> Task :kafka-1.1-jdk7:core:compileScala FAILED
> Task :test_core_2_11 FAILED

FAILURE: Build failed with an exception.

* What went wrong:
Execution failed for task ':kafka-1.1-jdk7:core:compileScala'.
> Compilation failed

* Try:
Run with --stacktrace option to get the stack trace. Run with --info or --debug option to
get more log output. Run with --scan to get full insights.

* Get more help at https://help.gradle.org

Deprecated Gradle features were used in this build, making it incompatible with Gradle 5.0.
See https://docs.gradle.org/4.8.1/userguide/command_line_interface.html#sec:command_line_warnings

BUILD FAILED in 1m 40s
22 actionable tasks: 14 executed, 8 up-to-date
Build step 'Execute shell' marked build as failure
[FINDBUGS] Collecting findbugs analysis files...
Setting GRADLE_3_5_HOME=/home/jenkins/tools/gradle/3.5
[FINDBUGS] Searching for all files in <https://builds.apache.org/job/kafka-1.1-jdk7/ws/>
that match the pattern **/build/reports/findbugs/*.xml
[FINDBUGS] No files found. Configuration error?
Setting GRADLE_3_5_HOME=/home/jenkins/tools/gradle/3.5
Setting GRADLE_3_5_HOME=/home/jenkins/tools/gradle/3.5
<Git Blamer> Using GitBlamer to create author and commit information for all warnings.
<Git Blamer> GIT_COMMIT=dc3acb065a62972b43988b6a26f1b85c12e648ad, workspace=<https://builds.apache.org/job/kafka-1.1-jdk7/ws/>
[FINDBUGS] Computing warning deltas based on reference build #151
Recording test results
Setting GRADLE_3_5_HOME=/home/jenkins/tools/gradle/3.5
ERROR: Step ?Publish JUnit test result report? failed: No test report files were found. Configuration
error?
Setting GRADLE_3_5_HOME=/home/jenkins/tools/gradle/3.5
Not sending mail to unregistered user ismael@juma.me.uk
Not sending mail to unregistered user wangguoz@gmail.com
Not sending mail to unregistered user lindong28@gmail.com

Mime
View raw message