kafka-dev mailing list archives

Site index · List index
Message view « Date » · « Thread »
Top « Date » · « Thread »
From Apache Jenkins Server <jenk...@builds.apache.org>
Subject Build failed in Jenkins: kafka-trunk-jdk10 #141
Date Sat, 26 May 2018 20:52:54 GMT
See <https://builds.apache.org/job/kafka-trunk-jdk10/141/display/redirect?page=changes>

Changes:

[jason] KAFKA-5697; Implement new consumer poll API from KIP-266 (#4855)

------------------------------------------
[...truncated 1.53 MB...]
kafka.zk.KafkaZkClientTest > testControllerManagementMethods STARTED

kafka.zk.KafkaZkClientTest > testControllerManagementMethods PASSED

kafka.zk.KafkaZkClientTest > testTopicAssignmentMethods STARTED

kafka.zk.KafkaZkClientTest > testTopicAssignmentMethods PASSED

kafka.zk.KafkaZkClientTest > testPropagateIsrChanges STARTED

kafka.zk.KafkaZkClientTest > testPropagateIsrChanges PASSED

kafka.zk.KafkaZkClientTest > testControllerEpochMethods STARTED

kafka.zk.KafkaZkClientTest > testControllerEpochMethods PASSED

kafka.zk.KafkaZkClientTest > testDeleteRecursive STARTED

kafka.zk.KafkaZkClientTest > testDeleteRecursive PASSED

kafka.zk.KafkaZkClientTest > testGetTopicPartitionStates STARTED

kafka.zk.KafkaZkClientTest > testGetTopicPartitionStates PASSED

kafka.zk.KafkaZkClientTest > testCreateConfigChangeNotification STARTED

kafka.zk.KafkaZkClientTest > testCreateConfigChangeNotification PASSED

kafka.zk.KafkaZkClientTest > testDelegationTokenMethods STARTED

kafka.zk.KafkaZkClientTest > testDelegationTokenMethods PASSED

kafka.javaapi.message.ByteBufferMessageSetTest > testSizeInBytesWithCompression STARTED

kafka.javaapi.message.ByteBufferMessageSetTest > testSizeInBytesWithCompression PASSED

kafka.javaapi.message.ByteBufferMessageSetTest > testIteratorIsConsistentWithCompression
STARTED

kafka.javaapi.message.ByteBufferMessageSetTest > testIteratorIsConsistentWithCompression
PASSED

kafka.javaapi.message.ByteBufferMessageSetTest > testIteratorIsConsistent STARTED

kafka.javaapi.message.ByteBufferMessageSetTest > testIteratorIsConsistent PASSED

kafka.javaapi.message.ByteBufferMessageSetTest > testEqualsWithCompression STARTED

kafka.javaapi.message.ByteBufferMessageSetTest > testEqualsWithCompression PASSED

kafka.javaapi.message.ByteBufferMessageSetTest > testWrittenEqualsRead STARTED

kafka.javaapi.message.ByteBufferMessageSetTest > testWrittenEqualsRead PASSED

kafka.javaapi.message.ByteBufferMessageSetTest > testEquals STARTED

kafka.javaapi.message.ByteBufferMessageSetTest > testEquals PASSED

kafka.javaapi.message.ByteBufferMessageSetTest > testSizeInBytes STARTED

kafka.javaapi.message.ByteBufferMessageSetTest > testSizeInBytes PASSED

kafka.javaapi.consumer.ZookeeperConsumerConnectorTest > testBasic STARTED

kafka.javaapi.consumer.ZookeeperConsumerConnectorTest > testBasic PASSED

kafka.metrics.MetricsTest > testMetricsReporterAfterDeletingTopic STARTED

kafka.metrics.MetricsTest > testMetricsReporterAfterDeletingTopic PASSED

kafka.metrics.MetricsTest > testSessionExpireListenerMetrics STARTED

kafka.metrics.MetricsTest > testSessionExpireListenerMetrics PASSED

kafka.metrics.MetricsTest > testBrokerTopicMetricsUnregisteredAfterDeletingTopic STARTED

kafka.metrics.MetricsTest > testBrokerTopicMetricsUnregisteredAfterDeletingTopic PASSED

kafka.metrics.MetricsTest > testClusterIdMetric STARTED

kafka.metrics.MetricsTest > testClusterIdMetric PASSED

kafka.metrics.MetricsTest > testControllerMetrics STARTED

kafka.metrics.MetricsTest > testControllerMetrics PASSED

kafka.metrics.MetricsTest > testWindowsStyleTagNames STARTED

kafka.metrics.MetricsTest > testWindowsStyleTagNames PASSED

kafka.metrics.MetricsTest > testBrokerTopicMetricsBytesInOut STARTED

kafka.metrics.MetricsTest > testBrokerTopicMetricsBytesInOut PASSED

kafka.metrics.KafkaTimerTest > testKafkaTimer STARTED

kafka.metrics.KafkaTimerTest > testKafkaTimer PASSED

kafka.security.auth.ResourceTypeTest > testJavaConversions STARTED

kafka.security.auth.ResourceTypeTest > testJavaConversions PASSED

kafka.security.auth.ResourceTypeTest > testFromString STARTED

kafka.security.auth.ResourceTypeTest > testFromString PASSED

kafka.security.auth.OperationTest > testJavaConversions STARTED

kafka.security.auth.OperationTest > testJavaConversions PASSED

kafka.security.auth.ZkAuthorizationTest > testIsZkSecurityEnabled STARTED

kafka.security.auth.ZkAuthorizationTest > testIsZkSecurityEnabled PASSED

kafka.security.auth.ZkAuthorizationTest > testZkUtils STARTED

kafka.security.auth.ZkAuthorizationTest > testZkUtils PASSED

kafka.security.auth.ZkAuthorizationTest > testZkAntiMigration STARTED

kafka.security.auth.ZkAuthorizationTest > testZkAntiMigration PASSED

kafka.security.auth.ZkAuthorizationTest > testZkMigration STARTED

kafka.security.auth.ZkAuthorizationTest > testZkMigration PASSED

kafka.security.auth.ZkAuthorizationTest > testChroot STARTED

kafka.security.auth.ZkAuthorizationTest > testChroot PASSED

kafka.security.auth.ZkAuthorizationTest > testDelete STARTED

kafka.security.auth.ZkAuthorizationTest > testDelete PASSED

kafka.security.auth.ZkAuthorizationTest > testDeleteRecursive STARTED

kafka.security.auth.ZkAuthorizationTest > testDeleteRecursive PASSED

kafka.security.auth.AclTest > testAclJsonConversion STARTED

kafka.security.auth.AclTest > testAclJsonConversion PASSED

kafka.security.auth.PermissionTypeTest > testJavaConversions STARTED

kafka.security.auth.PermissionTypeTest > testJavaConversions PASSED

kafka.security.auth.PermissionTypeTest > testFromString STARTED

kafka.security.auth.PermissionTypeTest > testFromString PASSED

kafka.security.auth.SimpleAclAuthorizerTest > testAllowAllAccess STARTED

kafka.security.auth.SimpleAclAuthorizerTest > testAllowAllAccess PASSED

kafka.security.auth.SimpleAclAuthorizerTest > testLocalConcurrentModificationOfResourceAcls
STARTED

kafka.security.auth.SimpleAclAuthorizerTest > testLocalConcurrentModificationOfResourceAcls
PASSED

kafka.security.auth.SimpleAclAuthorizerTest > testHighConcurrencyDeletionOfResourceAcls
STARTED

kafka.security.auth.SimpleAclAuthorizerTest > testHighConcurrencyDeletionOfResourceAcls
PASSED

kafka.security.auth.SimpleAclAuthorizerTest > testNoAclFound STARTED

kafka.security.auth.SimpleAclAuthorizerTest > testNoAclFound PASSED

kafka.security.auth.SimpleAclAuthorizerTest > testAclInheritance STARTED

kafka.security.auth.SimpleAclAuthorizerTest > testAclInheritance PASSED

kafka.security.auth.SimpleAclAuthorizerTest > testDistributedConcurrentModificationOfResourceAcls
STARTED

kafka.security.auth.SimpleAclAuthorizerTest > testDistributedConcurrentModificationOfResourceAcls
PASSED

kafka.security.auth.SimpleAclAuthorizerTest > testAclManagementAPIs STARTED

kafka.security.auth.SimpleAclAuthorizerTest > testAclManagementAPIs PASSED

kafka.security.auth.SimpleAclAuthorizerTest > testWildCardAcls STARTED

kafka.security.auth.SimpleAclAuthorizerTest > testWildCardAcls PASSED

kafka.security.auth.SimpleAclAuthorizerTest > testTopicAcl STARTED

kafka.security.auth.SimpleAclAuthorizerTest > testTopicAcl PASSED

kafka.security.auth.SimpleAclAuthorizerTest > testSuperUserHasAccess STARTED

kafka.security.auth.SimpleAclAuthorizerTest > testSuperUserHasAccess PASSED

kafka.security.auth.SimpleAclAuthorizerTest > testDenyTakesPrecedence STARTED

kafka.security.auth.SimpleAclAuthorizerTest > testDenyTakesPrecedence PASSED

kafka.security.auth.SimpleAclAuthorizerTest > testNoAclFoundOverride STARTED

kafka.security.auth.SimpleAclAuthorizerTest > testNoAclFoundOverride PASSED

kafka.security.auth.SimpleAclAuthorizerTest > testHighConcurrencyModificationOfResourceAcls
STARTED

kafka.security.auth.SimpleAclAuthorizerTest > testHighConcurrencyModificationOfResourceAcls
PASSED

kafka.security.auth.SimpleAclAuthorizerTest > testLoadCache STARTED

kafka.security.auth.SimpleAclAuthorizerTest > testLoadCache PASSED

kafka.security.token.delegation.DelegationTokenManagerTest > testPeriodicTokenExpiry STARTED

kafka.security.token.delegation.DelegationTokenManagerTest > testPeriodicTokenExpiry PASSED

kafka.security.token.delegation.DelegationTokenManagerTest > testTokenRequestsWithDelegationTokenDisabled
STARTED

kafka.security.token.delegation.DelegationTokenManagerTest > testTokenRequestsWithDelegationTokenDisabled
PASSED

kafka.security.token.delegation.DelegationTokenManagerTest > testDescribeToken STARTED

kafka.security.token.delegation.DelegationTokenManagerTest > testDescribeToken PASSED

kafka.security.token.delegation.DelegationTokenManagerTest > testCreateToken STARTED

kafka.security.token.delegation.DelegationTokenManagerTest > testCreateToken PASSED

kafka.security.token.delegation.DelegationTokenManagerTest > testExpireToken STARTED

kafka.security.token.delegation.DelegationTokenManagerTest > testExpireToken PASSED

kafka.security.token.delegation.DelegationTokenManagerTest > testRenewToken STARTED

kafka.security.token.delegation.DelegationTokenManagerTest > testRenewToken PASSED

1933 tests completed, 1 failed, 5 skipped

> Task :core:test FAILED

FAILURE: Build failed with an exception.

* What went wrong:
Execution failed for task ':core:test'.
> There were failing tests. See the report at: file://<https://builds.apache.org/job/kafka-trunk-jdk10/ws/core/build/reports/tests/test/index.html>

* Try:
Run with --stacktrace option to get the stack trace. Run with --info or --debug option to
get more log output. Run with --scan to get full insights.

* Get more help at https://help.gradle.org

BUILD FAILED in 1h 43m 52s
37 actionable tasks: 36 executed, 1 up-to-date
Build step 'Execute shell' marked build as failure
Recording test results
Setting GRADLE_4_4_HOME=/home/jenkins/tools/gradle/4.4
Setting GRADLE_4_4_HOME=/home/jenkins/tools/gradle/4.4

Mime
View raw message